﻿"Item Id","Item URI","Dublin Core:Title","Dublin Core:Description","Dublin Core:Creator","Dublin Core:Publisher","Dublin Core:Coverage","Dublin Core:Date","Dublin Core:Rights","Dublin Core:Type","Dublin Core:Format","Dublin Core:Source","Dublin Core:Subject","Dublin Core:Contributor","Dublin Core:Relation","Dublin Core:Language","Dublin Core:Identifier","Item Type Metadata:Occupation","Item Type Metadata:Participants","Item Type Metadata:Death Date","Item Type Metadata:Birthplace","Item Type Metadata:Birth Date","Item Type Metadata:Interviewer","Item Type Metadata:Biographical Text","Item Type Metadata:Bibliography","Item Type Metadata:Page numeration","Item Type Metadata:Resolution","Item Type Metadata:Identifier","Item Type Metadata:Inventory","Item Type Metadata:URL","Item Type Metadata:Text","Item Type Metadata:Interviewee","Item Type Metadata:Location","Item Type Metadata:Transcription","Item Type Metadata:Local URL","Item Type Metadata:Original Format","Item Type Metadata:Physical Dimensions","Item Type Metadata:Duration","Item Type Metadata:Compression","Item Type Metadata:Producer","Item Type Metadata:Director","Item Type Metadata:Bit Rate/Frequency","Item Type Metadata:Email Body","Item Type Metadata:Event Type","Item Type Metadata:Lesson Plan Text","Item Type Metadata:Materials","Item Type Metadata:Objectives","Item Type Metadata:Standards","Item Type Metadata:Number of Attachments","Item Type Metadata:BCC","Item Type Metadata:CC","Item Type Metadata:To","Item Type Metadata:From","Item Type Metadata:Subject Line","Item Type Metadata:Time Summary","Item Type Metadata:Episode","Item Type Metadata:Season","Item Type Metadata:Episode Type","Item Type Metadata:Explicit","Item Type Metadata:Block","PDF Text:Text",tags,file,itemType,collection,public,featured
6181,https://digitalarchives.sjc.edu/items/show/6181,"McDowell Hall and the Liberty Tree, St. John's College, Annapolis, Maryland","1 Polaroid print : b&w",Unknown,,"Annapolis, MD","1900-1910 [circa]","St. John's College owns the rights to this photograph.","Still Image",jpeg,,,,,,SJC-P-2394,,,,,,,,,,,,,,,,,,,Photograph,"9 x 12.5 cm.",,,,,,,,,,,,,,,,,,,,,,,,,"Liberty tree,McDowell Hall",https://s3.us-east-1.amazonaws.com/sjcdigitalarchives/original/24b5f24b8e96422a4b9d4e8914a3db4a.jpg,"Still Image","Photographic Archive—Annapolis",1,0
5972,https://digitalarchives.sjc.edu/items/show/5972,"McDowell Hall during the Fire of 1909, St. John's College, Annapolis, Maryland","1 photographic print : b&w",Unknown,,"Annapolis, MD","1909 [circa]","St. John's College owns the rights to this photograph.","Still Image",jpeg,,"McDowell Hall (St. John's College, Annapolis, MD)",,,,SJC-P-2203,,,,,,,,,,,,,,,,,,,Photograph,"25.5 x 20.5 cm.",,,,,,,,,,,,,,,,,,,,,,,,,"McDowell Hall",https://s3.us-east-1.amazonaws.com/sjcdigitalarchives/original/62adf6c96852d27ea5022dcd825416c6.jpg,"Still Image","Photographic Archive—Annapolis",1,0
4264,https://digitalarchives.sjc.edu/items/show/4264,"McDowell Hall on Fire, St. John's College, Annapolis, Maryland","1 photographic print : b&w","Boyer, W. E.",,"Annapolis, MD",1909-02-20,"St. John's College owns the rights to this photograph.","still image",jpeg,,"St. John's College (Annapolis, Md.). -- McDowell Hall -- 1909.",,,,SJC-P-0344,,,,,,,,,,,,,,,,,,,photograph,"image 17 x 11.5 cm.",,,,,,,,,,,,,,,,,,,,,,,,,"McDowell Hall",https://s3.us-east-1.amazonaws.com/sjcdigitalarchives/original/edd2a0cc00023888552b3c5a74e61642.jpg,"Still Image","Photographic Archive—Annapolis",1,0
103,https://digitalarchives.sjc.edu/items/show/103,"McDowell Hall with Cupola in Fall, St. John's College, Annapolis, Maryland","1 photographic print : color ",Unknown,,"Annapolis, MD","1954 [circa]","St. John's College owns the rights to this photograph.","still image",jpeg,,,,,,SJC-P-2366,,,,,,,,,,"600 dpi",,,,,,,,,photograph," 18 x 23 cm.",,,,,,,,,,,,,,,,,,,,,,,,,"McDowell Hall",https://s3.us-east-1.amazonaws.com/sjcdigitalarchives/original/2aaf330516566ae2cc4c90c7ab2a9eda.jpg,"Still Image","Photographic Archive—Annapolis",1,1
5949,https://digitalarchives.sjc.edu/items/show/5949,"McDowell Hall with Cupola, St. John's College, Annapolis, Maryland","1 photographic print : b&w",Unknown,,"Annapolis, MD",,"St. John's College owns the rights to this photograph.","Still Image",jpeg,,"McDowell Hall (St. John's College, Annapolis, MD)",,,,SJC-P-2161,,,,,,,,,,,,,,,,,,,Photograph,"25.5 x 20.5 cm.",,,,,,,,,,,,,,,,,,,,,,,,,"McDowell Hall",https://s3.us-east-1.amazonaws.com/sjcdigitalarchives/original/7733d7ab4f11d9a62b9d3d24093c72b4.jpg,"Still Image","Photographic Archive—Annapolis",1,0
6162,https://digitalarchives.sjc.edu/items/show/6162,"McDowell Hall with Cupola, St. John's College, Annapolis, Maryland","1 photographic print : b&w",Unknown,,"Annapolis, MD","1900-1910 [circa]","St. John's College owns the rights to this photograph.","Still Image",jpeg,,,,,,SJC-P-2375,,,,,,,,,,,,,,,,,,,Photograph,"20.5 x 25.5 cm.",,,,,,,,,,,,,,,,,,,,,,,,,"McDowell Hall",https://s3.us-east-1.amazonaws.com/sjcdigitalarchives/original/efc537c16661f3068bba140ede01717a.jpg,"Still Image","Photographic Archive—Annapolis",1,0
6164,https://digitalarchives.sjc.edu/items/show/6164,"McDowell Hall with Cupola, St. John's College, Annapolis, Maryland","1 photographic print : b&w",Unknown,,"Annapolis, MD","1900-1910 [circa]","St. John's College owns the rights to this photograph.","Still Image",jpeg,,,,,,SJC-P-2377,,,,,,,,,,,,,,,,,,,Photograph,"25.5 x 20.5 cm.",,,,,,,,,,,,,,,,,,,,,,,,,"McDowell Hall",https://s3.us-east-1.amazonaws.com/sjcdigitalarchives/original/258b6336fd42c83c6bc6ee5247a301dd.jpg,"Still Image","Photographic Archive—Annapolis",1,0
6177,https://digitalarchives.sjc.edu/items/show/6177,"McDowell Hall,  Humphreys Hall, and Paca-Carroll House, St. John's College, Annapolis, Maryland","1 photographic print : b&w",Unknown,,"Annapolis, MD",,"St. John's College owns the rights to this photograph.","Still Image",jpeg,,,,,,SJC-P-2390,,,,,,,,,,,,,,,,,,,Photograph,"25.5 x 20.5 cm.",,,,,,,,,,,,,,,,,,,,,,,,,"Humphreys Hall,McDowell Hall,Paca-Carroll House",https://s3.us-east-1.amazonaws.com/sjcdigitalarchives/original/ceba5f40106673f3d503d98e87454e0e.jpg,"Still Image","Photographic Archive—Annapolis",1,0
6161,https://digitalarchives.sjc.edu/items/show/6161,"McDowell Hall, Woodward Hall and Front Campus, St. John's College, Annapolis, Maryland","1 photographic print : b&w",Unknown,,"Annapolis, MD","1900-1910 [circa]","St. John's College owns the rights to this photograph.","Still Image",jpeg,,,,,,SJC-P-2374,,,,,,,,,,,,,,,,,,,Photograph,"25.5 x 20.5 cm.",,,,,,,,,,,,,,,,,,,,,,,,,"McDowell Hall,Woodward Library",https://s3.us-east-1.amazonaws.com/sjcdigitalarchives/original/535bfbd18c0b53a06bb750d1329945e2.jpg,"Still Image","Photographic Archive—Annapolis",1,0
1753,https://digitalarchives.sjc.edu/items/show/1753,"McKee G. Lee and Joel J. Barlow Having Coffee with President Richard D. Weigle in Richard D. Weigle's Office, St. John's College, Annapolis, Maryland","1 photographic print : b&w.  Left to right: President Richard D. Weigle,  McKee G. Lee, and Joel J. Barlow.","Camenga, Barbara",,"Annapolis, MD",1972,"St. John's College owns the rights to this photograph.","still image",pdf,,"St. John's College (Annapolis, Md.). -- Presidents. ;  St. John's College (Santa Fe, N. M.). -- Presidents. ;  St. John's College (Annapolis, Md.). -- Students.",,,,SJC-P-0310,,,,,,,,,,,,,,,,,,,photograph,"22 x 16 cm.",,,,,,,,,,,,,,,,,,,,,,,,,Alumni,https://s3.us-east-1.amazonaws.com/sjcdigitalarchives/original/03f428eebecc169360555cb3b8f02cae.jpg,"Still Image","Photographic Archive—Annapolis",1,0
6721,https://digitalarchives.sjc.edu/items/show/6721,"Meet your new best friend : the square root of negative one","Transcript of a lecture given on September 11, 2019 by Grant Franks as part of the Dean's Lecture and Concert Series.","Franks, Grant H.","St. John's College","Santa Fe, NM",2019-09-11,"Meem Library has been given permission to make this item available online.",text,pdf,,Algebra,,,English,SF_FranksG_Meet_Your_New_Best_Friend_The_Square_Root_of_Negative_One_2019-09-11,,,,,,,,,"18 pages",,,,,,,,,,pdf,,,,,,,,,,,,,,,,,,,,,,,,,,,https://s3.us-east-1.amazonaws.com/sjcdigitalarchives/original/19d3ad04ce55bbde7c5555119c349471.pdf,Text,"St. John's College Lecture Transcripts—Santa Fe",1,0
4282,https://digitalarchives.sjc.edu/items/show/4282,"Meeting in the Great Hall in McDowell Hall, St. John's College, Annapolis, Maryland","1 photographic print : b&w",Unknown,,"Annapolis, MD","1937-1950 [circa]","St. John's College owns the rights to this photograph.","still image",jpeg,,"St. John's College (Annapolis, Md.). -- McDowell Hall -- Great Hall -- 1940-1950.",,,,SJC-P-0367,,,,,,,,,,,,,,,,,,,photograph,"10 x 7 cm.",,,,,,,,,,,,,,,,,,,,,,,,,"Great Hall,McDowell Hall",https://s3.us-east-1.amazonaws.com/sjcdigitalarchives/original/d497a9958e237b137b13eb30d1d12427.jpg,"Still Image","Photographic Archive—Annapolis",1,0
5650,https://digitalarchives.sjc.edu/items/show/5650,"Mellon Hall;  Richard D. Weigle and Alumni during Homecoming, Annapolis, Maryland","1 sheet : 8 photographic prints : b&w",Unknown,,"Annapolis, MD",,"St. John's College owns the rights to this photograph.","Still Image",jpeg,,"Weigle, Richard Daniel 1912-",,,,SJC-P-1715,,,,,,,,,,,,,,,,,,,Photograph,"20.5 x 25.5 cm.",,,,,,,,,,,,,,,,,,,,,,,,,"Alumni,Honorary Alumni,Mellon Hall,Presidents",https://s3.us-east-1.amazonaws.com/sjcdigitalarchives/original/bd4ab99f3fe2aa2644bed3e9b77e17fc.jpg,"Still Image","Photographic Archive—Annapolis",1,0
57,https://digitalarchives.sjc.edu/items/show/57,"Melodies and Faces: A <em>Meno</em> Meditation","Audio recording of a lecture delivered on November 2, 2012, by David Stephenson as part of the Formal Lecture Series. ","Stephenson, David Hanford","St. John's College","Annapolis, MD",2012-11-02,"A signed permission form has been received stating, ""I hereby grant St. John's College permission to: Make an audio recording of my lecture, and retain copies for circulation and archival preservation in the St. John's College Greenfield Library.  Make an audio recording of my lecture available online.  Make a typescript copy of my lecture available for circulation and archival preservation in the St. John's College Greenfield Library.  Make a copy of my typescript available online.""",sound,mp3,,"Plato. Meno; Learning",,"<a title=""Typescript"" href=""http://digitalarchives.sjc.edu/items/show/58"">Typescript</a>",English,LEC_Stephenson_David_2012-11-02_ac,,,,,,,,,,,,,,,,,,,CD,,01:00:31,,,,,,,,,,,,,,,,,,,,,,,,"Friday night lecture",https://s3.us-east-1.amazonaws.com/sjcdigitalarchives/original/bc11adaf741c26ae8787a32c7cfdc1ce.mp3,Sound,"St. John's College Formal Lecture Series—Annapolis",1,0
58,https://digitalarchives.sjc.edu/items/show/58,"Melodies and Faces: A <em>Meno</em> Meditation","Typescript of a lecture delivered on November 2, 2012, by David Stephenson as part of the Formal Lecture Series. ","Stephenson, David Hanford","St. John's College","Annapolis, MD",2012-11-02,"A signed permission form has been received stating, ""I hereby grant St. John's College permission to: Make an audio recording of my lecture, and retain copies for circulation and archival preservation in the St. John's College Greenfield Library.  Make an audio recording of my lecture available online.  Make a typescript copy of my lecture available for circulation and archival preservation in the St. John's College Greenfield Library.  Make a copy of my typescript available online.""",text,pdf,,"Plato, Meno; Learning",,"<a title=""Audio recording"" href=""http://digitalarchives.sjc.edu/items/show/57"">Audio recording</a>",English,"Bib # 80766",,,,,,,,,"16 pages",,,,,,,,,,paper,,,,,,,,,,,,,,,,,,,,,,,,,,"Friday night lecture",https://s3.us-east-1.amazonaws.com/sjcdigitalarchives/original/f3d57d059c1b0eb58f38e28063913d62.pdf,Text,"St. John's College Formal Lecture Series—Annapolis",1,0
3620,https://digitalarchives.sjc.edu/items/show/3620,"Memoirs of Deceased Alumni, 1856","Memoirs of deceased alumni of St. John's College.  Read, by appointment of the Association, August 6th, 1856, by John G. Proud, Jr., A. M.  To which is added a register of St. John's College, for 1856.","Proud, Jr., A.M., John G.","Robert F. Bonsall, Printer","Annapolis, MD",1856-08-06,"St. John's College owns the rights to this publication.",text,pdf,,,"Watkins, M.D. Tobias; Dorsey, Thomas Beale; Ridout, M.D., Samuel","<a title=""Commencement Address"" href=""http://digitalarchives.sjc.edu/items/show/3619"">Commencement Address</a>",English,"Register and Memoirs of Deceased Alumni of St. John's College by John G. Proud 1856-08-06",,,,,,,,,"14 pages",,,,,,,,,,paper,,,,,,,,,,,,,,,,,,,,,,,,,,"Alumni,Commencement",https://s3.us-east-1.amazonaws.com/sjcdigitalarchives/original/3fcdcd4d51bf24fb4b98e2e3ac7e7d4f.pdf,Text,"Commencement Programs and Addresses",1,0
3601,https://digitalarchives.sjc.edu/items/show/3601,"Memoirs of Deceased Alumni, 1878","Memoirs of deceased alumni of St. John's College, Annapolis, by John G. Proud and John S. Wirt, historiographers.  Commencement Day, 1878.","Proud, John G.; Wirt, John S.","William K. Boyle, Printer","Baltimore, MD",1878,"St. John's College owns the rights to this publication.",text,pdf,,,,,English,"Commencement Address-Memoirs of Deceased Alumni -John G. Proud and John S. Wirt. Proud and John S. Wirt",,,,,,,,,"32 pages",,,,,,,,,,paper,,,,,,,,,,,,,,,,,,,,,,,,,,"Alumni,Commencement",https://s3.us-east-1.amazonaws.com/sjcdigitalarchives/original/930925781d487e41b620d7c104a79f09.pdf,Text,"Commencement Programs and Addresses",1,0
7346,https://digitalarchives.sjc.edu/items/show/7346,"Memorial for Elliott Zuckerman","Memorial service for Annapolis Tutor Elliott Zuckerman, October 27, 2019.  The program includes musical tributes and eulogies by Jamie Young, Kirk Duncan, Dylan Knight Rogers, Eric Stoltzfus, Eva Brann, Christopher Nelson, Chester Burke, James Siranovich, Jonathan Tuck, Zena Hitz, Howard Zeiderman, and the St. John's College Ensemble.  ","Young, Jamie Zuckerman; Duncan, Kirk; Rogers, Dylan Knight; Brann, Eva T. H.; Stoltzfus, Eric; Nelson, Christopher B., 1948-; Burke, Chester; Siranovich, James; Tuck, Jonathan; Hitz, Zena, 1973-; Zeiderman, Howard","St. John's College","Annapolis, MD",2019-10-27,"Signed permission forms have been received stating, ""I hereby grant St. John's College permission to make an audio recording of my lecture, and retain copies for circulation and archival preservation at the St. John's College Greenfield Library and to make an audio recording of my lecture available online.""",sound,mp3,,"Zuckerman, Elliott; Eulogies; Music","Abbott, Robert Charles, Jr.",,English,Zuckerman_Elliott_MemorialService_2019-10-27,,,,,,,,,,,,,,,,,,,mp3,,01:20:38,,,,,,,,,,,,,,,,,,,,,,,,Tutors,https://s3.us-east-1.amazonaws.com/sjcdigitalarchives/original/071884928c03ae207de14a3f374811b2.mp3,Sound,"Speeches, presentations, and other lectures",1,0
5894,https://digitalarchives.sjc.edu/items/show/5894,"Memorial Page for William Raymond Bowlus from the 1915 Rat-Tat, St. John's College, Annapolis, Maryland","1 photographic copy of page from the 1915 Rat-Tat : b&w",Unknown,,"Annapolis, MD",1915,"St. John's College owns the rights to this photograph.","Still Image",jpeg,,"Bowlus, William Raymond",,,,SJC-P-2092,,,,,,,,,,,,,,,,,,,Photograph,"20.5 x 25.5 cm.",,,,,,,,,,,,,,,,,,,,,,,,,Alumni,https://s3.us-east-1.amazonaws.com/sjcdigitalarchives/original/3422783f170113dcca701765a9f7a21c.jpg,"Still Image","Photographic Archive—Annapolis",1,0
753,https://digitalarchives.sjc.edu/items/show/753,"Memorial to a woman with an alabaster jar : speculations on Matthew 24 to 26","Transcript of a lecture given in 1998 by John Cornell.","Cornell, John F.","St. John's College","Santa Fe, NM",1998,"Meem Library has been given permission to make this item available online.",Text,pdf,,"Bible. Matthew -- Criticism, interpretation, etc.; Poetry",,,English,24000471,,,,,,,,,"24 pages",,,,,,,,,,paper,,,,,,,,,,,,,,,,,,,,,,,,,,,https://s3.us-east-1.amazonaws.com/sjcdigitalarchives/original/5b72b61057ff88194b4ab48e75d38d3b.pdf,Text,"St. John's College Lecture Transcripts—Santa Fe",1,0
