﻿"Item Id","Item URI","Dublin Core:Title","Dublin Core:Description","Dublin Core:Creator","Dublin Core:Publisher","Dublin Core:Coverage","Dublin Core:Date","Dublin Core:Rights","Dublin Core:Type","Dublin Core:Format","Dublin Core:Source","Dublin Core:Subject","Dublin Core:Contributor","Dublin Core:Relation","Dublin Core:Language","Dublin Core:Identifier","Item Type Metadata:Occupation","Item Type Metadata:Participants","Item Type Metadata:Death Date","Item Type Metadata:Birthplace","Item Type Metadata:Birth Date","Item Type Metadata:Interviewer","Item Type Metadata:Biographical Text","Item Type Metadata:Bibliography","Item Type Metadata:Page numeration","Item Type Metadata:Resolution","Item Type Metadata:Identifier","Item Type Metadata:Inventory","Item Type Metadata:URL","Item Type Metadata:Text","Item Type Metadata:Interviewee","Item Type Metadata:Location","Item Type Metadata:Transcription","Item Type Metadata:Local URL","Item Type Metadata:Original Format","Item Type Metadata:Physical Dimensions","Item Type Metadata:Duration","Item Type Metadata:Compression","Item Type Metadata:Producer","Item Type Metadata:Director","Item Type Metadata:Bit Rate/Frequency","Item Type Metadata:Email Body","Item Type Metadata:Event Type","Item Type Metadata:Lesson Plan Text","Item Type Metadata:Materials","Item Type Metadata:Objectives","Item Type Metadata:Standards","Item Type Metadata:Number of Attachments","Item Type Metadata:BCC","Item Type Metadata:CC","Item Type Metadata:To","Item Type Metadata:From","Item Type Metadata:Subject Line","Item Type Metadata:Time Summary","Item Type Metadata:Episode","Item Type Metadata:Season","Item Type Metadata:Episode Type","Item Type Metadata:Explicit","Item Type Metadata:Block","PDF Text:Text",tags,file,itemType,collection,public,featured
4998,https://digitalarchives.sjc.edu/items/show/4998,"Students with a Model of the Five Platonic Solids in the King William Room","1 photographic print : b&w","Garrett, Clarence B.",,"Annapolis, MD",,"St. John's College owns the rights to this photograph.","Still Image",jpeg,,"St. John's College (Annapolis, Md.). -- Students.",,,,SJC-P-0931,,,,,,,,,,,,,,,,,,,Photograph,"25.5 x 20.5 cm.",,,,,,,,,,,,,,,,,,,,,,,,,,https://s3.us-east-1.amazonaws.com/sjcdigitalarchives/original/daa465b4872b0fdf544ecdd4c448ee10.jpg,"Still Image","Photographic Archive—Annapolis",1,0
4997,https://digitalarchives.sjc.edu/items/show/4997,"Scott M. Buchanan, Raymond N. Wilburn and Nicolas Nabokov Seated Drinking Tea","1 photographic print : b&w",Unknown,,"Annapolis, MD","1940 [circa]","St. John's College owns the rights to this photograph.","Still Image",jpeg,,"Buchanan, Scott Milross, 1895-1968;  Wilburn, Raymond N.; Nabokov, Nicolas, 1903-1978",,,,SJC-P-0930,,,,,,,,,,,,,,,,,,,Photograph,"25.5 x 20.5 cm.",,,,,,,,,,,,,,,,,,,,,,,,,"Alumni,Deans,Honorary Alumni",https://s3.us-east-1.amazonaws.com/sjcdigitalarchives/original/e92a60e3a1e0ebec8bd103ebc1d02594.jpg,"Still Image","Photographic Archive—Annapolis",1,0
4996,https://digitalarchives.sjc.edu/items/show/4996,"Group Portrait of St. John's College Students near State Circle the Morning after the June Ball, Annapolis, Maryland","1 photographic print : b&w",Unknown,,"Annapolis, MD",,"St. John's College owns the rights to this photograph.","Still Image",jpeg,,"Group Portraits ;  St. John's College (Annapolis, Md.). -- Students.",,,,SJC-P-0929,,,,,,,,,,,,,,,,,,,Photograph,"25.5 x 20.5 cm.",,,,,,,,,,,,,,,,,,,,,,,,,,https://s3.us-east-1.amazonaws.com/sjcdigitalarchives/original/41326667ef3eddc362d470ce05e15139.jpg,"Still Image","Photographic Archive—Annapolis",1,0
4995,https://digitalarchives.sjc.edu/items/show/4995,"Richard D. Weigle in Academic Robe and Student at Convocation, Annapolis, Maryland","1 photographic print : b&w",Unknown,,"Annapolis, MD","1949-08 [circa]","St. John's College owns the rights to this photograph.","Still Image",jpeg,,"St. John's College (Annapolis, Md.). -- Presidents. ;  St. John's College (Santa Fe, N. M.). -- Presidents. ;  Weigle, Richard Daniel 1912-",,,,SJC-P-0926,,,,,,,,,,,,,,,,,,,Photograph,"25.5 x 20.5 cm.",,,,,,,,,,,,,,,,,,,,,,,,,Convocation,https://s3.us-east-1.amazonaws.com/sjcdigitalarchives/original/338db3811d49db50a647a36720181746.jpg,"Still Image","Photographic Archive—Annapolis",1,0
4994,https://digitalarchives.sjc.edu/items/show/4994,"Robert G. Hazo and John D. Oosterhout Playing Baseball by Iglehart Hall","1 photographic print : b&w","Warren, M. E.",,"Annapolis, MD","1950-1954 [circa]","St. John's College owns the rights to this photograph.","Still Image",jpeg,,"Hazo, Robert G.;  Oosterhout, John D.",,,,SJC-P-0925,,,,,,,,,,,,,,,,,,,Photograph,"25.5 x 20.5 cm.",,,,,,,,,,,,,,,,,,,,,,,,,"Alumni,Iglehart Hall",https://s3.us-east-1.amazonaws.com/sjcdigitalarchives/original/398929e74a01d79becb714de2d7e7fe7.jpg,"Still Image","Photographic Archive—Annapolis",1,0
4993,https://digitalarchives.sjc.edu/items/show/4993,"Bernard E. Jacob and Barbara Dvorak (Winiarski) Discuss a Drawing","1 photographic print : b&w","Marx, Hans",,"Annapolis, MD","1954 [circa]","St. John's College owns the rights to this photograph.","Still Image",jpeg,,"Jacob, Bernard E.; Dvorak, Barbara",,,,SJC-P-0924,,,,,,,,,,,,,,,,,,,Photograph,"17.5 x 21.5 cm.",,,,,,,,,,,,,,,,,,,,,,,,,Alumni,https://s3.us-east-1.amazonaws.com/sjcdigitalarchives/original/e0be5caf1a84937a92fae545edde7070.jpg,"Still Image","Photographic Archive—Annapolis",1,0
4992,https://digitalarchives.sjc.edu/items/show/4992,"Commencement Procession, a View from McDowell Hall, Annapolis, Maryland, 1948","1 photographic print : b&w",Unknown,,"Annapolis, MD","1948-05 [circa]","St. John's College owns the rights to this photograph.","Still Image",jpeg,,"Commencement (St. John's College, Annapolis, MD)",,,,SJC-P-0918,,,,,,,,,,,,,,,,,,,Photograph,"25.5 x 20.5 cm.",,,,,,,,,,,,,,,,,,,,,,,,,"Commencement,McDowell Hall",https://s3.us-east-1.amazonaws.com/sjcdigitalarchives/original/1a2265e0f64fe36b5159b0c060115b8e.jpg,"Still Image","Photographic Archive—Annapolis",1,0
4991,https://digitalarchives.sjc.edu/items/show/4991,"Commencement Procession on Front Campus, Annapolis, Maryland, 1948","1 photographic print : b&w",Unknown,,"Annapolis, MD","1948-05 [circa]","St. John's College owns the rights to this photograph.","Still Image",jpeg,,"Commencement (St. John's College, Annapolis, MD)",,,,SJC-P-0917,,,,,,,,,,,,,,,,,,,Photograph,"25.5 x 20.5 cm.",,,,,,,,,,,,,,,,,,,,,,,,,Commencement,https://s3.us-east-1.amazonaws.com/sjcdigitalarchives/original/6314794b45dcafba0e99270e8225b7c3.jpg,"Still Image","Photographic Archive—Annapolis",1,0
4990,https://digitalarchives.sjc.edu/items/show/4990,"Commencement Procession on Front Campus, Annapolis, Maryland, 1948","1 photographic print : b&w",Unknown,,"Annapolis, MD","1948-05 [circa]","St. John's College owns the rights to this photograph.","Still Image",jpeg,,"Commencement (St. John's College, Annapolis, MD)",,,,SJC-P-0916,,,,,,,,,,,,,,,,,,,Photograph,"25.5 x 20.5 cm.",,,,,,,,,,,,,,,,,,,,,,,,,Commencement,https://s3.us-east-1.amazonaws.com/sjcdigitalarchives/original/3926a3dbce5861c313e57f73f3e25e51.jpg,"Still Image","Photographic Archive—Annapolis",1,0
4989,https://digitalarchives.sjc.edu/items/show/4989,"Commencement Procession near McDowell Hall, Annapolis, Maryland, 1948","1 photographic print : b&w",Unknown,,"Annapolis, MD","1948-05 [circa]","St. John's College owns the rights to this photograph.","Still Image",jpeg,,"Commencement (St. John's College, Annapolis, MD)",,,,SJC-P-0915,,,,,,,,,,,,,,,,,,,Photograph,"25.5 x 20.5 cm.",,,,,,,,,,,,,,,,,,,,,,,,,"Commencement,McDowell Hall",https://s3.us-east-1.amazonaws.com/sjcdigitalarchives/original/bb22e65e5f47fc787311362045606254.jpg,"Still Image","Photographic Archive—Annapolis",1,0
4988,https://digitalarchives.sjc.edu/items/show/4988,"Commencement under the Liberty Tree, Annapolis, Maryland, 1948","1 photographic print : b&w",Unknown,,"Annapolis, MD","1948-05 [circa]","St. John's College owns the rights to this photograph.","Still Image",jpeg,,"Commencement (St. John's College, Annapolis, MD)",,,,SJC-P-0914,,,,,,,,,,,,,,,,,,,Photograph,"25.5 x 20.5 cm.",,,,,,,,,,,,,,,,,,,,,,,,,"Commencement,Liberty tree",https://s3.us-east-1.amazonaws.com/sjcdigitalarchives/original/4be7e1daddc362264874a66f2e2ca1cf.jpg,"Still Image","Photographic Archive—Annapolis",1,0
4987,https://digitalarchives.sjc.edu/items/show/4987,"Commencement Procession near Liberty Tree, Annapolis, Maryland, 1948","1 photographic print : b&w",Unknown,,"Annapolis, MD","1948-05 [circa]","St. John's College owns the rights to this photograph.","Still Image",jpeg,,"Commencement (St. John's College, Annapolis, MD)",,,,SJC-P-0913,,,,,,,,,,,,,,,,,,,Photograph,"25.5 x 20.5 cm.",,,,,,,,,,,,,,,,,,,,,,,,,"Commencement,Liberty tree",https://s3.us-east-1.amazonaws.com/sjcdigitalarchives/original/d020d20e4467e8653104348e64b9c7cd.jpg,"Still Image","Photographic Archive—Annapolis",1,0
4986,https://digitalarchives.sjc.edu/items/show/4986,"A Speaker in Academic Robe at Commencement under the Liberty Tree, Annapolis, Maryland, 1948","1 photographic print : b&w",Unknown,,"Annapolis, MD","1948-05 [circa]","St. John's College owns the rights to this photograph.","Still Image",jpeg,,"Commencement (St. John's College, Annapolis, MD)",,,,SJC-P-0912,,,,,,,,,,,,,,,,,,,Photograph,"25.5 x 20.5 cm.",,,,,,,,,,,,,,,,,,,,,,,,,Commencement,https://s3.us-east-1.amazonaws.com/sjcdigitalarchives/original/53949bd0eec54952caee4baaa361103a.jpg,"Still Image","Photographic Archive—Annapolis",1,0
4985,https://digitalarchives.sjc.edu/items/show/4985,"Group Portrait of the St. John's College Class of  1949, Annapolis, Maryland","1 photographic print : b&w",Unknown,,"Annapolis, MD","1947-1949 [circa]","St. John's College owns the rights to this photograph.","Still Image",jpeg,,"Group Portraits ;  St. John's College (Annapolis, Md.). -- Students.",,,,SJC-P-0911,,,,,,,,,,,,,,,,,,,Photograph,"25.5 x 20.5 cm.",,,,,,,,,,,,,,,,,,,,,,,,,,https://s3.us-east-1.amazonaws.com/sjcdigitalarchives/original/ecf5f904cb5ec2ce443a62504b4d909c.jpg,"Still Image","Photographic Archive—Annapolis",1,0
4984,https://digitalarchives.sjc.edu/items/show/4984,"The Wooden Frame of a Large Boat","1 photographic print : b&w",Unknown,,"Annapolis, MD","1941 [circa]","St. John's College owns the rights to this photograph.","Still Image",jpeg,,,,,,SJC-P-0910,,,,,,,,,,,,,,,,,,,Photograph,"23.5 x 16 cm.",,,,,,,,,,,,,,,,,,,,,,,,,,https://s3.us-east-1.amazonaws.com/sjcdigitalarchives/original/43c106bfce3530cbb54219ed5f78a1ae.jpg,"Still Image","Photographic Archive—Annapolis",1,0
4983,https://digitalarchives.sjc.edu/items/show/4983,"Students from the St. John's College Class of 1950 Walking on Front Campus, Annapolis, Maryland","1 photographic print : b&w",Unknown,,"Annapolis, MD","1950 [circa]","St. John's College owns the rights to this photograph.","Still Image",jpeg,,,,,,SJC-P-0909,,,,,,,,,,,,,,,,,,,Photograph,"17 x 20 cm.",,,,,,,,,,,,,,,,,,,,,,,,,,https://s3.us-east-1.amazonaws.com/sjcdigitalarchives/original/fc6f05b32b1771301befe2061d7bbf3d.jpg,"Still Image","Photographic Archive—Annapolis",1,0
4982,https://digitalarchives.sjc.edu/items/show/4982,"Jacob Klein in Academic Robes Approaching the Podium at Commencement, Annapolis, Mayland, 1947","1 photographic print : b&w",Unknown,,"Annapolis, MD",1947-06,"St. John's College owns the rights to this photograph.","Still Image",jpeg,,"Commencement (St. John's College, Annapolis, MD) ;  Klein, Jacob, 1899-1978.",,,,SJC-P-0908,,,,,,,,,,,,,,,,,,,Photograph,"25.5 x 20.5 cm.",,,,,,,,,,,,,,,,,,,,,,,,,Commencement,https://s3.us-east-1.amazonaws.com/sjcdigitalarchives/original/299389b1e0d1cc3fbf8724adcedeae60.jpg,"Still Image","Photographic Archive—Annapolis",1,0
4981,https://digitalarchives.sjc.edu/items/show/4981,"Graduates in Academic Robes at Commencement, Annapolis, Maryland, 1947","1 photographic print : b&w",Unknown,,"Annapolis, MD",1947-06,"St. John's College owns the rights to this photograph.","Still Image",jpeg,,"Commencement (St. John's College, Annapolis, MD)",,,,SJC-P-0907,,,,,,,,,,,,,,,,,,,Photograph,"25.5 x 20.5 cm.",,,,,,,,,,,,,,,,,,,,,,,,,Commencement,https://s3.us-east-1.amazonaws.com/sjcdigitalarchives/original/adb4cfa1fd979e9727784612b8163010.jpg,"Still Image","Photographic Archive—Annapolis",1,0
4980,https://digitalarchives.sjc.edu/items/show/4980,"Commencement Procession on Front Campus, Annapolis, Maryland, 1947","1 photographic print : b&w",Unknown,,"Annapolis, MD",1947-06,"St. John's College owns the rights to this photograph.","Still Image",jpeg,,"Commencement (St. John's College, Annapolis, MD)",,,,SJC-P-0905,,,,,,,,,,,,,,,,,,,Photograph,"25.5 x 20.5 cm.",,,,,,,,,,,,,,,,,,,,,,,,,Commencement,https://s3.us-east-1.amazonaws.com/sjcdigitalarchives/original/cb6046cf987234215ff319221ef9d3d5.jpg,"Still Image","Photographic Archive—Annapolis",1,0
4979,https://digitalarchives.sjc.edu/items/show/4979,"King William Players Production of ""Oedipus Rex"" by Sophocles","1 photographic print : b&w",Unknown,,"Annapolis, MD",1945,"St. John's College owns the rights to this photograph.","Still Image",jpeg,,"King William Players (St. John's College, Annapolis, Maryland)",,,,SJC-P-0904,,,,,,,,,,,,,,,,,,,Photograph,"20.5 x 17 cm.",,,,,,,,,,,,,,,,,,,,,,,,,"King William Players",https://s3.us-east-1.amazonaws.com/sjcdigitalarchives/original/8301c7fa3cd27875a5a77ba1a5cc961f.jpg,"Still Image","Photographic Archive—Annapolis",1,0
