﻿"Item Id","Item URI","Dublin Core:Title","Dublin Core:Description","Dublin Core:Creator","Dublin Core:Publisher","Dublin Core:Coverage","Dublin Core:Date","Dublin Core:Rights","Dublin Core:Type","Dublin Core:Format","Dublin Core:Source","Dublin Core:Subject","Dublin Core:Contributor","Dublin Core:Relation","Dublin Core:Language","Dublin Core:Identifier","Item Type Metadata:Occupation","Item Type Metadata:Participants","Item Type Metadata:Death Date","Item Type Metadata:Birthplace","Item Type Metadata:Birth Date","Item Type Metadata:Interviewer","Item Type Metadata:Biographical Text","Item Type Metadata:Bibliography","Item Type Metadata:Page numeration","Item Type Metadata:Resolution","Item Type Metadata:Identifier","Item Type Metadata:Inventory","Item Type Metadata:URL","Item Type Metadata:Text","Item Type Metadata:Interviewee","Item Type Metadata:Location","Item Type Metadata:Transcription","Item Type Metadata:Local URL","Item Type Metadata:Original Format","Item Type Metadata:Physical Dimensions","Item Type Metadata:Duration","Item Type Metadata:Compression","Item Type Metadata:Producer","Item Type Metadata:Director","Item Type Metadata:Bit Rate/Frequency","Item Type Metadata:Email Body","Item Type Metadata:Event Type","Item Type Metadata:Lesson Plan Text","Item Type Metadata:Materials","Item Type Metadata:Objectives","Item Type Metadata:Standards","Item Type Metadata:Number of Attachments","Item Type Metadata:BCC","Item Type Metadata:CC","Item Type Metadata:To","Item Type Metadata:From","Item Type Metadata:Subject Line","Item Type Metadata:Time Summary","Item Type Metadata:Episode","Item Type Metadata:Season","Item Type Metadata:Episode Type","Item Type Metadata:Explicit","Item Type Metadata:Block","PDF Text:Text",tags,file,itemType,collection,public,featured
41,https://digitalarchives.sjc.edu/items/show/41,"Aristotle on Respiration: The Origins of Functional Anatomy","Audio recording of a lecture delivered on March 22, 2013, by James Lennox as part of the Formal Lecture Series. ","Lennox, James G.","St. John's College","Annapolis, MD",2013-03-22,"A signed permission form has been received stating, ""I hereby grant St. John's College permission to: Make an audio recording of my lecture, and retain copies for circulation and archival preservation in the St. John's College Greenfield Library.  Make an audio recording of my lecture available online.  Make a typescript copy of my lecture available for circulation and archival preservation in the St. John's College Greenfield Library.""",sound,mp3,,"Aristotle. Posterior analytics; Respiration",,,English,"Bib # 80898",,,,,,,,,,,,,,,,,,,wav,,01:05:59,,,,,,,,,,,,,,,,,,,,,,,,"Friday night lecture",https://s3.us-east-1.amazonaws.com/sjcdigitalarchives/original/0f1843c8bce9ee12fb5f8a8649897e45.mp3,Sound,"St. John's College Formal Lecture Series—Annapolis",1,0
7700,https://digitalarchives.sjc.edu/items/show/7700,"War and Beefs:  Gang Violence in The Illiad","Audio recording of a lecture given by Jill Leovy on November 18, 2022 as part of the Dean's Lecture & Concert Series.  The Dean's Office has provided this description of the event: ""The Iliad supplies a detailed and recognizable description of what the Italian mafia scholar Maurizio Catino has dubbed “horizontal” governance -- that is, lateral rule by peers rather than top-down rule by a centralized authority. The same style of order is found the world over -- in feud societies, bandit cultures, and the various small-scale and “stateless” societies studied by anthropologists. It’s also the surprisingly uniform ordering principle of street gangs, criminal groups and paramilitaries in contemporary urban societies. What can we learn about horizontal orders by reading Homer? To what extent can his descriptions shed light on this seminal form of social organization, also known as the protection racket? By the same token, how can an understanding of urban street violence illuminate The Iliad?""","Leovy, Jill","St. John's College","Santa Fe, NM",2022-11-18,"Meem Library has been given permission to make this item available online.",sound,mp3,,"The Iliad
Social interaction",,,English,SF_LeovyJ_War_and_Beefs_2022-11-18,,,,,,,,,,,,,,,,,,,m4a,,00:53:36,,,,,,,,,,,,,,,,,,,,,,,,"Friday night lecture",https://s3.us-east-1.amazonaws.com/sjcdigitalarchives/original/9e8c2a7475ccf64ec3d811b06b215567.mp3,Sound,"St. John's College Lecture Recordings—Santa Fe",1,0
7840,https://digitalarchives.sjc.edu/items/show/7840,"An Introduction to Maimonides","Audio recording of a lecture delivered on January 30, 2004, by Ralph Lerner as part of the Formal Lecture Series.","Lerner, Ralph",,"Annapolis, MD",2004-01-30,"A signed permission form has been received giving St. John's College permission to make this lecture available online.",sound,mp3,,"Maimonides, Moses, 1135-1204 ; Jewish philosophers--Egypt--Biography; Rabbis--Egypt--Biography",,,English,LEC_Lerner_Ralph_2004-01-30_ac,,,,,,,,,,,,,,,,,,,wav,,01:01:44,,,,,,,,,,,,,,,,,,,,,,,,"Friday night lecture",https://s3.us-east-1.amazonaws.com/sjcdigitalarchives/original/84e10952e59c743d095053a4993f94db.mp3,Sound,"St. John's College Formal Lecture Series—Annapolis",1,0
250,https://digitalarchives.sjc.edu/items/show/250,"The idea of America in European political thought : 1492-9/11","Audio recording of a lecture given on March 4, 2016 by Alan Levine as part of the Dean's Lecture and Concert Series.","Levine, Alan","St. John's College","Santa Fe, NM",2016-04-04,"Meem Library has been given permission to make this item available online.",sound,mp3,,Politics--Philosophy,,,English,20014256,,,,,,,,,,,,,,,,,,,CD,,01:08:18,,,,,,,,,,,,,,,,,,,,,,,,"Friday night lecture",https://s3.us-east-1.amazonaws.com/sjcdigitalarchives/original/581d9dfc74e28c54c435cf163796064f.mp3,Sound,"St. John's College Lecture Recordings—Santa Fe",1,0
808,https://digitalarchives.sjc.edu/items/show/808,"An ennobling innocence : the founding of Socrates' Republic","Transcript of a lecture given on August 2, 1995 by David Levine as part of the Graduate Institute Summer Lecture Series.","Levine, David Lawrence","St. John's College","Santa Fe, NM",1995-08-02,"Meem Library has been given permission to make this item available online.",text,pdf,,"Plato. Republic",,,English,24000405,,,,,,,,,"16 pages",,,,,,,,,,paper,,,,,,,,,,,,,,,,,,,,,,,,,,"Graduate Institute",https://s3.us-east-1.amazonaws.com/sjcdigitalarchives/original/a4275500f36cd16d9b13e585a2305b37.pdf,Text,"St. John's College Lecture Transcripts—Santa Fe",1,0
809,https://digitalarchives.sjc.edu/items/show/809,"""I hate books"" or making room for learning","Transcript of the Graduate Institute convocation address given on June 15, 1997 by David Levine in Santa Fe, NM.","Levine, David Lawrence","St. John's College","Santa Fe, NM",1997-06-15,"Meem Library has been given permission to make this item available online.",text,pdf,,"Rousseau, Jean-Jacques, 1712-1778. Emile.; Education",,,English,24000406,,,,,,,,,"5 pages",,,,,,,,,,paper,,,,,,,,,,,,,,,,,,,,,,,,,,"Convocation,Graduate Institute",https://s3.us-east-1.amazonaws.com/sjcdigitalarchives/original/95696876ebdbc5a675af4d563e36b1f2.pdf,Text,"Speeches, presentations, and other lectures",1,0
810,https://digitalarchives.sjc.edu/items/show/810,"Four sides of a cube : or, why a certain question must be asked again and again","Transcript of a lecture given on August 31, 2001 by David Levine as part of the Dean's Lecture and Concert Series.","Levine, David Lawrence","St. John's College","Santa Fe, NM",2001-08-31,"Meem Library has been given permission to make this item available online.",text,pdf,,"Philosophy; Questions and answers",,,English,24000613,,,,,,,,,"16 pages",,,,,,,,,,paper,,,,,,,,,,,,,,,,,,,,,,,,,,"Friday night lecture",https://s3.us-east-1.amazonaws.com/sjcdigitalarchives/original/e15e3f5243a8a1ae925c953b8b53f708.pdf,Text,"St. John's College Lecture Transcripts—Santa Fe",1,0
811,https://digitalarchives.sjc.edu/items/show/811,"A community of learning... in a land of Cartesians?","Transcript of a lecture given on August 30, 2002 by David Levine as part of the Dean's Lecture and Concert Series.","Levine, David Lawrence","St. John's College","Santa Fe, NM",2002-08-30,"Meem Library has been given permission to make this item available online.",text,pdf,,"Tocqueville, Alexis de, 1805-1859.; Descartes, René, 1596-1650.; Plato; United States -- Intellectual life",,,English,24000652,,,,,,,,,"18 pages",,,,,,,,,,paper,,,,,,,,,,,,,,,,,,,,,,,,,,"Friday night lecture",https://s3.us-east-1.amazonaws.com/sjcdigitalarchives/original/8181547ef4ead9780876e1d33aa8a91c.pdf,Text,"St. John's College Lecture Transcripts—Santa Fe",1,0
812,https://digitalarchives.sjc.edu/items/show/812,"""At the very center of the plenitude"" : Goethe's grand attempt to overcome the 18th century, or how freshman laboratory saved Goethe from the general sickness of his age","Transcript of a lecture given on August 29, 2003 by David Levine as part of the Dean's Lecture and Concert Series.","Levine, David Lawrence","St. John's College","Santa Fe, NM",2003-08-29,"Meem Library has been given permission to make this item available online.",text,pdf,,"Goethe, Johann Wolfgang von, 1749-1832.",,,English,24000772,,,,,,,,,"19 pages",,,,,,,,,,paper,,,,,,,,,,,,,,,,,,,,,,,,,,"Friday night lecture",https://s3.us-east-1.amazonaws.com/sjcdigitalarchives/original/b7e04bd419d83ac6518790016c792369.pdf,Text,"St. John's College Lecture Transcripts—Santa Fe",1,0
813,https://digitalarchives.sjc.edu/items/show/813,"The forgotten faculty : the place of phronesis or practical sense in liberal education","Transcript of a lecture given on August 27, 2004 by David Levine as part of the Dean's Lecture and Concert Series.","Levine, David Lawrence","St. John's College","Santa Fe, NM",2004-08-27,"Meem Library has been given permission to make this item available online.",text,pdf,,"Education, Humanistic",,,English,24002948,,,,,,,,,"18 pages",,,,,,,,,,paper,,,,,,,,,,,,,,,,,,,,,,,,,,"Friday night lecture",https://s3.us-east-1.amazonaws.com/sjcdigitalarchives/original/503ca1bd6d522474815e09dc26a52487.pdf,Text,"St. John's College Lecture Transcripts—Santa Fe",1,0
814,https://digitalarchives.sjc.edu/items/show/814,"You too have read Newton!","Transcript of the commencement address given on May 20, 2006 by David Levine in Santa Fe, NM.","Levine, David Lawrence","St. John's College","Santa Fe, NM",2006-05-20,"Meem Library has been given permission to make this item available online.",text,pdf,,"Education, Higher",,,English,24003171,,,,,,,,,"6 pages",,,,,,,,,,paper,,,,,,,,,,,,,,,,,,,,,,,,,,Commencement,https://s3.us-east-1.amazonaws.com/sjcdigitalarchives/original/6f5b46790354c9d7056ae9176f2e10c7.pdf,Text,"Speeches, presentations, and other lectures",1,0
815,https://digitalarchives.sjc.edu/items/show/815,"This senseless course of human things : 'one of Professor Kant's most cherished ideas'","Transcript of a lecture given on August 26, 2005 by David Levine as part of the Dean's Lecture and Concert Series.","Levine, David Lawrence","St. John's College","Santa Fe, NM",2005-08-26,"Meem Library has been given permission to make this item available online.",text,pdf,,"Kant, Immanuel, 1724-1804.; Education, Higher",,,English,24003173,,,,,,,,,"20 pages",,,,,,,,,,paper,,,,,,,,,,,,,,,,,,,,,,,,,,"Friday night lecture",https://s3.us-east-1.amazonaws.com/sjcdigitalarchives/original/0f20ac4b2e691cb4e0de1e6b41d12e5a.pdf,Text,"St. John's College Lecture Transcripts—Santa Fe",1,0
816,https://digitalarchives.sjc.edu/items/show/816,"Hand-me-downs : or the traditionalization of thought","Transcript of the Graduate Institute convocation address given on June 14, 1998 by David Levine in Santa Fe, NM.","Levine, David Lawrence","St. John's College","Santa Fe, NM",1998-06-14,"Meem Library has been given permission to make this item available online.",text,pdf,,"Learning and scholarship",,,English,24003174,,,,,,,,,"8 pages",,,,,,,,,,paper,,,,,,,,,,,,,,,,,,,,,,,,,,"Convocation,Graduate Institute",https://s3.us-east-1.amazonaws.com/sjcdigitalarchives/original/6ad1a18a9b2b9c77460e76fec6acb025.pdf,Text,"Speeches, presentations, and other lectures",1,0
817,https://digitalarchives.sjc.edu/items/show/817,"A world of worldless truths, an invitation to philosophy","Transcript of the Graduate Institute convocation address given on June 20, 1999 by David Levine in Santa Fe, NM.","Levine, David Lawrence","St. John's College","Santa Fe, NM",1999-06-20,"Meem Library has been given permission to make this item available online.",text,pdf,,"Philosophy; Learning and scholarship",,,English,24003175,,,,,,,,,"12 pages",,,,,,,,,,paper,,,,,,,,,,,,,,,,,,,,,,,,,,"Convocation,Graduate Institute",https://s3.us-east-1.amazonaws.com/sjcdigitalarchives/original/c03377a141baddbe91eb9196f92e2a1b.pdf,Text,"Speeches, presentations, and other lectures",1,0
818,https://digitalarchives.sjc.edu/items/show/818,"From the virtual to the actual : the painful prospect of liberal education","Transcript of the Graduate Institute convocation address given on June 18, 2000 by David Levine in Santa Fe, NM.","Levine, David Lawrence","St. John's College","Santa Fe, NM",2000-06-18,"Meem Library has been given permission to make this item available online.",text,pdf,,"Education, Humanistic; Learning and scholarship",,,English,24003176,,,,,,,,,"10 pages",,,,,,,,,,paper,,,,,,,,,,,,,,,,,,,,,,,,,,"Convocation,Graduate Institute",https://s3.us-east-1.amazonaws.com/sjcdigitalarchives/original/a47243857e9ffa50e154dd2006001eca.pdf,Text,"Speeches, presentations, and other lectures",1,0
3449,https://digitalarchives.sjc.edu/items/show/3449,"Humanity dehumanized : Hegel's reflections on the Enlightenment and the French Revolution...and their other legacy","Audio recording of a lecturer given on November 3, 2017 by David Levine as part of the Dean's Lecture and Concert Series.","Levine, David Lawrence","St. John's College","Santa Fe, NM",2017-11-03,"Meem Library has been given permission to make this item available online.",sound,mp3,,"Hegel, Georg Wilhelm Friedrich, 1770-1831. Phänomenologie des Geistes.; Enlightenment; French Revolution",,,English,20014386,,,,,,,,,,,,,,,,,,,wav,,00:59:33,,,,,,,,,,,,,,,,,,,,,,,,"Friday night lecture",https://s3.us-east-1.amazonaws.com/sjcdigitalarchives/original/14b9f2e77bbc9f95406c506842559d5d.mp3,Sound,"St. John's College Lecture Recordings—Santa Fe",1,0
6863,https://digitalarchives.sjc.edu/items/show/6863,"Modern symbolic unreality, or Mr. Klein's question : Who lives symbolically?","Audio recording of a lecture given on February 28, 2020 by David Levine as part of the Dean's Lecture and Concert Series.","Levine, David Lawrence","St. John's College","Santa Fe, NM",2020-02-28,"Meem Library has been given permission to make this item available online.",sound,mp3,,"Klein, Jacob, 1899-1978. Griechische Logistik und die Entstehung der Algebra. English",,,English,SF_LevineD_Modern_Symbolic_Unreality_2020-02-28,,,,,,,,,,,,,,,,,,,wav,,00:59:51,,,,,,,,,,,,,,,,,,,,,,,,"Friday night lecture",https://s3.us-east-1.amazonaws.com/sjcdigitalarchives/original/0117038d7d9769cf52d6d386b86d754b.mp3,Sound,"St. John's College Lecture Recordings—Santa Fe",1,0
1735,https://digitalarchives.sjc.edu/items/show/1735,"Simon Kaplan, Ford K. Brown, William Kyle Smith and Jacob Klein Seated in a Sitting Room","1 photographic print : b&w.  From left to right: Simon Kaplan, Ford K. Brown, the Reverend William Kyle Smith, and Jacob Klein.","Lewis, Matthew",,"Annapolis, MD",1975,"St. John's College owns the rights to this photograph.","still image",jpeg,,"St. John's College (Annapolis, Md.). -- Presidents. ;  St. John's College (Annapolis, Md.). -- Assistant Deans ;  St. John's College (Annapolis, Md.). -- Faculty.; Kaplan, Simon. 1893-1979. ;  Brown, Ford Keeler. ;  Smith, William Kyle ;  Klein, Jacob, 1899-1978.",,,,SJC-P-0187,,,,,,,,,,,,,,,,,,,photograph,"25 x 20 cm.",,,,,,,,,,,,,,,,,,,,,,,,,"Deans,Honorary Alumni,Tutors",https://s3.us-east-1.amazonaws.com/sjcdigitalarchives/original/c499b2ad61bf74a40afcfb8937732017.jpg,"Still Image","Photographic Archive—Annapolis",1,0
1382,https://digitalarchives.sjc.edu/items/show/1382,"Evolution as a cause","Audio recording of a lecture given on November 4, 2016 by Benjamin Liebeskind as part of the Dean's Lecture and Concert Series.","Liebeskind, Benjamin","St. John's College","Santa Fe, NM",2016-11-04,"Meem Library has been given permission to make this item available online.",sound,mp3,,"Evolution (Biology)",,,English,20014348,,,,,,,,,,,,,,,,,,,wav,,00:53:14,,,,,,,,,,,,,,,,,,,,,,,,"Friday night lecture",https://s3.us-east-1.amazonaws.com/sjcdigitalarchives/original/a71856da963cdecaf60e6f8b56606bfc.mp3,Sound,"St. John's College Lecture Recordings—Santa Fe",1,0
1043,https://digitalarchives.sjc.edu/items/show/1043,"Richard Weigle, Mary Weigle, David Ginsburg and Mrs. W. Driscoll at the Dedication of Weigle Hall, St. John's College, Santa Fe, New Mexico","1 photographic print : b&w","Lilienthal, Betty",,"Santa Fe, NM",1974-05-19,"St. John's College owns the rights to this photograph.","still image",jpeg,,"Weigle Hall (St. John's College, Santa Fe, N. M.) ;  St. John's College (Annapolis, Md.). -- Presidents. ;  St. John's College (Santa Fe, N. M.). -- Presidents.; Weigle, Richard Daniel, 1912- ;  Ginsburg, David ;  Weigle, Mary",,,,SJC-P-0108,,,,,,,,,,,,,,,,,,,photograph,"24.5 x 18.5 cm.",,,,,,,,,,,,,,,,,,,,,,,,,"Honorary Alumni,Presidents",https://s3.us-east-1.amazonaws.com/sjcdigitalarchives/original/f943938dcbf860e4372a450818745d37.jpg,"Still Image","Photographic Archive—Annapolis",1,1
