﻿"Item Id","Item URI","Dublin Core:Title","Dublin Core:Description","Dublin Core:Creator","Dublin Core:Publisher","Dublin Core:Coverage","Dublin Core:Date","Dublin Core:Rights","Dublin Core:Type","Dublin Core:Format","Dublin Core:Source","Dublin Core:Subject","Dublin Core:Contributor","Dublin Core:Relation","Dublin Core:Language","Dublin Core:Identifier","Item Type Metadata:Occupation","Item Type Metadata:Participants","Item Type Metadata:Death Date","Item Type Metadata:Birthplace","Item Type Metadata:Birth Date","Item Type Metadata:Interviewer","Item Type Metadata:Biographical Text","Item Type Metadata:Bibliography","Item Type Metadata:Page numeration","Item Type Metadata:Resolution","Item Type Metadata:Identifier","Item Type Metadata:Inventory","Item Type Metadata:URL","Item Type Metadata:Text","Item Type Metadata:Interviewee","Item Type Metadata:Location","Item Type Metadata:Transcription","Item Type Metadata:Local URL","Item Type Metadata:Original Format","Item Type Metadata:Physical Dimensions","Item Type Metadata:Duration","Item Type Metadata:Compression","Item Type Metadata:Producer","Item Type Metadata:Director","Item Type Metadata:Bit Rate/Frequency","Item Type Metadata:Email Body","Item Type Metadata:Event Type","Item Type Metadata:Lesson Plan Text","Item Type Metadata:Materials","Item Type Metadata:Objectives","Item Type Metadata:Standards","Item Type Metadata:Number of Attachments","Item Type Metadata:BCC","Item Type Metadata:CC","Item Type Metadata:To","Item Type Metadata:From","Item Type Metadata:Subject Line","Item Type Metadata:Time Summary","Item Type Metadata:Episode","Item Type Metadata:Season","Item Type Metadata:Episode Type","Item Type Metadata:Explicit","Item Type Metadata:Block","PDF Text:Text",tags,file,itemType,collection,public,featured
5532,https://digitalarchives.sjc.edu/items/show/5532,"Senator Charles Mathias Seated during the Filming of the ""Dialogue of the Western World"", Great Book Public Television Series","1 photographic print : b&w",Unknown,,"Annapolis, MD","1972 [circa]","St. John's College owns the rights to this photograph.","Still Image",jpeg,,"Mathias, Charles",,,,SJC-P-1521,,,,,,,,,,,,,,,,,,,Photograph,"20.5 x 25.5 cm.",,,,,,,,,,,,,,,,,,,,,,,,,,https://s3.us-east-1.amazonaws.com/sjcdigitalarchives/original/7322a08825f81ee95ccab72d99f165d1.jpg,"Still Image","Photographic Archive—Annapolis",1,0
5531,https://digitalarchives.sjc.edu/items/show/5531,"Christine A. Constantine Seated during the Filming of the ""Dialogue of the Western World"", Great Book Public Television Series","1 photographic print : b&w",Unknown,,"Annapolis, MD","1972 [circa]","St. John's College owns the rights to this photograph.","Still Image",jpeg,,"Constantine, Christine A.",,,,SJC-P-1520,,,,,,,,,,,,,,,,,,,Photograph,"20.5 x 25.5 cm.",,,,,,,,,,,,,,,,,,,,,,,,,Alumni,https://s3.us-east-1.amazonaws.com/sjcdigitalarchives/original/c14920d5245287d3d250c830826bf192.jpg,"Still Image","Photographic Archive—Annapolis",1,0
5530,https://digitalarchives.sjc.edu/items/show/5530,"Patricia Harris Seated during the Filming of the ""Dialogue of the Western World"", Great Book Public Television Series","1 photographic print : b&w",Unknown,,"Annapolis, MD","1972 [circa]","St. John's College owns the rights to this photograph.","Still Image",jpeg,,"Harris, Patricia",,,,SJC-P-1519,,,,,,,,,,,,,,,,,,,Photograph,"20.5 x 25.5 cm.",,,,,,,,,,,,,,,,,,,,,,,,,,https://s3.us-east-1.amazonaws.com/sjcdigitalarchives/original/6e288faba1a01e4473d582830e156843.jpg,"Still Image","Photographic Archive—Annapolis",1,0
5529,https://digitalarchives.sjc.edu/items/show/5529,"Rear Admiral James Calvert of the United States Naval Academy Seated during a ""Seminar of the Air"" Radio Program","1 photographic print : b&w",Unknown,,"Annapolis, MD","1972 [circa]","St. John's College owns the rights to this photograph.","Still Image",jpeg,,"Calvert, James",,,,SJC-P-1518,,,,,,,,,,,,,,,,,,,Photograph,"25.5 x 20.5 cm.",,,,,,,,,,,,,,,,,,,,,,,,,,https://s3.us-east-1.amazonaws.com/sjcdigitalarchives/original/b778b9e02d86111bebc83d22d7849281.jpg,"Still Image","Photographic Archive—Annapolis",1,0
5528,https://digitalarchives.sjc.edu/items/show/5528,"Mr. Sarbanes Seated during a ""Seminar of the Air"" Radio Program","1 photographic print : b&w",Unknown,,"Annapolis, MD","1972 [circa]","St. John's College owns the rights to this photograph.","Still Image",jpeg,,"Sarbanes, Paul",,,,SJC-P-1517,,,,,,,,,,,,,,,,,,,Photograph,"25.5 x 20.5 cm.",,,,,,,,,,,,,,,,,,,,,,,,,,https://s3.us-east-1.amazonaws.com/sjcdigitalarchives/original/faab785e8fe12d4aef84d24d7baa69ba.jpg,"Still Image","Photographic Archive—Annapolis",1,0
5527,https://digitalarchives.sjc.edu/items/show/5527,"Plaque in Mellon Hall Commemorating the Dedication of the Francis Scott Key Memorial Hall, Annapolis, Maryland","1 photographic print : b&w","Parran, Tom",,"Annapolis, MD",,"St. John's College owns the rights to this photograph.","Still Image",jpeg,,"Mellon Hall (St. John's College, Annapolis, MD)",,,,SJC-P-1516,,,,,,,,,,,,,,,,,,,Photograph,"25.5 x 20.5 cm.",,,,,,,,,,,,,,,,,,,,,,,,,"Mellon Hall",https://s3.us-east-1.amazonaws.com/sjcdigitalarchives/original/db9a542eef59e45d8181530a21382443.jpg,"Still Image","Photographic Archive—Annapolis",1,0
5526,https://digitalarchives.sjc.edu/items/show/5526,"Plaque in Mellon Hall Commemorating the Dedication of the Francis Scott Key Memorial Hall, Annapolis, Maryland","1 photographic print : b&w","Parran, Tom",,"Annapolis, MD",,"St. John's College owns the rights to this photograph.","Still Image",jpeg,,"Mellon Hall (St. John's College, Annapolis, MD)",,,,SJC-P-1515,,,,,,,,,,,,,,,,,,,Photograph,"25.5 x 20.5 cm.",,,,,,,,,,,,,,,,,,,,,,,,,"Mellon Hall",https://s3.us-east-1.amazonaws.com/sjcdigitalarchives/original/aeabb6e0424780d5863b7d06e4f9176e.jpg,"Still Image","Photographic Archive—Annapolis",1,0
5525,https://digitalarchives.sjc.edu/items/show/5525,"Outside View of the Francis Scott Key Lobby at Night, Annapolis, Maryland","1 photographic print : b&w",Unknown,,"Annapolis, MD",,"St. John's College owns the rights to this photograph.","Still Image",jpeg,,"Mellon Hall (St. John's College, Annapolis, MD)",,,,SJC-P-1509,,,,,,,,,,,,,,,,,,,Photograph,"24.5 x 7.5 cm.",,,,,,,,,,,,,,,,,,,,,,,,,"Mellon Hall",https://s3.us-east-1.amazonaws.com/sjcdigitalarchives/original/f766d958c4095b126f50c6922b1fa504.jpg,"Still Image","Photographic Archive—Annapolis",1,0
5524,https://digitalarchives.sjc.edu/items/show/5524,"Architectural Model of Mellon Hall","1 photographic print : b&w","Shulman, Julius",,"Annapolis, MD","1958 [circa]","St. John's College owns the rights to this photograph.","Still Image",jpeg,,"Mellon Hall (St. John's College, Annapolis, MD)",,,,SJC-P-1498,,,,,,,,,,,,,,,,,,,Photograph,"25.5 x 20.5 cm.",,,,,,,,,,,,,,,,,,,,,,,,,"Mellon Hall",https://s3.us-east-1.amazonaws.com/sjcdigitalarchives/original/0a2e6892fb3337c8fbc215de6bd931c4.jpg,"Still Image","Photographic Archive—Annapolis",1,0
5523,https://digitalarchives.sjc.edu/items/show/5523,"Architectural Model of Mellon Hall","1 photographic print : b&w","Shulman, Julius",,"Annapolis, MD","1958 [circa]","St. John's College owns the rights to this photograph.","Still Image",jpeg,,"Mellon Hall (St. John's College, Annapolis, MD)",,,,SJC-P-1497,,,,,,,,,,,,,,,,,,,Photograph,"25.5 x 20.5 cm.",,,,,,,,,,,,,,,,,,,,,,,,,"Mellon Hall",https://s3.us-east-1.amazonaws.com/sjcdigitalarchives/original/fd1b5c9305d12ce0c4b62c160e45b0ae.jpg,"Still Image","Photographic Archive—Annapolis",1,0
5522,https://digitalarchives.sjc.edu/items/show/5522,"Architectural Model of Mellon Hall","1 photographic print : b&w","Shulman, Julius",,"Annapolis, MD","1958 [circa]","St. John's College owns the rights to this photograph.","Still Image",jpeg,,"Mellon Hall (St. John's College, Annapolis, MD)",,,,SJC-P-1496,,,,,,,,,,,,,,,,,,,Photograph,"25.5 x 20.5 cm.",,,,,,,,,,,,,,,,,,,,,,,,,"Mellon Hall",https://s3.us-east-1.amazonaws.com/sjcdigitalarchives/original/0572c386ed35df960998ceb88e52d913.jpg,"Still Image","Photographic Archive—Annapolis",1,0
5521,https://digitalarchives.sjc.edu/items/show/5521,"Architectural Model of Mellon Hall","1 photographic print : b&w","Shulman, Julius",,"Annapolis, MD","1958 [circa]","St. John's College owns the rights to this photograph.","Still Image",jpeg,,"Mellon Hall (St. John's College, Annapolis, MD)",,,,SJC-P-1495,,,,,,,,,,,,,,,,,,,Photograph,"25.5 x 20.5 cm.",,,,,,,,,,,,,,,,,,,,,,,,,"Mellon Hall",https://s3.us-east-1.amazonaws.com/sjcdigitalarchives/original/0b7329a6db34188cd8ae7a80d3d8f6ed.jpg,"Still Image","Photographic Archive—Annapolis",1,0
5520,https://digitalarchives.sjc.edu/items/show/5520,"Architectural Model of Mellon Hall","1 photographic print : b&w","Shulman, Julius",,"Annapolis, MD","1958 [circa]","St. John's College owns the rights to this photograph.","Still Image",jpeg,,"Mellon Hall (St. John's College, Annapolis, MD)",,,,SJC-P-1494,,,,,,,,,,,,,,,,,,,Photograph,"23 x 13.5 cm.",,,,,,,,,,,,,,,,,,,,,,,,,"Mellon Hall",https://s3.us-east-1.amazonaws.com/sjcdigitalarchives/original/46f748a03929d45e6679816c5f301e11.jpg,"Still Image","Photographic Archive—Annapolis",1,0
5519,https://digitalarchives.sjc.edu/items/show/5519,"Architectural Model of Mellon Hall","1 photographic print : b&w","Shulman, Julius",,"Annapolis, MD","1958 [circa]","St. John's College owns the rights to this photograph.","Still Image",jpeg,,"Mellon Hall (St. John's College, Annapolis, MD)",,,,SJC-P-1493,,,,,,,,,,,,,,,,,,,Photograph,"25.5 x 20.5 cm.",,,,,,,,,,,,,,,,,,,,,,,,,"Mellon Hall",https://s3.us-east-1.amazonaws.com/sjcdigitalarchives/original/fe9963c865444bdb3b31c073b53f6800.jpg,"Still Image","Photographic Archive—Annapolis",1,0
5518,https://digitalarchives.sjc.edu/items/show/5518,"Architectural Model of Mellon Hall","1 photographic print : b&w","Shulman, Julius",,"Annapolis, MD","1958 [circa]","St. John's College owns the rights to this photograph.","Still Image",jpeg,,"Mellon Hall (St. John's College, Annapolis, MD)",,,,SJC-P-1492,,,,,,,,,,,,,,,,,,,Photograph,"25.5 x 20.5 cm.",,,,,,,,,,,,,,,,,,,,,,,,,"Mellon Hall",https://s3.us-east-1.amazonaws.com/sjcdigitalarchives/original/cc4e34f2acac1e51f19cb30d358caaab.jpg,"Still Image","Photographic Archive—Annapolis",1,0
5517,https://digitalarchives.sjc.edu/items/show/5517,"Architectural Model of Mellon Hall","1 photographic print : b&w","Shulman, Julius",,"Annapolis, MD","1958 [circa]","St. John's College owns the rights to this photograph.","Still Image",jpeg,,"Mellon Hall (St. John's College, Annapolis, MD)",,,,SJC-P-1491,,,,,,,,,,,,,,,,,,,Photograph,"25.5 x 20.5 cm.",,,,,,,,,,,,,,,,,,,,,,,,,"Mellon Hall",https://s3.us-east-1.amazonaws.com/sjcdigitalarchives/original/174b04b3ffe0ff8608ecaa041d4965ac.jpg,"Still Image","Photographic Archive—Annapolis",1,0
5516,https://digitalarchives.sjc.edu/items/show/5516,"Architectural Model of Mellon Hall","1 photographic print : b&w","Shulman, Julius",,"Annapolis, MD","1958 [circa]","St. John's College owns the rights to this photograph.","Still Image",jpeg,,"Mellon Hall (St. John's College, Annapolis, MD)",,,,SJC-P-1490,,,,,,,,,,,,,,,,,,,Photograph,"15.5 x 11 cm.",,,,,,,,,,,,,,,,,,,,,,,,,"Mellon Hall",https://s3.us-east-1.amazonaws.com/sjcdigitalarchives/original/84c5532cc502c59e95227582d54df82a.jpg,"Still Image","Photographic Archive—Annapolis",1,0
5515,https://digitalarchives.sjc.edu/items/show/5515,"The Land Prepared for the Construction of Mellon Hall, Annapolis, Maryland","1 photographic print : b&w",Unknown,,"Annapolis, MD","1958 [circa]","St. John's College owns the rights to this photograph.","Still Image",jpeg,,"Mellon Hall (St. John's College, Annapolis, MD)",,,,SJC-P-1489,,,,,,,,,,,,,,,,,,,Photograph,"25.5 x 20.5 cm.",,,,,,,,,,,,,,,,,,,,,,,,,"Mellon Hall",https://s3.us-east-1.amazonaws.com/sjcdigitalarchives/original/6528f9d6f88e6d34b4b3d3afcdea4fe0.jpg,"Still Image","Photographic Archive—Annapolis",1,0
5514,https://digitalarchives.sjc.edu/items/show/5514,"The Land Prepared for the Construction of Mellon Hall, Annapolis, Maryland","1 photographic print : b&w",Unknown,,"Annapolis, MD","1958 [circa]","St. John's College owns the rights to this photograph.","Still Image",jpeg,,"Mellon Hall (St. John's College, Annapolis, MD)",,,,SJC-P-1488,,,,,,,,,,,,,,,,,,,Photograph,"25.5 x 20.5 cm.",,,,,,,,,,,,,,,,,,,,,,,,,"Mellon Hall",https://s3.us-east-1.amazonaws.com/sjcdigitalarchives/original/ddc81e3dd6db94efbefa7f070bb40676.jpg,"Still Image","Photographic Archive—Annapolis",1,0
5513,https://digitalarchives.sjc.edu/items/show/5513,"A Tractor Used during the Construction of Mellon Hall, Annapolis, Maryland","1 photographic print : b&w",Unknown,,"Annapolis, MD","1958 [circa]","St. John's College owns the rights to this photograph.","Still Image",jpeg,,"Mellon Hall (St. John's College, Annapolis, MD)",,,,SJC-P-1486,,,,,,,,,,,,,,,,,,,Photograph,"25.5 x 20.5 cm.",,,,,,,,,,,,,,,,,,,,,,,,,"Mellon Hall",https://s3.us-east-1.amazonaws.com/sjcdigitalarchives/original/b8bf4fceba3b38c67db40369deae3fa4.jpg,"Still Image","Photographic Archive—Annapolis",1,0
