﻿"Item Id","Item URI","Dublin Core:Title","Dublin Core:Description","Dublin Core:Creator","Dublin Core:Publisher","Dublin Core:Coverage","Dublin Core:Date","Dublin Core:Rights","Dublin Core:Type","Dublin Core:Format","Dublin Core:Source","Dublin Core:Subject","Dublin Core:Contributor","Dublin Core:Relation","Dublin Core:Language","Dublin Core:Identifier","Item Type Metadata:Occupation","Item Type Metadata:Participants","Item Type Metadata:Death Date","Item Type Metadata:Birthplace","Item Type Metadata:Birth Date","Item Type Metadata:Interviewer","Item Type Metadata:Biographical Text","Item Type Metadata:Bibliography","Item Type Metadata:Page numeration","Item Type Metadata:Resolution","Item Type Metadata:Identifier","Item Type Metadata:Inventory","Item Type Metadata:URL","Item Type Metadata:Text","Item Type Metadata:Interviewee","Item Type Metadata:Location","Item Type Metadata:Transcription","Item Type Metadata:Local URL","Item Type Metadata:Original Format","Item Type Metadata:Physical Dimensions","Item Type Metadata:Duration","Item Type Metadata:Compression","Item Type Metadata:Producer","Item Type Metadata:Director","Item Type Metadata:Bit Rate/Frequency","Item Type Metadata:Email Body","Item Type Metadata:Event Type","Item Type Metadata:Lesson Plan Text","Item Type Metadata:Materials","Item Type Metadata:Objectives","Item Type Metadata:Standards","Item Type Metadata:Number of Attachments","Item Type Metadata:BCC","Item Type Metadata:CC","Item Type Metadata:To","Item Type Metadata:From","Item Type Metadata:Subject Line","Item Type Metadata:Time Summary","Item Type Metadata:Episode","Item Type Metadata:Season","Item Type Metadata:Episode Type","Item Type Metadata:Explicit","Item Type Metadata:Block","PDF Text:Text",tags,file,itemType,collection,public,featured
5091,https://digitalarchives.sjc.edu/items/show/5091,"Students and Tutor Seated at a Tutorial Table and Joan S. McKay and Two Other Students Performing Chemistry Experiments","2 photographic prints : b&w",Unknown,,"Annapolis, MD","1953 [circa]","St. John's College owns the rights to this photograph.","Still Image",jpeg,,"McKay, Joan S.",,,,SJC-P-1021,,,,,,,,,,,,,,,,,,,Photograph,"20.5 x 25.5 cm.",,,,,,,,,,,,,,,,,,,,,,,,,"Alumni,Tutors",https://s3.us-east-1.amazonaws.com/sjcdigitalarchives/original/491959395f2e7fcc82fce5954c954199.jpg,"Still Image","Photographic Archive—Annapolis",1,0
5101,https://digitalarchives.sjc.edu/items/show/5101,"Students Carrying Easels Over Their Shoulders as They Walk Through the Snow on Front Campus, Annapolis, Maryland","1 photographic print : b&w","Eisenstaedt, Alfred",,"Annapolis, MD","1953 [circa]","St. John's College owns the rights to this photograph.","Still Image",jpeg,,,,,,SJC-P-1036,,,,,,,,,,,,,,,,,,,Photograph,"20.5 x 25.5 cm.",,,,,,,,,,,,,,,,,,,,,,,,,,https://s3.us-east-1.amazonaws.com/sjcdigitalarchives/original/3198504b3bd6777ecf758c2162313137.jpg,"Still Image","Photographic Archive—Annapolis",1,0
5102,https://digitalarchives.sjc.edu/items/show/5102,"Students Carrying Easels Over Their Shoulders as They Walk Through the Snow on Front Campus, Annapolis, Maryland","1 photographic print : b&w","Eisenstaedt, Alfred",,"Annapolis, MD","1953 [circa]","St. John's College owns the rights to this photograph.","Still Image",jpeg,,,,,,SJC-P-1037,,,,,,,,,,,,,,,,,,,Photograph,"20.5 x 25.5 cm.",,,,,,,,,,,,,,,,,,,,,,,,,,https://s3.us-east-1.amazonaws.com/sjcdigitalarchives/original/a5d169b8255fb32fb64bd5abd69e9c8b.jpg,"Still Image","Photographic Archive—Annapolis",1,0
1063,https://digitalarchives.sjc.edu/items/show/1063,"Portrait of Richard D. Weigle, Taken for the Yale University Club Luncheon, Yale University, New Haven Connecticut, January 26, 1953","1 photographic print : b&w",Unknown,,"New Haven, CT",1953-01-26,"St. John's College owns the rights to this photograph.","still image",jpeg,,"Yale University -- Yale University Club. ;  St. John's College (Annapolis, Md.). -- Presidents. ;  St. John's College (Santa Fe, N. M.). -- Presidents.; Weigle, Richard Daniel 1912-",,,,SJC-P-0133,,,,,,,,,,,,,,,,,,,photograph,"10.5 x 12.5 cm.",,,,,,,,,,,,,,,,,,,,,,,,,"Honorary Alumni,Presidents",https://s3.us-east-1.amazonaws.com/sjcdigitalarchives/original/c82d0eb6fcdde4c5d554bd9a18dd3313.jpg,"Still Image","Photographic Archive—Annapolis",1,1
1295,https://digitalarchives.sjc.edu/items/show/1295,"The Winter's Tale","King William Players playbill of Shakespeare's ""The Winter's Tale""",,"St. John's College","Annapolis, MD",1953-01-30/31,"St. John's College owns the rights to this publication.",text,pdf,,"Shakespeare, William, 1564-1616",,,English,Bx1-38,,,,,,,,,"4 pages",,,,,,,,,,paper,,,,,,,,,,,,,,,,,,,,,,,,,,"King William Players",https://s3.us-east-1.amazonaws.com/sjcdigitalarchives/original/a21ee56ad9b92ebfaa345d13ee18e046.pdf,Text,"Playbills & Programs",1,0
186,https://digitalarchives.sjc.edu/items/show/186,"Catalogue Issue:  Bulletin of St. John's College in Annapolis; Official Statement of the St. John's Program, Catalogue 1953","College catalog for the year 1953","St. John's College","St. John's College","Annapolis, MD",1953-03,"St. John's College owns the rights to this publication.",text,pdf,"Bulletin of St. John's College:  Volume V, No. 1",,,,English,,,,,,,,,,"82 pages",,,,,,,,,,paper,,,,,,,,,,,,,,,,,,,,,,,,,,"Catalog,Catalogue",https://s3.us-east-1.amazonaws.com/sjcdigitalarchives/original/5e8fd279c5e8b0b1ba6a1b00aa0bc1b1.pdf,Text,"College Catalogs and Statements of the Program",1,0
6448,https://digitalarchives.sjc.edu/items/show/6448,"Bulletin of St. John's College, March 1953","Volume V, No. 1 of the Bulletin of St. John's College, entitled ""Official Statement of the Program"". Published in March 1953.","St. John's College","St. John's College","Annapolis, MD",1953-03,"St. John's College owns the rights to this publication.",text,pdf,,,,,English,"Bulletin, March 1953, Vol. V #1",,,,,,,,,"83 pages",,,,,,,,,,paper,,,,,,,,,,,,,,,,,,,,,,,,,,,https://s3.us-east-1.amazonaws.com/sjcdigitalarchives/original/39c47b29fb531257281368a8213ee9cf.pdf,Text,"The Bulletin",1,0
2790,https://digitalarchives.sjc.edu/items/show/2790,"The St. John's Collegian, May 1953","Issue of The St. John's Collegian. Published in May 1953.","Gearing, Sinclair (Editor); Dvorak, Barbara (Editor)","St. John's College","Annapolis, MD",1953-05,"St. John's College owns the rights to this publication.",text,pdf,,,,,English,"Collegian 1953, May",,,,,,,,,"36 pages",,,,,,,,,,paper,,,,,,,,,,,,,,,,,,,,,,,,,,"The Collegian",https://s3.us-east-1.amazonaws.com/sjcdigitalarchives/original/4c7a43a73e75726496445292ce1df5c9.pdf,Text,"The Collegian",1,0
3777,https://digitalarchives.sjc.edu/items/show/3777,"Bulletin of St. John's College in Annapolis, June 1953","Volume V, Number 2 of the Bulletin of St. John's College in Annapolis, A Living Heritage.  Published in June 1953.","St. John's College","St. John's College","Annapolis, MD",1953-06,"St. John's College owns the rights to this publication.",text,pdf,,,,,English,"Bulletin-A Living Heritage-Vol V #2-June 1953",,,,,,,,,"27 pages",,,,,,,,,,paper,,,,,,,,,,,,,,,,,,,,,,,,,,,https://s3.us-east-1.amazonaws.com/sjcdigitalarchives/original/38d739177569f087a0ff906e5ce565ee.pdf,Text,"The Bulletin",1,0
7913,https://digitalarchives.sjc.edu/items/show/7913,"History and the Liberal Arts","Typescript of a lecture delivered June 5, 1953, by Jacob Klein as part of the Formal Lecture Series. The typescript was printed by the St. John's College Press and sold in the college's book store around 1965. ","Klein, Jacob, 1899-1978",,"Annapolis, MD",1953-06-05,"The Greenfield Library holds the literary rights to Jacob Klein's work.",text,pdf,,"Education--Philosophy--History; History--Study and teaching; Education, Humanistic",,,English,"lec Klein 1965",,,,,,,,,"9 pages",,,,,,,,,,paper,,,,,,,,,,,,,,,,,,,,,,,,,,"Friday night lecture,Tutors",https://s3.us-east-1.amazonaws.com/sjcdigitalarchives/original/71f5edf44878427a1391ee4fe3f9f708.pdf,Text,"St. John's College Formal Lecture Series—Annapolis",1,0
3706,https://digitalarchives.sjc.edu/items/show/3706,"Commencement Program, 1953 (Draft)","Program for the One Hundred and Sixty-First Commencement in the Two-Hundred and Fifty-Sixth Year of the College.","St. John's College","St. John's College","Annapolis, MD",1953-06-15,"St. John's College owns the rights to this publication.",text,pdf,,,,,English,"Commencement 1953",,,,,,,,,"5 pages",,,,,,,,,,paper,,,,,,,,,,,,,,,,,,,,,,,,,,Commencement,https://s3.us-east-1.amazonaws.com/sjcdigitalarchives/original/e28fd4c189273e25ff1d411c0ec6e73c.pdf,Text,"Commencement Programs and Addresses",1,0
3771,https://digitalarchives.sjc.edu/items/show/3771,"Bulletin of St. John's College in Annapolis, September 1953","Volume V, No. 3 of the Bulletin of St. John's College in Annapolis, Report of the President.  Published in September 1953.","St. John's College","St. John's College","Annapolis, MD",1953-09,"St. John's College owns the rights to this publication.",text,pdf,,"Weigle, Richard Daniel, 1912- ",,,English,"Bulletin September 1953-Vol V No. 3-Report of the President",,,,,,,,,"20 pages",,,,,,,,,,paper,,,,,,,,,,,,,,,,,,,,,,,,,,"President's Report,Presidents",https://s3.us-east-1.amazonaws.com/sjcdigitalarchives/original/5b7578cdd25f79b7d5a4b69d97b39d6e.pdf,Text,"The Bulletin",1,0
2832,https://digitalarchives.sjc.edu/items/show/2832,"The Collegian, December 1953","Issue of The Collegian.  Published in December 1953.","Taylor, James (Editor); McGhee, Peter (Editor)","St. John's College","Annapolis, MD",1953-12,"St. John's College owns the rights to this publication.",text,pdf,,,,,English,"The Collegian December, 1953",,,,,,,,,"37 pages",,,,,,,,,,paper,,,,,,,,,,,,,,,,,,,,,,,,,,"Student publication,The Collegian",https://s3.us-east-1.amazonaws.com/sjcdigitalarchives/original/ce2074556b0f58faf15a0d7ee369da8e.pdf,Text,"The Collegian",1,0
1359,https://digitalarchives.sjc.edu/items/show/1359,"Emperor and Galilean","Playbill of the King William Players Production of ""Emperor and Galilean"" by Henrik Ibsen and one photo clipping",,"St. John's College","Annapolis, MD",1953-12-11/12,"St. John's College owns the rights to this publication.",text,pdf,,,,,English,Bx2-33,,,,,,,,,"4 pages",,,,,,,,,,paper,,,,,,,,,,,,,,,,,,,,,,,,,,"King William Players",https://s3.us-east-1.amazonaws.com/sjcdigitalarchives/original/49c16a11c54f9e57bc232d2e38f22932.pdf,Text,"Playbills & Programs",1,0
4501,https://digitalarchives.sjc.edu/items/show/4501,"Douglas Allanbrook Seated at Piano during Music Tutorial on Suspension, St. John's College, Annapolis, Maryland","1 photographic print : b&w",Unknown,,"Annapolis, MD","1953-1930 [circa]","St. John's College owns the rights to this photograph.","Still Image",jpeg,,"St. John's College (Annapolis, Md.). -- Faculty. ;  St. John's College (Annapolis, Md.). -- Music Tutorial. ;  Music ;  Teaching ;  Classrooms ;  Allanbrook, Douglas.",,,,SJC-P-0507,,,,,,,,,,,,,,,,,,,Photograph,"12.5 x 10 cm.",,,,,,,,,,,,,,,,,,,,,,,,,"Honorary Alumni,Tutors",https://s3.us-east-1.amazonaws.com/sjcdigitalarchives/original/1355577d95794db04918015113ccc727.jpg,"Still Image","Photographic Archive—Annapolis",1,0
6283,https://digitalarchives.sjc.edu/items/show/6283,"St. John's Story","St. John's College film produced in 1954 describing the college and its program. Directed by Gordon Hessler, narrated by Mark Van Doren.","Fordel Films",,"Annapolis, MD",1954,"St. John's College owns the rights to this film.","moving image",mp4,,"St. John's College (Annapolis, Md.). History.","Van Doren, Mark, 1894-1972; McGrath, Hugh P., 1914-1995; Zuckerkandl, Victor; Klein, Jacob; Weigle, Richard Daniel, 1912-; Scofield, Richard; Brown, Ford K. (Ford Keeler); Strange, Miriam; Kiefer, John; Wilburn, Raymond H.","<a href=""https://s3.amazonaws.com/sjcdigitalarchives/original/VTS_01_1.VOB"" title=""Original Uncompressed File"">Original Uncompressed File</a>",English,"St. John's Story, 1954 Compressed",,,,,,,,,,,,,,,,,,,"16 mm film",,00:25:29,,,"Hessler, Gordon, 1925-2014",,,,,,,,,,,,,,,,,,,,,"Alumni,Deans,Presidents,Tutors",https://s3.us-east-1.amazonaws.com/sjcdigitalarchives/original/e31e1173624ad369bac8df384341b4ff.mp4,"Moving Image","SJC Films",1,0
103,https://digitalarchives.sjc.edu/items/show/103,"McDowell Hall with Cupola in Fall, St. John's College, Annapolis, Maryland","1 photographic print : color ",Unknown,,"Annapolis, MD","1954 [circa]","St. John's College owns the rights to this photograph.","still image",jpeg,,,,,,SJC-P-2366,,,,,,,,,,"600 dpi",,,,,,,,,photograph," 18 x 23 cm.",,,,,,,,,,,,,,,,,,,,,,,,,"McDowell Hall",https://s3.us-east-1.amazonaws.com/sjcdigitalarchives/original/2aaf330516566ae2cc4c90c7ab2a9eda.jpg,"Still Image","Photographic Archive—Annapolis",1,1
2011,https://digitalarchives.sjc.edu/items/show/2011,"Alexandra Culbertson on Bed,  Emily Martin (Kutler) Seated on Floor, Linda Grimes Seated at Window, and Priscilla Shore Seated at Desk in a Dormitory Room in Randall Hall","1 photographic print : b&w",Unknown,,"Annapolis, MD","1954 [circa]","St. John's College owns the rights to this photograph.","still image",jpeg,,,,,,SJC-P-0932,,,,,,,,,,,,,,,,,,,photograph,"25.5 x 20.5 cm.",,,,,,,,,,,,,,,,,,,,,,,,,"Alumni,Randall Hall",https://s3.us-east-1.amazonaws.com/sjcdigitalarchives/original/c6721abf35cfe7d1118e218fb84bef1c.jpg,"Still Image","Photographic Archive—Annapolis",1,0
4993,https://digitalarchives.sjc.edu/items/show/4993,"Bernard E. Jacob and Barbara Dvorak (Winiarski) Discuss a Drawing","1 photographic print : b&w","Marx, Hans",,"Annapolis, MD","1954 [circa]","St. John's College owns the rights to this photograph.","Still Image",jpeg,,"Jacob, Bernard E.; Dvorak, Barbara",,,,SJC-P-0924,,,,,,,,,,,,,,,,,,,Photograph,"17.5 x 21.5 cm.",,,,,,,,,,,,,,,,,,,,,,,,,Alumni,https://s3.us-east-1.amazonaws.com/sjcdigitalarchives/original/e0be5caf1a84937a92fae545edde7070.jpg,"Still Image","Photographic Archive—Annapolis",1,0
4999,https://digitalarchives.sjc.edu/items/show/4999,"Emily Martin (Kutler) and Three Female Students Studying in A Dorm Room in Campbell Hall","1 photographic print : b&w",Unknown,,"Annapolis, MD","1954 [circa]","St. John's College owns the rights to this photograph.","Still Image",jpeg,,"St. John's College (Annapolis, Md.). -- Students. ;  Martin, Emily",,,,SJC-P-0932,,,,,,,,,,,,,,,,,,,Photograph,"25.5 x 20.5 cm.",,,,,,,,,,,,,,,,,,,,,,,,,"Alumni,Campbell Hall",https://s3.us-east-1.amazonaws.com/sjcdigitalarchives/original/488704801a841e885d22b447dd357ec7.jpg,"Still Image","Photographic Archive—Annapolis",1,0
