﻿"Item Id","Item URI","Dublin Core:Title","Dublin Core:Description","Dublin Core:Creator","Dublin Core:Publisher","Dublin Core:Coverage","Dublin Core:Date","Dublin Core:Rights","Dublin Core:Type","Dublin Core:Format","Dublin Core:Source","Dublin Core:Subject","Dublin Core:Contributor","Dublin Core:Relation","Dublin Core:Language","Dublin Core:Identifier","Item Type Metadata:Occupation","Item Type Metadata:Participants","Item Type Metadata:Death Date","Item Type Metadata:Birthplace","Item Type Metadata:Birth Date","Item Type Metadata:Interviewer","Item Type Metadata:Biographical Text","Item Type Metadata:Bibliography","Item Type Metadata:Page numeration","Item Type Metadata:Resolution","Item Type Metadata:Identifier","Item Type Metadata:Inventory","Item Type Metadata:URL","Item Type Metadata:Text","Item Type Metadata:Interviewee","Item Type Metadata:Location","Item Type Metadata:Transcription","Item Type Metadata:Local URL","Item Type Metadata:Original Format","Item Type Metadata:Physical Dimensions","Item Type Metadata:Duration","Item Type Metadata:Compression","Item Type Metadata:Producer","Item Type Metadata:Director","Item Type Metadata:Bit Rate/Frequency","Item Type Metadata:Email Body","Item Type Metadata:Event Type","Item Type Metadata:Lesson Plan Text","Item Type Metadata:Materials","Item Type Metadata:Objectives","Item Type Metadata:Standards","Item Type Metadata:Number of Attachments","Item Type Metadata:BCC","Item Type Metadata:CC","Item Type Metadata:To","Item Type Metadata:From","Item Type Metadata:Subject Line","Item Type Metadata:Time Summary","Item Type Metadata:Episode","Item Type Metadata:Season","Item Type Metadata:Episode Type","Item Type Metadata:Explicit","Item Type Metadata:Block","PDF Text:Text",tags,file,itemType,collection,public,featured
7940,https://digitalarchives.sjc.edu/items/show/7940,"The Gadfly, Vol. XLV, Issue 10","Volume XLI, Issue 10 of The Gadfly. Published May 7, 2024. ","Briner, Luke (Editor-in-Chief)","St. John's College","Annapolis, MD",2024-05-07,"St. John's College owns the rights to this publication.",text,pdf,,"College students' writings--Periodicals; College student newspapers and periodicals; St. John's College--Periodicals",,,English,"Gadfly Vol XLV Issue 10",,,,,,,,,"32 pages",,,,,,,,,,pdf,,,,,,,,,,,,,,,,,,,,,,,,,,"Gadfly,Student publication",https://s3.us-east-1.amazonaws.com/sjcdigitalarchives/original/768fb174a355785bfa761595d3319988.pdf,Text,"<em>The Gadfly</em>",1,0
7930,https://digitalarchives.sjc.edu/items/show/7930,"Modern Technology and Modern Discourse","Video recording of a lecture delivered by Annapolis tutor Lee Goldsmith on June 12, 2024, as part of the Graduate Institute Summer Lecture Series.","Goldsmith, Lee","St. John's College","Annapolis, MD",2024-06-12,"Signed permissions form have been received stating, ""I hereby grant St. John's College permission to make an audiovisual recording of my lecture, and retain copies for circulation and archival preservation at the St. John's College Greenfield Library and to make an audiovisual recording of my lecture available online.""","moving image",mp4,,Humanities,"Boyle, Brendan",,English,LEC_Goldsmith_Lee_2024-06-12_ac,,,,,,,,,,,,,,,,,,,"streaming video",,01:03:10,,,,,,,,,,,,,,,,,,,,,,,,"Graduate Institute,Summer lecture series,Tutors",https://s3.us-east-1.amazonaws.com/sjcdigitalarchives/original/34517571309a49129c2749eb14abb287.mp4,"Moving Image","Graduate Institute Summer Lecture Series",1,0
7941,https://digitalarchives.sjc.edu/items/show/7941,"Timeless and Timely: Liberal Education and the Demands of the Present","Video recording of a panel discussion between Brendan Boyle, Associate Dean for Graduate Programs, Jonathan Badger, and Patrick Coleman, St. John's College Tutors, on June 19, 2024, as part of the Graduate Institute Summer Lecture Series.","Boyle, Brendan; Coleman, John Patrick; Badger, Jonathan N.","St. John's College","Annapolis, MD",2024-06-19,,"moving image",mp4,,"Education, Humanistic",,,English,LEC_Panel_Badger-Boyle-Coleman_2024-06-19-ac,,,,,,,,,,,,,,,,,,,"streaming video",,01:33:20,,,,,,,,,,,,,,,,,,,,,,,,"Graduate Institute,Summer lecture series,Tutors",https://s3.us-east-1.amazonaws.com/sjcdigitalarchives/original/44505a691685c0883fa651f5173860a9.mp4,"Moving Image","Graduate Institute Summer Lecture Series",1,0
6233,https://digitalarchives.sjc.edu/items/show/6233,"Maryland State House dome, Annapolis, Maryland","Black and white photographic print. The photograph was taken before the removal of the brick chimneys from the south side of the State House in 1974.  ",Unknown,,"Annapolis, MD","20th century","St. John's College owns the rights to this photograph.","Still Image",jpeg,,"Maryland State House (Annapolis, Md.)",,,,SJC-P-2490,,,,,,,,,,,,,,,,,,,Photograph,"17.5 x 13 cm.",,,,,,,,,,,,,,,,,,,,,,,,,,https://s3.us-east-1.amazonaws.com/sjcdigitalarchives/original/931cf2f5f878aab8a1cb19c73822d47c.jpg,"Still Image","Photographic Archive—Annapolis",1,0
5850,https://digitalarchives.sjc.edu/items/show/5850,"Woodward Hall Library Second Floor Reading Room after the 1969 Renovation, St. John's College, Annapolis, Maryland","1 photographic print : b&w","Stewart Brothers, Inc.",,"Annapolis, MD",3/27/1939,"St. John's College owns the rights to this photograph.","Still Image",jpeg,,,,,,SJC-P-2049,,,,,,,,,,,,,,,,,,,Photograph,"25.5 x 20.5 cm.",,,,,,,,,,,,,,,,,,,,,,,,,"Woodward Hall Library",https://s3.us-east-1.amazonaws.com/sjcdigitalarchives/original/120639354ac5576b87275c58f0bae780.jpg,"Still Image","Photographic Archive—Annapolis",1,0
5847,https://digitalarchives.sjc.edu/items/show/5847,"Empty Library Shelves in the Basement Sub Level of Woodward Hall Library after the 1969 Renovation, St. John's College, Annapolis, Maryland","1 photographic print : b&w","Stewart Brothers, Inc.",,"Annapolis, MD",3/27/1969,"St. John's College owns the rights to this photograph.","Still Image",jpeg,,,,,,SJC-P-2046,,,,,,,,,,,,,,,,,,,Photograph,"25.5 x 20.5 cm.",,,,,,,,,,,,,,,,,,,,,,,,,"Woodward Hall Library",https://s3.us-east-1.amazonaws.com/sjcdigitalarchives/original/3974cf4e71d864ccddf6c8a9f10cdee4.jpg,"Still Image","Photographic Archive—Annapolis",1,0
5848,https://digitalarchives.sjc.edu/items/show/5848,"Empty Library Shelves in the Basement of Woodward Hall Library after the 1969 Renovation, St. John's College, Annapolis, Maryland","1 photographic print : b&w","Stewart Brothers, Inc.",,"Annapolis, MD",3/27/1969,"St. John's College owns the rights to this photograph.","Still Image",jpeg,,,,,,SJC-P-2047,,,,,,,,,,,,,,,,,,,Photograph,"25.5 x 20.5 cm.",,,,,,,,,,,,,,,,,,,,,,,,,"Woodward Hall Library",https://s3.us-east-1.amazonaws.com/sjcdigitalarchives/original/b3fa49ee96d20481d4a5c4431e9a7bb1.jpg,"Still Image","Photographic Archive—Annapolis",1,0
5849,https://digitalarchives.sjc.edu/items/show/5849,"Fireplace in the King William Room in Woodward Hall Library, St. John's College, Annapolis, Maryland","1 photographic print : b&w","Stewart Brothers, Inc.",,"Annapolis, MD",3/27/1969,"St. John's College owns the rights to this photograph.","Still Image",jpeg,,,,,,SJC-P-2048,,,,,,,,,,,,,,,,,,,Photograph,"25.5 x 20.5 cm.",,,,,,,,,,,,,,,,,,,,,,,,,"Woodward Hall Library",https://s3.us-east-1.amazonaws.com/sjcdigitalarchives/original/e4d595153fc29fcf44578d2d51b1f46d.jpg,"Still Image","Photographic Archive—Annapolis",1,0
4683,https://digitalarchives.sjc.edu/items/show/4683,"Three Students Standing in front of Pinkney Hall, St. John's College, Annapolis, Maryland","1 photographic print : b&w","Parran, Tom",,"Annapolis, MD",3/9/1982,"St. John's College owns the rights to this photograph.","Still Image",jpeg,,"St. John's College (Annapolis, Md.). -- Students.",,,,SJC-P-0760,,,,,,,,,,,,,,,,,,,Photograph,"18 x 12.5 cm.",,,,,,,,,,,,,,,,,,,,,,,,,"Pinkney Hall",https://s3.us-east-1.amazonaws.com/sjcdigitalarchives/original/6725a6f610a55955ed9e1eaaa1c2e855.jpg,"Still Image","Photographic Archive—Annapolis",1,0
5458,https://digitalarchives.sjc.edu/items/show/5458,"Front View of Woodward Hall Library, Annapolis, Maryland","1 photographic print : b&w","Stewart Brothers, Inc.",,"Annapolis, MD",4/29/1969,"St. John's college owns the rights to this photograph.","Still Image",jpeg,,,,,,SJC-P-1431,,,,,,,,,,,,,,,,,,,Photograph,"25.5 x 20.5 cm.",,,,,,,,,,,,,,,,,,,,,,,,,"Woodward Hall Library",https://s3.us-east-1.amazonaws.com/sjcdigitalarchives/original/6249a493c91386608ee508664bc7f233.jpg,"Still Image","Photographic Archive—Annapolis",1,0
5844,https://digitalarchives.sjc.edu/items/show/5844,"Rear Side View of Woodward Hall Library, St. John's College, Annapolis, Maryland","1 photographic print : b&w","Stewart Brothers, Inc.",,"Annapolis, MD",4/29/1969,"St. John's College owns the rights to this photograph.","Still Image",jpeg,,,,,,SJC-P-2043,,,,,,,,,,,,,,,,,,,Photograph,"25.5 x 20.5 cm.",,,,,,,,,,,,,,,,,,,,,,,,,"Woodward Hall Library",https://s3.us-east-1.amazonaws.com/sjcdigitalarchives/original/de28acec75666bab015cd8ff64d3a02e.jpg,"Still Image","Photographic Archive—Annapolis",1,0
5845,https://digitalarchives.sjc.edu/items/show/5845,"Woodward Hall Library Lobby after the 1969 Renovation, St. John's College, Annapolis, Maryland","1 photographic print : b&w","Stewart Brothers, Inc.",,"Annapolis, MD",4/29/1969,"St. John's College owns the rights to this photograph.","Still Image",jpeg,,,,,,SJC-P-2044,,,,,,,,,,,,,,,,,,,Photograph,"25.5 x 20.5 cm.",,,,,,,,,,,,,,,,,,,,,,,,,"Francis Scott Key Lobby,Woodward Hall Library",https://s3.us-east-1.amazonaws.com/sjcdigitalarchives/original/f80de49b05faf1c9454f8a1e07ccf6f3.jpg,"Still Image","Photographic Archive—Annapolis",1,0
5846,https://digitalarchives.sjc.edu/items/show/5846,"Woodward Hall Library King William Room after the 1969 Renovation, St. John's College, Annapolis, Maryland","1 photographic print : b&w","Stewart Brothers, Inc.",,"Annapolis, MD",4/29/1969,"St. John's College owns the rights to this photograph.","Still Image",jpeg,,,,,,SJC-P-2045,,,,,,,,,,,,,,,,,,,Photograph,"25.5 x 20.5 cm.",,,,,,,,,,,,,,,,,,,,,,,,,"Woodward Hall Library",https://s3.us-east-1.amazonaws.com/sjcdigitalarchives/original/f16e0bbfece26233011a5c0cb7770ae3.jpg,"Still Image","Photographic Archive—Annapolis",1,0
5144,https://digitalarchives.sjc.edu/items/show/5144,"Eva T. H. Brann, Richard D. Weigle, David Ginsburg, William Kyle Smith and Curtis A. Wilson in Academic Robes during Commencement,  Annapolis, Maryland, 1974","1 photographic print : b&w",Unknown,,"Annapolis, MD",5/14/1974,"St. John's College owns the rights to this photograph.","Still Image",jpeg,,"Weigle, Richard Daniel 1912-;  Brann, Eva T. H.;  Ginsburg, David;  Smith, William Kyle;  Wilson, Curtis.",,,,SJC-P-1129,,,,,,,,,,,,,,,,,,,Photograph,"24 x 16 cm.",,,,,,,,,,,,,,,,,,,,,,,,,"Commencement,Honorary Alumni,Presidents,Tutors",https://s3.us-east-1.amazonaws.com/sjcdigitalarchives/original/8a6d7eb1e94c224fbcd556c6e8f1ca73.jpg,"Still Image","Photographic Archive—Annapolis",1,0
5169,https://digitalarchives.sjc.edu/items/show/5169,"Lee Kinder, Eva T. H. Brann, Richard D. Weigle and David Ginsburg Seated in Academic Robes during Commencement under the Liberty Tree, Annapolis, Maryland, 1974","1 photographic print : b&w",Unknown,,"Annapolis, MD",5/17/1974,"St. John's College owns the rights to this photograph.","Still Image",jpeg,,"Kinder, Lee;  Brann, Eva T. H.;  Weigle, Richard Daniel 1912-;  Ginsburg, David",,,,SJC-P-1130,,,,,,,,,,,,,,,,,,,Photograph,"24 x 16 cm.",,,,,,,,,,,,,,,,,,,,,,,,,"Commencement,Deans,Honorary Alumni,Presidents,Tutors",https://s3.us-east-1.amazonaws.com/sjcdigitalarchives/original/773f515f55a78727b98262cd7f640147.jpg,"Still Image","Photographic Archive—Annapolis",1,0
5170,https://digitalarchives.sjc.edu/items/show/5170,"Eva T. H. Brann, Richard D. Weigle, Thomas Turner in Academic Robes during Commencement under the Liberty Tree, Annapolis, Maryland, 1974","1 photographic print : b&w",Unknown,,"Annapolis, MD",5/17/1974,"St. John's College owns the rights to this photograph.","Still Image",jpeg,,"Brann, Eva T. H.;  Weigle, Richard Daniel 1912-;  Turner, Thomas",,,,SJC-P-1131,,,,,,,,,,,,,,,,,,,Photograph,"25.5 x 20.5 cm.",,,,,,,,,,,,,,,,,,,,,,,,,"Commencement,Deans,Honorary Alumni,Presidents,Tutors",https://s3.us-east-1.amazonaws.com/sjcdigitalarchives/original/9b920aaa42e412aa696af95a139f0d0c.jpg,"Still Image","Photographic Archive—Annapolis",1,0
5171,https://digitalarchives.sjc.edu/items/show/5171,"Graduates Seated in Academic Robes during Commencement, Annapolis, Maryland, 1974","1 photographic print : b&w",Unknown,,"Annapolis, MD",5/17/1974,"St. John's College owns the rights to this photograph.","Still Image",jpeg,,,,,,SJC-P-1132,,,,,,,,,,,,,,,,,,,Photograph,"25.5 x 20.5 cm.",,,,,,,,,,,,,,,,,,,,,,,,,Commencement,https://s3.us-east-1.amazonaws.com/sjcdigitalarchives/original/bb814a78032bddb88d04672aa69db556.jpg,"Still Image","Photographic Archive—Annapolis",1,0
5172,https://digitalarchives.sjc.edu/items/show/5172,"Graduates Seated in Academic Robes during Commencement, Annapolis, Maryland, 1974","1 photographic print : b&w",Unknown,,"Annapolis, MD",5/17/1974,"St. John's College owns the rights to this photograph.","Still Image",jpeg,,,,,,SJC-P-1133,,,,,,,,,,,,,,,,,,,Photograph,"25.5 x 20.5 cm.",,,,,,,,,,,,,,,,,,,,,,,,,Commencement,https://s3.us-east-1.amazonaws.com/sjcdigitalarchives/original/92b917badfcfbc0284410a27e143d555.jpg,"Still Image","Photographic Archive—Annapolis",1,0
5173,https://digitalarchives.sjc.edu/items/show/5173,"Richard D. Weigle Congratulates Chester Burke in Academic Robes during Commencement, Annapolis, Maryland, 1974","1 photographic print : b&w",Unknown,,"Annapolis, MD",5/17/1974,"St. John's College owns the rights to this photograph.","Still Image",jpeg,,"Burke, Chester;  Weigle, Richard Daniel 1912-",,,,SJC-P-1135,,,,,,,,,,,,,,,,,,,Photograph,"25.5 x 20.5 cm.",,,,,,,,,,,,,,,,,,,,,,,,,"Alumni,Commencement,Honorary Alumni,Presidents,Tutors",https://s3.us-east-1.amazonaws.com/sjcdigitalarchives/original/8cf344b38b54e155a6f6dc01a9876daf.jpg,"Still Image","Photographic Archive—Annapolis",1,0
4667,https://digitalarchives.sjc.edu/items/show/4667,"The St. John's College Class of 1979 Seated on Front Campus in Academic Robes during Commencement, St. John's College, Annapolis, Maryland, May 21, 1979","1 photographic print : b&w",Unknown,,"Annapolis, MD",5/21/1979,"St. John's College owns the rights to this photograph.","Still Image",jpeg,,"Commencement (St. John's College, Annapolis, MD) 1979.",,,,SJC-P-0727,,,,,,,,,,,,,,,,,,,Photograph,"18 x 12.5 cm.",,,,,,,,,,,,,,,,,,,,,,,,,Commencement,https://s3.us-east-1.amazonaws.com/sjcdigitalarchives/original/7ed361ce5ee333d5db140fed42af1303.jpg,"Still Image","Photographic Archive—Annapolis",1,0
