﻿"Item Id","Item URI","Dublin Core:Title","Dublin Core:Description","Dublin Core:Creator","Dublin Core:Publisher","Dublin Core:Coverage","Dublin Core:Date","Dublin Core:Rights","Dublin Core:Type","Dublin Core:Format","Dublin Core:Source","Dublin Core:Subject","Dublin Core:Contributor","Dublin Core:Relation","Dublin Core:Language","Dublin Core:Identifier","Item Type Metadata:Occupation","Item Type Metadata:Participants","Item Type Metadata:Death Date","Item Type Metadata:Birthplace","Item Type Metadata:Birth Date","Item Type Metadata:Interviewer","Item Type Metadata:Biographical Text","Item Type Metadata:Bibliography","Item Type Metadata:Page numeration","Item Type Metadata:Resolution","Item Type Metadata:Identifier","Item Type Metadata:Inventory","Item Type Metadata:URL","Item Type Metadata:Text","Item Type Metadata:Interviewee","Item Type Metadata:Location","Item Type Metadata:Transcription","Item Type Metadata:Local URL","Item Type Metadata:Original Format","Item Type Metadata:Physical Dimensions","Item Type Metadata:Duration","Item Type Metadata:Compression","Item Type Metadata:Producer","Item Type Metadata:Director","Item Type Metadata:Bit Rate/Frequency","Item Type Metadata:Email Body","Item Type Metadata:Event Type","Item Type Metadata:Lesson Plan Text","Item Type Metadata:Materials","Item Type Metadata:Objectives","Item Type Metadata:Standards","Item Type Metadata:Number of Attachments","Item Type Metadata:BCC","Item Type Metadata:CC","Item Type Metadata:To","Item Type Metadata:From","Item Type Metadata:Subject Line","Item Type Metadata:Time Summary","Item Type Metadata:Episode","Item Type Metadata:Season","Item Type Metadata:Episode Type","Item Type Metadata:Explicit","Item Type Metadata:Block","PDF Text:Text",tags,file,itemType,collection,public,featured
2534,https://digitalarchives.sjc.edu/items/show/2534,"St. John's Collegian, November 13, 1942","Vol. XXV, No. 6 of the St. John's Collegian.  Published on November 13, 1942.",,"St. John's College","Annapolis, MD",1942-11-13,"St. John's College owns the rights to this publication.",text,pdf,,,,,English,"Collegian Vol. XXV No. 06",,,,,,,,,"4 pages",,,,,,,,,,paper,,,,,,,,,,,,,,,,,,,,,,,,,,"Student publication,The Collegian",https://s3.us-east-1.amazonaws.com/sjcdigitalarchives/original/78ded45e39fb231636026fb5d663a691.pdf,Text,"The Collegian",1,0
2533,https://digitalarchives.sjc.edu/items/show/2533,"St. John's Collegian, October 30, 1942","Vol. XXV, No. 5 of the St. John's Collegian.  Published on October 30, 1942.",,"St. John's College","Annapolis, MD",1942-10-30,"St. John's College owns the rights to this publication.",text,pdf,,,,,English,"Collegian Vol. XXV No. 05",,,,,,,,,"4 pages",,,,,,,,,,paper,,,,,,,,,,,,,,,,,,,,,,,,,,"Student publication,The Collegian",https://s3.us-east-1.amazonaws.com/sjcdigitalarchives/original/93ab0804182eb5187ea730b4c5ff8141.pdf,Text,"The Collegian",1,0
2532,https://digitalarchives.sjc.edu/items/show/2532,"St. John's Collegian, October 23, 1942","Vol. XXV, No. 4 of the St. John's Collegian.  Published on October 23, 1942.",,"St. John's College","Annapolis, MD",1942-10-23,"St. John's College owns the rights to this publication.",text,pdf,,,,,English,"Collegian Vol. XXV No. 04",,,,,,,,,"4 pages",,,,,,,,,,paper,,,,,,,,,,,,,,,,,,,,,,,,,,"Student publication,The Collegian",https://s3.us-east-1.amazonaws.com/sjcdigitalarchives/original/94203676809bda73716a9548f86a9777.pdf,Text,"The Collegian",1,0
2531,https://digitalarchives.sjc.edu/items/show/2531,"St. John's Collegian, October 16, 1942","Vol. XXV, No. 3 of the St. John's Collegian.  Published on October 16, 1942.",,"St. John's College","Annapolis, MD",1942-10-16,"St. John's College owns the rights to this publication.",text,pdf,,,,,English,"Collegian Vol. XXV No. 03",,,,,,,,,"4 pages",,,,,,,,,,paper,,,,,,,,,,,,,,,,,,,,,,,,,,"Student publication,The Collegian",https://s3.us-east-1.amazonaws.com/sjcdigitalarchives/original/ec1d790ee732b98e3c7e7eba11070614.pdf,Text,"The Collegian",1,0
7802,https://digitalarchives.sjc.edu/items/show/7802,"Supplementary Bulletin, St. John's College, July 1942","Supplementary Bulletin, St. John's College, ""Report of the President."" Published in July 1942.","St. John's College","St. John's College","Annapolis, MD",1942-07,"St. John's College owns the rights to this publication.",text,pdf,,"St. John's College (Annapolis, Md.)--Periodicals",,,English,SupplementaryBulletin_1942_July,,,,,,,,,"21 pages",,,,,,,,,,paper,,,,,,,,,,,,,,,,,,,,,,,,,,"President's Report,Presidents",https://s3.us-east-1.amazonaws.com/sjcdigitalarchives/original/558694b58c19aa8951802e0971d3ebcf.pdf,Text,"The Bulletin",1,0
3193,https://digitalarchives.sjc.edu/items/show/3193,"Commencement Program,  1942","Commencement Exercises.  1696-1942","St. John's College","St. John's College","Annapolis, MD",1942-06-09,"St. John's College owns the rights to this publication.",text,pdf,,,,,English,"Commencement Exercises from 1942 {1942-06-09}",,,,,,,,,"5 pages",,,,,,,,,,paper,,,,,,,,,,,,,,,,,,,,,,,,,,Commencement,https://s3.us-east-1.amazonaws.com/sjcdigitalarchives/original/04d409b8d46a46395b4219bd5a1ea2f2.pdf,Text,"Commencement Programs and Addresses",1,0
1289,https://digitalarchives.sjc.edu/items/show/1289,"Benefit Concert for Allies War Relief","Program of the Benefit Concert for Allies War Relief under the aptronage of Lord and Lady Halifax and Russian War Relief. Guest artist was Natalie Badanya. In addition is a letter dated March 28, 1976 by one of the performers from the college.",,"St. John's College","Annapolis, MD",1942-05-20,"St. John's College owns the rights to this publication.",text,pdf,,,,,English,Bx1-31,,,,,,,,,"6 pages",,,,,,,,,,paper,,,,,,,,,,,,,,,,,,,,,,,,,,,https://s3.us-east-1.amazonaws.com/sjcdigitalarchives/original/7d49441985bd172fa2f1e3347c840713.pdf,Text,"Playbills & Programs",1,0
1288,https://digitalarchives.sjc.edu/items/show/1288,"The Lisa Gardiner Ballet","Program of The Lisa Gardiner Ballet assisted by Kathryn Mullowny",,"St. John's College","Annapolis, MD",1942-04-11,"St. John's College owns the rights to this publication.",text,pdf,,,,,English,Bx1-30,,,,,,,,,"3 pages",,,,,,,,,,paper,,,,,,,,,,,,,,,,,,,,,,,,,,,https://s3.us-east-1.amazonaws.com/sjcdigitalarchives/original/7e54b4f4e6617c4cc7db04c6f31fc0cb.pdf,Text,"Playbills & Programs",1,0
175,https://digitalarchives.sjc.edu/items/show/175,"St. John's College in Annapolis: Official Statement of the St. John's Program, Catalogue for 1941-1942","College catalog for the years 1941-1942","St. John's College","St. John's College","Annapolis, MD",1942-04,"St. John's College owns the rights to this publication.",text,pdf,,,,,English,,,,,,,,,,"85 pages",,,,,,,,,,paper,,,,,,,,,,,,,,,,,,,,,,,,,,"Catalog,Catalogue",https://s3.us-east-1.amazonaws.com/sjcdigitalarchives/original/c44c9ad7c9a937b1604c9d56daa56ee7.pdf,Text,"College Catalogs and Statements of the Program",1,0
1287,https://digitalarchives.sjc.edu/items/show/1287,"American Red Cross Benefit Concert","Program of the American Red Cross Benefit Concert. Performers include St. John's Community Orhcestra and Chrous with conductor Nicolas Nabokov",,"St. John's College","Annapolis, MD",1942-03-01,"St. John's College owns the rights to this publication.",text,pdf,,"Nabokov, Nicolas, 1903-1978",,,English,Bx1-29,,,,,,,,,"1 page",,,,,,,,,,paper,,,,,,,,,,,,,,,,,,,,,,,,,,,https://s3.us-east-1.amazonaws.com/sjcdigitalarchives/original/eb9dc0bef97496b79163bf22cb5e18e2.pdf,Text,"Playbills & Programs",1,0
1286,https://digitalarchives.sjc.edu/items/show/1286,"Song Recital","Program of Constance Sullivan (vocalist) and Paul Meyer (piano)",,"St. John's College","Annapolis, MD",1942-01-09,"St. John's College owns the rights to this publication.",text,pdf,,,,,English,Bx1-28,,,,,,,,,"3 pages",,,,,,,,,,paper,,,,,,,,,,,,,,,,,,,,,,,,,,,https://s3.us-east-1.amazonaws.com/sjcdigitalarchives/original/bb9c1405bcdb38fd7ca29d030c576624.pdf,Text,"Playbills & Programs",1,0
5827,https://digitalarchives.sjc.edu/items/show/5827,"Group Portrait of the St. John's College Class of 1942 in front of Randall Hall, Annapolis, Maryland","1 photographic print : b&w",Unknown,,"Annapolis, MD","1942 [circa]","St. John's College owns the rights to this photograph.","Still Image",jpeg,,"Group Portraits",,,,SJC-P-1909,,,,,,,,,,,,,,,,,,,Photograph,"25.5 x 20.5 cm.",,,,,,,,,,,,,,,,,,,,,,,,,"Alumni,Randall Hall",https://s3.us-east-1.amazonaws.com/sjcdigitalarchives/original/58cb6c3b555bd48d746226c1d4f06824.jpg,"Still Image","Photographic Archive—Annapolis",1,0
5826,https://digitalarchives.sjc.edu/items/show/5826,"Group Portrait of the St. John's College Class of 1942 on the Porch of McDowell Hall, Annapolis, Maryland","1 photographic print : b&w",Unknown,,"Annapolis, MD","1942 [circa]","St. John's College owns the rights to this photograph.","Still Image",jpeg,,"Group Portraits",,,,SJC-P-1908,,,,,,,,,,,,,,,,,,,Photograph,"25.5 x 20.5 cm.",,,,,,,,,,,,,,,,,,,,,,,,,"Alumni,McDowell Hall",https://s3.us-east-1.amazonaws.com/sjcdigitalarchives/original/44830583193de42318aadeb6b644bb21.jpg,"Still Image","Photographic Archive—Annapolis",1,0
5080,https://digitalarchives.sjc.edu/items/show/5080,"The Old Clothes Dance in Iglehart Hall","1 photographic print : b&w","The Irwins",,"Annapolis, MD","1942 [circa]","St. John's College owns the rights to this photograph.","Still Image",jpeg,,,,,,SJC-P-1003,,,,,,,,,,,,,,,,,,,Photograph,"20.5 x 25.5 cm.",,,,,,,,,,,,,,,,,,,,,,,,,"Iglehart Hall",https://s3.us-east-1.amazonaws.com/sjcdigitalarchives/original/dd86cddd5d80003d1ca7a3dab878c61a.jpg,"Still Image","Photographic Archive—Annapolis",1,0
5079,https://digitalarchives.sjc.edu/items/show/5079,"Two Students Seated at a Piano during the Old Clothes Dance in Iglehart Hall","1 photographic print : b&w","The Irwins",,"Annapolis, MD","1942 [circa]","St. John's College owns the rights to this photograph.","Still Image",jpeg,,,,,,SJC-P-1002,,,,,,,,,,,,,,,,,,,Photograph,"20.5 x 25.5 cm.",,,,,,,,,,,,,,,,,,,,,,,,,"Iglehart Hall",https://s3.us-east-1.amazonaws.com/sjcdigitalarchives/original/49a6aaa594f91c37ac78788addc003db.jpg,"Still Image","Photographic Archive—Annapolis",1,0
5036,https://digitalarchives.sjc.edu/items/show/5036,"William Huttlinger, Ernest J. Heinmuller and Tutor James S. Martin Seated in Discussion","1 photographic print : b&w","Eisenstaedt, Alfred",,"Annapolis, MD","1942 [circa]","St. John's College owns the rights to this photograph.","Still Image",jpeg,,"Heinmuller, Ernest J.;  Huttlinger, William;  Martin, James S.",,,,SJC-P-0951,,,,,,,,,,,,,,,,,,,Photograph,"20.5 x 25.5 cm.",,,,,,,,,,,,,,,,,,,,,,,,,"Alumni,Tutors",https://s3.us-east-1.amazonaws.com/sjcdigitalarchives/original/005a3ad8f8ecf9c47b85c0e1c93caa99.jpg,"Still Image","Photographic Archive—Annapolis",1,0
5035,https://digitalarchives.sjc.edu/items/show/5035,"Portrait of Robert S. Thompson","1 photographic print : b&w","Eisenstaedt, Alfred",,"Annapolis, MD","1942 [circa]","St. John's College owns the rights to this photograph.","Still Image",jpeg,,"Thompson, Robert S.",,,,SJC-P-0950,,,,,,,,,,,,,,,,,,,Photograph,"20.5 x 25.5 cm.",,,,,,,,,,,,,,,,,,,,,,,,,Alumni,https://s3.us-east-1.amazonaws.com/sjcdigitalarchives/original/2c91d9b8242d588683bea3c74ea82f9c.jpg,"Still Image","Photographic Archive—Annapolis",1,0
5034,https://digitalarchives.sjc.edu/items/show/5034,"Portrait of Alexander L Slafkosky","1 photographic print : b&w","Eisenstaedt, Alfred",,"Annapolis, MD","1942 [circa]","St. John's College owns the rights to this photograph.","Still Image",jpeg,,"Slafkosky, Alexander L",,,,SJC-P-0949,,,,,,,,,,,,,,,,,,,Photograph,"20.5 x 25.5 cm.",,,,,,,,,,,,,,,,,,,,,,,,,Alumni,https://s3.us-east-1.amazonaws.com/sjcdigitalarchives/original/1d1a0daa0f6466451d2403dbe30491ab.jpg,"Still Image","Photographic Archive—Annapolis",1,0
5033,https://digitalarchives.sjc.edu/items/show/5033,"Portrait of W. Boswell Childs","1 photographic print : b&w","Eisenstaedt, Alfred",,"Annapolis, MD","1942 [circa]","St. John's College owns the rights to this photograph.","Still Image",jpeg,,"Childs, W. Boswell",,,,SJC-P-0948,,,,,,,,,,,,,,,,,,,Photograph,"20.5 x 25.5 cm.",,,,,,,,,,,,,,,,,,,,,,,,,Alumni,https://s3.us-east-1.amazonaws.com/sjcdigitalarchives/original/e29035b388a6ea1db6073fe69b5c800e.jpg,"Still Image","Photographic Archive—Annapolis",1,0
5032,https://digitalarchives.sjc.edu/items/show/5032,"Portrait of William Darkey","1 photographic print : b&w","Eisenstaedt, Alfred",,"Annapolis, MD","1942 [circa]","St. John's College owns the rights to this photograph.","Still Image",jpeg,,"Darkey, William",,,,SJC-P-0947,,,,,,,,,,,,,,,,,,,Photograph,"20.5 x 25.5 cm.",,,,,,,,,,,,,,,,,,,,,,,,,Alumni,https://s3.us-east-1.amazonaws.com/sjcdigitalarchives/original/1195ee27be3dc89780cfd79c584e3f0c.jpg,"Still Image","Photographic Archive—Annapolis",1,0
