﻿"Item Id","Item URI","Dublin Core:Title","Dublin Core:Description","Dublin Core:Creator","Dublin Core:Publisher","Dublin Core:Coverage","Dublin Core:Date","Dublin Core:Rights","Dublin Core:Type","Dublin Core:Format","Dublin Core:Source","Dublin Core:Subject","Dublin Core:Contributor","Dublin Core:Relation","Dublin Core:Language","Dublin Core:Identifier","Item Type Metadata:Occupation","Item Type Metadata:Participants","Item Type Metadata:Death Date","Item Type Metadata:Birthplace","Item Type Metadata:Birth Date","Item Type Metadata:Interviewer","Item Type Metadata:Biographical Text","Item Type Metadata:Bibliography","Item Type Metadata:Page numeration","Item Type Metadata:Resolution","Item Type Metadata:Identifier","Item Type Metadata:Inventory","Item Type Metadata:URL","Item Type Metadata:Text","Item Type Metadata:Interviewee","Item Type Metadata:Location","Item Type Metadata:Transcription","Item Type Metadata:Local URL","Item Type Metadata:Original Format","Item Type Metadata:Physical Dimensions","Item Type Metadata:Duration","Item Type Metadata:Compression","Item Type Metadata:Producer","Item Type Metadata:Director","Item Type Metadata:Bit Rate/Frequency","Item Type Metadata:Email Body","Item Type Metadata:Event Type","Item Type Metadata:Lesson Plan Text","Item Type Metadata:Materials","Item Type Metadata:Objectives","Item Type Metadata:Standards","Item Type Metadata:Number of Attachments","Item Type Metadata:BCC","Item Type Metadata:CC","Item Type Metadata:To","Item Type Metadata:From","Item Type Metadata:Subject Line","Item Type Metadata:Time Summary","Item Type Metadata:Episode","Item Type Metadata:Season","Item Type Metadata:Episode Type","Item Type Metadata:Explicit","Item Type Metadata:Block","PDF Text:Text",tags,file,itemType,collection,public,featured
4091,https://digitalarchives.sjc.edu/items/show/4091,"The Gadfly, Vol XXVIII Issue 9","Volume XXVIII, Issue 9 of The Gadfly.  Published November 02, 2006.","McClay, Mark F. (Editor-in-Chief)","St. John's College","Annapolis, MD",2006-11-02,"St. John's College owns the rights to this publication.",text,pdf,,,,,English,"Vol. 28 #9",,,,,,,,,"8 pages",,,,,,,,,,paper,,,,,,,,,,,,,,,,,,,,,,,,,,"Gadfly,Student publication",https://s3.us-east-1.amazonaws.com/sjcdigitalarchives/original/2e070d025be6dfbaff9b2948439ed1f7.pdf,Text,"<em>The Gadfly</em>",1,0
4092,https://digitalarchives.sjc.edu/items/show/4092,"The Gadfly, Vol XXVIII Issue 10","Volume XXVIII, Issue 10 of The Gadfly.  Published November 09, 2006.","McClay, Mark F. (Editor-in-Chief)","St. John's College","Annapolis, MD",2006-11-09,"St. John's College owns the rights to this publication.",text,pdf,,,,,English,"Vol. 28 #10",,,,,,,,,"8 pages",,,,,,,,,,paper,,,,,,,,,,,,,,,,,,,,,,,,,,"Gadfly,Student publication",https://s3.us-east-1.amazonaws.com/sjcdigitalarchives/original/77cc5116c01105c4d9baf15570ace79b.pdf,Text,"<em>The Gadfly</em>",1,0
4093,https://digitalarchives.sjc.edu/items/show/4093,"The Gadfly, Vol XXVIII Issue 11","Volume XXVIII, Issue 11 of The Gadfly.  Published November 16, 2006.","McClay, Mark F. (Editor-in-Chief)","St. John's College","Annapolis, MD",2006-11-16,"St. John's College owns the rights to this publication.",text,pdf,,,,,English,"Vol. 28 #11",,,,,,,,,"8 pages",,,,,,,,,,paper,,,,,,,,,,,,,,,,,,,,,,,,,,"Gadfly,Student publication",https://s3.us-east-1.amazonaws.com/sjcdigitalarchives/original/c0f97c9ed733fee759b86aeea396f5d4.pdf,Text,"<em>The Gadfly</em>",1,0
474,https://digitalarchives.sjc.edu/items/show/474,"The privilege of reason : evolution and history","Audio recording of a lecture given on November 17, 2006 by James Carey as part of the Dean's Lecture and Concert Series.","Carey, James","St. John's College","Santa Fe, NM",2006-11-17,"Meem Library has been given permission to make this item available online.",sound,mp3,,Reason,,,English,20012118,,,,,,,,,,,,,,,,,,,CD,,01:01:40,,,,,,,,,,,,,,,,,,,,,,,,"Friday night lecture",https://s3.us-east-1.amazonaws.com/sjcdigitalarchives/original/702954c48a3a805538c3bbec3caec69e.mp3,Sound,"St. John's College Lecture Recordings—Santa Fe",1,0
4094,https://digitalarchives.sjc.edu/items/show/4094,"The Gadfly, Vol XXVIII Issue 12","Volume XXVIII, Issue 12 of The Gadfly.  Published December 07, 2006.","McClay, Mark F. (Editor-in-Chief)","St. John's College","Annapolis, MD",2006-12-07,"St. John's College owns the rights to this publication.",text,pdf,,,,,English,"Vol. 28 #12",,,,,,,,,"12 pages",,,,,,,,,,paper,,,,,,,,,,,,,,,,,,,,,,,,,,"Gadfly,Student publication",https://s3.us-east-1.amazonaws.com/sjcdigitalarchives/original/c48e1e4ed3411e057f88b75d55554072.pdf,Text,"<em>The Gadfly</em>",1,0
230,https://digitalarchives.sjc.edu/items/show/230,"Statement of the St. John's Program 2006-2007","College catalog for the years 2006-2007","St. John's College",,"Annapolis, MD; Santa Fe, NM",2006-2007,"St. John's College owns the rights to this publication.",text,pdf,,,,,English,,,,,,,,,,"88 pages",,,,,,,,,,paper,,,,,,,,,,,,,,,,,,,,,,,,,,"Catalog,Catalogue",https://s3.us-east-1.amazonaws.com/sjcdigitalarchives/original/111b3bd400a68c77997a00cd4fb2f2c3.pdf,Text,"College Catalogs and Statements of the Program",1,0
807,https://digitalarchives.sjc.edu/items/show/807,"Lecture/Concert Schedule First Semester - 2006-2007 (August 24, 2006 - corrected copy) & Second Semester - 2006-2007","Schedule of lectures and concerts for the 2006-2007 Academic Year.","Office of the Dean","St. John's College","Annapolis, MD",2006-2007,"St. John's College owns the rights to this publication.",text,pdf,,,"Dink, Michael; Barbera, André; Poe, L. Harvey (Luke Harvey); Sterling IV, J. Walter; Kutler, Samuel; Tuck, Jonathan; Bagley, Paul; Arieti, James A.; Haefliger, Andreas; Branning, David; Pagano, Frank N.; Tomarchio, John; Sanders, Kirk R., 1966-; The Aulos Ensemble; Smith, Joseph; Mlinko, Ange; Paglia, Camille, 1947-; Norris, James; von Nolcken, Christina; Russell, George; Tipton, Jason A.; King William Players","October 13, 2006. Tuck, Jonathan. <a href=""http://digitalarchives.sjc.edu/items/show/3800"" title=""Baudelaire's swan song"">Baudelaire's swan song</a> (audio); October 13, 2006. Tuck, Jonathan. <a href=""http://digitalarchives.sjc.edu/items/show/3797"">Baudelaire's swan song</a> (typescript)",English,"Lecture Schedule 2006-2008",,,,,,,,,"3 pages",,,,,,,,,,paper,,,,,,,,,,,,,,,,,,,,,,,,,,"Friday night lecture,Lecture schedule",https://s3.us-east-1.amazonaws.com/sjcdigitalarchives/original/905a24c0f76c81129a3bf1e766e514ca.pdf,Text,"St. John's College Formal Lecture Series—Annapolis",1,0
2704,https://digitalarchives.sjc.edu/items/show/2704,"Mitchell Gallery Exhibition Schedule 2006-2007","Mitchell Gallery Exhibition Schedule 2006-2007.  Exhibitions include:  Living with Art: Early American Modernism from the Baker/Pisano Collection of the Heckscher Museum of Art; Joan Miro: Illustrated Books; Graphics by 20th Century Masters from the Cochran Collection; Richard Jolley: Sculptor of Glass from 1985 to the Present; and St. John's College Community Art Exhibition.","St. John's College (Annapolis, Md.). Elizabeth Myers Mitchell Art Gallery",,"Annapolis, MD",2006-2007,"St. John's College owns the rights to this publication.",text,pdf,,"Art museums--Exhibitions",,,English,"Mitchell Gallery Exhibition Schedule 2006-2007",,,,,,,,,"2 pages",,,,,,,,,,,,,,,,,,,,,,,,,,,,,,,,,,,,"Mitchell Art Gallery",https://s3.us-east-1.amazonaws.com/sjcdigitalarchives/original/5357c9fba44c40ba2e1f871e7c858b6d.pdf,Text,"Mitchell Art Gallery Exhibitions",1,0
422,https://digitalarchives.sjc.edu/items/show/422,"The College, Fall 2007","Volume 33, Issue 3 of <em>The College</em> Magazine. Published in Fall 2007.","St. John's College","St. John's College","Annapolis, MD;  Santa Fe, NM",2007,"St. John's College owns the rights to this publication.",text,pdf,,,,,English,The_College_Magazine_Fall_2007,,,,,,,,,"52 pages",,,,,,,,,,paper,,,,,,,,,,,,,,,,,,,,,,,,,,"The College",https://s3.us-east-1.amazonaws.com/sjcdigitalarchives/original/bdfc052da98e9e97ae9ae80e313a568f.pdf,Text,"<em>The College </em>(2001-2017)",1,0
425,https://digitalarchives.sjc.edu/items/show/425,"The College, Spring 2007","Volume 33, Issue 2 of <em>The College</em> Magazine. Published in Spring 2007.","St. John's College","St. John's College","Annapolis, MD;  Santa Fe, NM",2007,"St. John's College owns the rights to this publication.",text,pdf,,,,,English,The_College_Magazine_Spring_2007,,,,,,,,,"52 pages",,,,,,,,,,paper,,,,,,,,,,,,,,,,,,,,,,,,,,"The College",https://s3.us-east-1.amazonaws.com/sjcdigitalarchives/original/3a19509323264357be8eaac0921b176e.pdf,Text,"<em>The College </em>(2001-2017)",1,0
565,https://digitalarchives.sjc.edu/items/show/565,"The St. John's Review, 2007/3","Volume XLIX, number three of The St. John's Review.  Published in 2007.","Office of the Dean","St. John's College","Annapolis, MD",2007,"St. John's College owns the rights to this publication.",text,pdf,,,"Kraus, Pamela; Brann, Eva T. H.; Van Doren, John; Williamson, Robert B.; Zuckerman, Elliott; Curry, Elizabeth; Hunt, Frank; Sachs, Joe; Carey, James; Levine, David; Badger, Jonathan; Alvis, John E.",,English,"ISSN 0277-4720; The_St_Johns_Review_Vol_49_No_3",,,,,,,,,"123 pages",,,,,,,,,,paper,,,,,,,,,,,,,,,,,,,,,,,,,,"St. John's Review",https://s3.us-east-1.amazonaws.com/sjcdigitalarchives/original/c05ca667103a079d66679b0478d4d073.pdf,Text,"<em>The St. John's Review</em>",1,0
566,https://digitalarchives.sjc.edu/items/show/566,"The St. John's Review, 2007/1","Volume XL, number one of The St. John's Review.  Published in 2007.","Office of the Dean","St. John's College","Annapolis, MD",2007,"St. John's College owns the rights to this publication.",text,pdf,,,"Kraus, Pamela; Brann, Eva T. H.; Van Doren, John; Williamson, Robert B.; Zuckerman, Elliott; Guekguezian, Peter Ara; Hunt, Frank; Sachs, Joe; Kohl, Jr., John C.; Sinnett, M. W.; Nelson, Christopher B.",,English,"ISSN 0277-4720; The_St_Johns_Review_Vol_50_No_1_2007",,,,,,,,,"72 pages",,,,,,,,,,paper,,,,,,,,,,,,,,,,,,,,,,,,,,"St. John's Review",https://s3.us-east-1.amazonaws.com/sjcdigitalarchives/original/1a697005dca7268e63bac35e6e95b22e.pdf,Text,"<em>The St. John's Review</em>",1,0
919,https://digitalarchives.sjc.edu/items/show/919,"Summer 2007 Lectures by St. John's Tutors","Schedule of lectures and concerts in Summer 2007, [sponsored by the Graduate Institute].","Office of the Dean","St. John's College","Annapolis, MD",2007,"St. John's College owns the rights to this publication.",text,pdf,,,,,English,"Lecture Schedule 2007 Summer",,,,,,,,,"1 page",,,,,,,,,,paper,,,,,,,,,,,,,,,,,,,,,,,,,,"Graduate Institute,Lecture schedule,Summer lecture series",https://s3.us-east-1.amazonaws.com/sjcdigitalarchives/original/c3d01b68a220a87bfa6792827ea2f304.pdf,Text,"Graduate Institute Summer Lecture Series",1,0
1938,https://digitalarchives.sjc.edu/items/show/1938,"Energeia, Spring 2007","Issue of the Energeia, published in Spring 2007.","Hogan, Sarah (editor)","St. John's College","Annapolis, MD",2007,"St. John's College owns the rights to this publication.",text,pdf,,,,,English,"Energeia Spring 2007",,,,,,,,,"81 pages",,,,,,,,,,paper,,,,,,,,,,,,,,,,,,,,,,,,,,"Energeia,Student publication",https://s3.us-east-1.amazonaws.com/sjcdigitalarchives/original/f78d2f4867f6635a955962be2f6d64f3.pdf,Text,<em>Energeia</em>,1,0
7537,https://digitalarchives.sjc.edu/items/show/7537,"The College, Winter 2007","Volume 33, Issue 1 of The College Magazine. Published in Winter 2007. ","St. John's College ","St. John's College ","Annapolis, MD; Santa Fe, NM ",2007-01,"St. John's College owns the rights to this publication.",text,pdf,,,"Harty, Rosemary (editor) ; Dempsey, Patricia (assistant editor) ; DeBusk, Emily (assistant editor) ; Behrens, Jennifer (art director) ; Benson, Sally ; Brann, Eva ; Burlington, Elizabeth ; Enriques, Jon ; Lemke, Oliver ; Pihas, Gabriel ; Scally, Thomas ; Johnson, David ",,"English ","The College Vol. 33 Issue 1 Winter 2007 ",,,,,,,,,52,,,,,,,,,,paper,,,,,,,,,,,,,,,,,,,,,,,,,,"The College",https://s3.us-east-1.amazonaws.com/sjcdigitalarchives/original/68190bebffa74bd866b58d77fb647b47.pdf,Text,"<em>The College </em>(2001-2017)",1,0
4095,https://digitalarchives.sjc.edu/items/show/4095,"The Gadfly, Vol XXVIII Issue 13","Volume XXVIII, Issue 13 of The Gadfly.  Published January 18, 2007.","McClay, Mark F. (Editor-in-Chief)","St. John's College","Annapolis, MD",2007-01-18,"St. John's College owns the rights to this publication.",text,pdf,,,,,English,"Vol. 28 #13",,,,,,,,,"8 pages",,,,,,,,,,paper,,,,,,,,,,,,,,,,,,,,,,,,,,"Gadfly,Student publication",https://s3.us-east-1.amazonaws.com/sjcdigitalarchives/original/e4a9a1919edafd0e4f4c3e7d56f64d3a.pdf,Text,"<em>The Gadfly</em>",1,0
4096,https://digitalarchives.sjc.edu/items/show/4096,"The Gadfly, Vol XXVIII Issue 14","Volume XXVIII, Issue 14 of The Gadfly.  Published January 25, 2007.","McClay, Mark F. (Editor-in-Chief)","St. John's College","Annapolis, MD",2007-01-25,"St. John's College owns the rights to this publication.",text,pdf,,,,,English,"Vol. 28 #14",,,,,,,,,"8 pages",,,,,,,,,,paper,,,,,,,,,,,,,,,,,,,,,,,,,,"Gadfly,Student publication",https://s3.us-east-1.amazonaws.com/sjcdigitalarchives/original/bd3ce314ee10aedf02188228b2e69120.pdf,Text,"<em>The Gadfly</em>",1,0
400,https://digitalarchives.sjc.edu/items/show/400,"Nietzsche : the power of perceiving","Transcript of a lecture given on January 26, 2007 by Kent Taylor as part of the Dean's Lecture and Concert Series.","Taylor, Kent","St. John's College","Santa Fe, NM",2007-01-26,"Meem Library has been given permission to make this item available online.",text,pdf,,"Nietzsche, Friedrich Wilhelm, 1844-1900.",,,English,24003295,,,,,,,,,"27 pages",,,,,,,,,,paper,,,,,,,,,,,,,,,,,,,,,,,,,,"Friday night lecture",https://s3.us-east-1.amazonaws.com/sjcdigitalarchives/original/296a6c06b979502b796a1a1c4b451c64.pdf,Text,"St. John's College Lecture Transcripts—Santa Fe",1,0
4097,https://digitalarchives.sjc.edu/items/show/4097,"The Gadfly, Vol XXVIII Issue 15","Volume XXVIII, Issue 15 of The Gadfly.  Published February 08, 2007.","McClay, Mark F. (Editor-in-Chief)","St. John's College","Annapolis, MD",2007-02-08,"St. John's College owns the rights to this publication.",text,pdf,,,,,English,"Vol. 28 #15",,,,,,,,,"8 pages",,,,,,,,,,paper,,,,,,,,,,,,,,,,,,,,,,,,,,"Gadfly,Student publication",https://s3.us-east-1.amazonaws.com/sjcdigitalarchives/original/1c61cae3c684be8ba2dbbed9ddc3e7c5.pdf,Text,"<em>The Gadfly</em>",1,0
4098,https://digitalarchives.sjc.edu/items/show/4098,"The Gadfly, Vol XXVIII Issue 16","Volume XXVIII, Issue 16 of The Gadfly.  Published February 15, 2007.","McClay, Mark F. (Editor-in-Chief)","St. John's College","Annapolis, MD",2007-02-15,"St. John's College owns the rights to this publication.",text,pdf,,,,,English,"Vol. 28 #16",,,,,,,,,"8 pages",,,,,,,,,,paper,,,,,,,,,,,,,,,,,,,,,,,,,,"Gadfly,Student publication",https://s3.us-east-1.amazonaws.com/sjcdigitalarchives/original/b019be496de526b718204b2501f4c1fd.pdf,Text,"<em>The Gadfly</em>",1,0
