﻿"Item Id","Item URI","Dublin Core:Title","Dublin Core:Description","Dublin Core:Creator","Dublin Core:Publisher","Dublin Core:Coverage","Dublin Core:Date","Dublin Core:Rights","Dublin Core:Type","Dublin Core:Format","Dublin Core:Source","Dublin Core:Subject","Dublin Core:Contributor","Dublin Core:Relation","Dublin Core:Language","Dublin Core:Identifier","Item Type Metadata:Occupation","Item Type Metadata:Participants","Item Type Metadata:Death Date","Item Type Metadata:Birthplace","Item Type Metadata:Birth Date","Item Type Metadata:Interviewer","Item Type Metadata:Biographical Text","Item Type Metadata:Bibliography","Item Type Metadata:Page numeration","Item Type Metadata:Resolution","Item Type Metadata:Identifier","Item Type Metadata:Inventory","Item Type Metadata:URL","Item Type Metadata:Text","Item Type Metadata:Interviewee","Item Type Metadata:Location","Item Type Metadata:Transcription","Item Type Metadata:Local URL","Item Type Metadata:Original Format","Item Type Metadata:Physical Dimensions","Item Type Metadata:Duration","Item Type Metadata:Compression","Item Type Metadata:Producer","Item Type Metadata:Director","Item Type Metadata:Bit Rate/Frequency","Item Type Metadata:Email Body","Item Type Metadata:Event Type","Item Type Metadata:Lesson Plan Text","Item Type Metadata:Materials","Item Type Metadata:Objectives","Item Type Metadata:Standards","Item Type Metadata:Number of Attachments","Item Type Metadata:BCC","Item Type Metadata:CC","Item Type Metadata:To","Item Type Metadata:From","Item Type Metadata:Subject Line","Item Type Metadata:Time Summary","Item Type Metadata:Episode","Item Type Metadata:Season","Item Type Metadata:Episode Type","Item Type Metadata:Explicit","Item Type Metadata:Block","PDF Text:Text",tags,file,itemType,collection,public,featured
2703,https://digitalarchives.sjc.edu/items/show/2703,"Mitchell Gallery Exhibition Schedule 2005-2006","Mitchell Gallery Exhibition Schedule 2005-2006.  Exhibitions include:  Magic, Myths, and Minerals:  Chinese Jades from the Arthur M. Sackler Gallery; Mitchell Gallery Advisory Board Reflections Exhibition, Silent Auction & Celebration; Ben-Zion: In the Grip of the Five Senses; John Diebholl: The Art of the Piano ""Solos at St. John's College""; The Art of Music from the Baltimore Museum of Art; St. John's College Community Art Exhibition; and small to LARGE: Anne Arundel County Juried Exhibition.","St. John's College (Annapolis, Md.). Elizabeth Myers Mitchell Art Gallery",,"Annapolis, MD",2005-2006,"St. John's College owns the rights to this publication.",text,pdf,,"Art museums--Exhibitions",,,English,"Mitchell Gallery Exhibition Schedule 2005-2006",,,,,,,,,"2 pages",,,,,,,,,,,,,,,,,,,,,,,,,,,,,,,,,,,,"Mitchell Art Gallery",https://s3.us-east-1.amazonaws.com/sjcdigitalarchives/original/765a390d35978c50161c540c5b4819d0.pdf,Text,"Mitchell Art Gallery Exhibitions",1,0
1006,https://digitalarchives.sjc.edu/items/show/1006,"The Gadfly, Vol. XXVII, Issue 13","Volume XXVII, Issue 13 of The Gadfly. Published January 19, 2006.","McClay, Mark F. (Editor in Chief); Roberts, Aaron B. (Editor in Chief)","St. John's College","Annapolis, MD",20056-01-19,"St. John's College owns the rights to this publication.",text,pdf,,,,,English,"Gadfly 27.13",,,,,,,,,"8 pages",,,,,,,,,,paper,,,,,,,,,,,,,,,,,,,,,,,,,,"Gadfly,Student publication",https://s3.us-east-1.amazonaws.com/sjcdigitalarchives/original/16f80895fd0fa1677b37064ab94f716b.pdf,Text,"<em>The Gadfly</em>",1,0
421,https://digitalarchives.sjc.edu/items/show/421,"The College, Fall 2006","Volume 32, Issue 3 of <em>The College</em> Magazine. Published in Fall 2006.","St. John's College","St. John's College","Annapolis, MD;  Santa Fe, NM",2006,"St. John's College owns the rights to this publication.",text,pdf,,,,,English,The_College_Magazine_Fall_2006,,,,,,,,,"48 pages",,,,,,,,,,paper,,,,,,,,,,,,,,,,,,,,,,,,,,"The College",https://s3.us-east-1.amazonaws.com/sjcdigitalarchives/original/62b863c17dfe852b5ecd8eb375e34fb4.pdf,Text,"<em>The College </em>(2001-2017)",1,0
424,https://digitalarchives.sjc.edu/items/show/424,"The College, Spring 2006","Volume 32, Issue 2 of <em>The College</em> Magazine. Published in Spring 2006.","St. John's College","St. John's College","Annapolis, MD;  Santa Fe, NM",2006,"St. John's College owns the rights to this publication.",text,pdf,,,,,English,The_College_Magazine_Spring_2006,,,,,,,,,"48 pages",,,,,,,,,,paper,,,,,,,,,,,,,,,,,,,,,,,,,,"The College",https://s3.us-east-1.amazonaws.com/sjcdigitalarchives/original/adcc1470ad38ef61f7b78f3b1facaed1.pdf,Text,"<em>The College </em>(2001-2017)",1,0
563,https://digitalarchives.sjc.edu/items/show/563,"The St. John's Review, 2006/1","Volume XLIX, number one of The St. John's Review.  Published in 2006.","Office of the Dean","St. John's College","Annapolis, MD",2006,"St. John's College owns the rights to this publication.",text,pdf,,,"Kraus, Pamela; Brann, Eva T. H.; Van Doren, John; Williamson, Robert B.; Zuckerman, Elliott; Navarre, Sarah; Hunt, Frank; Sachs, Joe; Nelson, Charles A.; Lurçat, François; Schoener, Abraham",,English,"ISSN 0277-4720; The_St_Johns_Review_Vol_49_No_1",,,,,,,,,"129 pages",,,,,,,,,,paper,,,,,,,,,,,,,,,,,,,,,,,,,,"St. John's Review",https://s3.us-east-1.amazonaws.com/sjcdigitalarchives/original/dd833f1d98e7314d8a0247b3c0f2fbde.pdf,Text,"<em>The St. John's Review</em>",1,0
564,https://digitalarchives.sjc.edu/items/show/564,"The St. John's Review, 2006/2","Volume XLIX, number three of The St. John's Review.  Published in 2006.","Office of the Dean","St. John's College","Annapolis, MD",2006,"St. John's College owns the rights to this publication.",text,pdf,,,"Kraus, Pamela; Brann, Eva T. H.; Van Doren, John; Williamson, Robert B.; Zuckerman, Elliott; Curry, Elizabeth; Hunt, Frank; Sachs, Joe; Flaumenhauft, Mera J.; Richardson, Robert; Goldberg, Robert",,English,"ISSN 0277-4720; The_St_Johns_Review_Vol_49_No_2",,,,,,,,,"99 pages",,,,,,,,,,paper,,,,,,,,,,,,,,,,,,,,,,,,,,"St. John's Review",https://s3.us-east-1.amazonaws.com/sjcdigitalarchives/original/1d34fc95c65ab9a75a70b8742a1e55a0.pdf,Text,"<em>The St. John's Review</em>",1,0
918,https://digitalarchives.sjc.edu/items/show/918,"Schedule of Wednesday Events, Summer 2006","Schedule of lectures and concerts in Summer 2006, sponsored by the Graduate Institute.","Graduate Institute","St. John's College","Annapolis, MD",2006,"St. John's College owns the rights to this publication.",text,pdf,,,,,English,"Lecture Schedule 2006 Summer",,,,,,,,,"1 page",,,,,,,,,,paper,,,,,,,,,,,,,,,,,,,,,,,,,,"Graduate Institute,Lecture schedule,Summer lecture series",https://s3.us-east-1.amazonaws.com/sjcdigitalarchives/original/ce1e16adc2e7155184cb9d375de06282.pdf,Text,"Graduate Institute Summer Lecture Series",1,0
1937,https://digitalarchives.sjc.edu/items/show/1937,"Energeia, Spring 2006","Issue of the Energeia, published in 2006.","Nemer, Alexis (editor)","St. John's College","Annapolis, MD",2006,"St. John's College owns the rights to this publication.",text,pdf,,,,,English,"Energeia 2006",,,,,,,,,"92 pages",,,,,,,,,,paper,,,,,,,,,,,,,,,,,,,,,,,,,,"Energeia,Student publication",https://s3.us-east-1.amazonaws.com/sjcdigitalarchives/original/c38bf3eae13138a1842342ea979027ae.pdf,Text,<em>Energeia</em>,1,0
7943,https://digitalarchives.sjc.edu/items/show/7943,"A College Unique and Universal ","A College Unique and Universal publication, written for The Campaign for St. John's College in 2006. ","Brann, Eva T. H.","St. John's College","Annapolis, MD; Santa Fe, N.M.",2006,"St. John's College holds the rights to this publication. ",text,pdf,,"St. John's College (Annapolis, Md.); St. John's College (Santa Fe, N.M.); Education, Humanistic",,,English,"College Unique and Universal_2006",,,,,,,,,"39 pages",,,,,,,,,,pdf,,,,,,,,,,,,,,,,,,,,,,,,,,Tutors,https://s3.us-east-1.amazonaws.com/sjcdigitalarchives/original/a5e353c1f1f70e7e355a4bb12d2653ec.pdf,Text,"Promotional Publications",1,0
7538,https://digitalarchives.sjc.edu/items/show/7538,"The College, Winter 2006 ","Volume 32, Issue 1 of The College Magazine. Published in Winter 2006. ","St. John's College","St. John's College ","Annapolis, MD ; Santa Fe, NM ",2006-01,"St. John's College owns the rights to this publication.",text,pdf,,,"Harty, Rosemary (editor) ; Dempsey, Patricia (managing editor) ; Hartnett, John (Santa Fe editor) 
; Behrens, Jennifer (art director); Borden, Sus3an; Goyette, Barbara ; Knapp, Caroline ; Maguran, Andra ; Mattson, Jo Ann ; Naone, Erica ; Utter, Chris ; Johnson, David ",,"English ","The College Vol. 32, Issue 1 Winter 2006",,,,,,,,,52,,,,,,,,,,paper,,,,,,,,,,,,,,,,,,,,,,,,,,"The College",https://s3.us-east-1.amazonaws.com/sjcdigitalarchives/original/6ac89f193dc04cd89da823b16684ac8f.pdf,Text,"<em>The College </em>(2001-2017)",1,0
1007,https://digitalarchives.sjc.edu/items/show/1007,"The Gadfly, Vol. XXVII, Issue 14","Volume XXVII, Issue 14 of The Gadfly. Published January 26, 2006.","McClay, Mark F. (Editor in Chief); Roberts, Aaron B. (Editor in Chief)","St. John's College","Annapolis, MD",2006-01-26,"St. John's College owns the rights to this publication.",text,pdf,,,,,English,"Gadfly 27.14",,,,,,,,,"8 pages",,,,,,,,,,paper,,,,,,,,,,,,,,,,,,,,,,,,,,"Gadfly,Student publication",https://s3.us-east-1.amazonaws.com/sjcdigitalarchives/original/97f8193e6992437c27763c4c0fde255a.pdf,Text,"<em>The Gadfly</em>",1,0
1008,https://digitalarchives.sjc.edu/items/show/1008,"The Gadfly, Vol. XXVII, Issue 15","Volume XXVII, Issue 15 of The Gadfly. Published February 2, 2006.","McClay, Mark F. (Editor in Chief); Roberts, Aaron B. (Editor in Chief)","St. John's College","Annapolis, MD",2006-02-02,"St. John's College owns the rights to this publication.",text,pdf,,,,,English,"Gadfly 27.15",,,,,,,,,"8 pages",,,,,,,,,,paper,,,,,,,,,,,,,,,,,,,,,,,,,,"Gadfly,Student publication",https://s3.us-east-1.amazonaws.com/sjcdigitalarchives/original/f2a2f36e3391bcb19de63dcb592f82a0.pdf,Text,"<em>The Gadfly</em>",1,0
1009,https://digitalarchives.sjc.edu/items/show/1009,"The Gadfly, Vol. XXVII, Issue 17","Volume XXVII, Issue 17 of The Gadfly. Published March 16, 2006.","McClay, Mark F. (Editor in Chief); Roberts, Aaron B. (Editor in Chief)","St. John's College","Annapolis, MD",2006-03-16,"St. John's College owns the rights to this publication.",text,pdf,,,,,English,"Gadfly 27.17",,,,,,,,,"12 pages",,,,,,,,,,paper,,,,,,,,,,,,,,,,,,,,,,,,,,"Gadfly,Student publication",https://s3.us-east-1.amazonaws.com/sjcdigitalarchives/original/c5fa1659a5965a2c8ae9ab85ec11c7a6.pdf,Text,"<em>The Gadfly</em>",1,0
1010,https://digitalarchives.sjc.edu/items/show/1010,"The Gadfly, Vol. XXVII, Issue 18","Volume XXVII, Issue 18 of The Gadfly. Published March 23, 2006.","McClay, Mark F. (Editor in Chief); Roberts, Aaron B. (Editor in Chief)","St. John's College","Annapolis, MD",2006-03-23,"St. John's College owns the rights to this publication.",text,pdf,,,,,English,"Gadfly 27.18",,,,,,,,,"8 pages",,,,,,,,,,paper,,,,,,,,,,,,,,,,,,,,,,,,,,"Gadfly,Student publication",https://s3.us-east-1.amazonaws.com/sjcdigitalarchives/original/c1e10b2a05cfc34bfe00bd7a669d3808.pdf,Text,"<em>The Gadfly</em>",1,0
345,https://digitalarchives.sjc.edu/items/show/345,"Faraday's electric eel, part 1 : the body electric","Transcript of a lecture given on March 29, 2006 by Howard Fisher as part of the Dean's Lecture and Concert Series.","Fisher, Howard J. ","St. John's College","Santa Fe, NM",2006-03-29,"Meem Library has been given permission to make this item available online.",text,pdf,,"Faraday, Michael, 1791-1867.",,,English,24003318,,,,,,,,,"19 pages",,,,,,,,,,paper,,,,,,,,,,,,,,,,,,,,,,,,,,,https://s3.us-east-1.amazonaws.com/sjcdigitalarchives/original/2bc31e414cc4957196e2623bf3c978f3.pdf,Text,"St. John's College Lecture Transcripts—Santa Fe",1,0
1011,https://digitalarchives.sjc.edu/items/show/1011,"The Gadfly, Vol. XXVII, Issue 19","Volume XXVII, Issue 19 of The Gadfly. Published March 30, 2006.","McClay, Mark F. (Editor in Chief); Roberts, Aaron B. (Editor in Chief)","St. John's College","Annapolis, MD",2006-03-30,"St. John's College owns the rights to this publication.",text,pdf,,,,,English,"Gadfly 27.19",,,,,,,,,"8 pages",,,,,,,,,,paper,,,,,,,,,,,,,,,,,,,,,,,,,,"Gadfly,Student publication",https://s3.us-east-1.amazonaws.com/sjcdigitalarchives/original/4c58a20b732d7f098070c2f75dea0ac2.pdf,Text,"<em>The Gadfly</em>",1,0
7905,https://digitalarchives.sjc.edu/items/show/7905,"Charter and Polity of the College, 2006","Charter and Polity of the College, amended and restated April 2006. ","St. John's College","St. John's College","Annapolis, MD; Santa Fe, NM",2006-04,,text,PDF,,"St. John's College (Annapolis, Md.); Legal instruments",,,English,Charter_and_Polity_2006_ac,,,,,,,,,"25 pages",,,,,,,,,,PDF,,,,,,,,,,,,,,,,,,,,,,,,,,"Charter and Polity",https://s3.us-east-1.amazonaws.com/sjcdigitalarchives/original/79cc78b755f0534f5346b8373d1b202c.pdf,Text,"Charter and Polity of the College",1,0
1012,https://digitalarchives.sjc.edu/items/show/1012,"The Gadfly, Vol. XXVII, Issue 20","Volume XXVII, Issue 20 of The Gadfly. Published April 1, 2006.","McClay, Mark F. (Editor in Chief); Roberts, Aaron B. (Editor in Chief)","St. John's College","Annapolis, MD",2006-04-01,"St. John's College owns the rights to this publication.",text,pdf,,,,,English,"Gadfly 27.20",,,,,,,,,"4 pages",,,,,,,,,,paper,,,,,,,,,,,,,,,,,,,,,,,,,,"Gadfly,Student publication",https://s3.us-east-1.amazonaws.com/sjcdigitalarchives/original/e1f2224b97d336d8a11564deba7974e8.pdf,Text,"<em>The Gadfly</em>",1,0
1013,https://digitalarchives.sjc.edu/items/show/1013,"The Gadfly, Vol. XXVII, Issue 21","Volume XXVII, Issue 21 of The Gadfly. Published April 13, 2006.","McClay, Mark F. (Editor in Chief); Roberts, Aaron B. (Editor in Chief)","St. John's College","Annapolis, MD",2006-04-13,"St. John's College owns the rights to this publication.",text,pdf,,,,,English,"Gadfly 27.21",,,,,,,,,"12 pages",,,,,,,,,,paper,,,,,,,,,,,,,,,,,,,,,,,,,,"Gadfly,Student publication",https://s3.us-east-1.amazonaws.com/sjcdigitalarchives/original/715f77919897f77a647e67de522b3b97.pdf,Text,"<em>The Gadfly</em>",1,0
1014,https://digitalarchives.sjc.edu/items/show/1014,"The Gadfly, Vol. XXVII, Issue 22","Volume XXVII, Issue 22 of The Gadfly. Published April 20, 2006.","McClay, Mark F. (Editor in Chief); Roberts, Aaron B. (Editor in Chief)","St. John's College","Annapolis, MD",2006-04-20,"St. John's College owns the rights to this publication.",text,pdf,,,,,English,"Gadfly 27.22",,,,,,,,,"8 pages",,,,,,,,,,paper,,,,,,,,,,,,,,,,,,,,,,,,,,"Gadfly,Student publication",https://s3.us-east-1.amazonaws.com/sjcdigitalarchives/original/5b655d155a24eca394df46d6f84c50a8.pdf,Text,"<em>The Gadfly</em>",1,0
