﻿"Item Id","Item URI","Dublin Core:Title","Dublin Core:Description","Dublin Core:Creator","Dublin Core:Publisher","Dublin Core:Coverage","Dublin Core:Date","Dublin Core:Rights","Dublin Core:Type","Dublin Core:Format","Dublin Core:Source","Dublin Core:Subject","Dublin Core:Contributor","Dublin Core:Relation","Dublin Core:Language","Dublin Core:Identifier","Item Type Metadata:Occupation","Item Type Metadata:Participants","Item Type Metadata:Death Date","Item Type Metadata:Birthplace","Item Type Metadata:Birth Date","Item Type Metadata:Interviewer","Item Type Metadata:Biographical Text","Item Type Metadata:Bibliography","Item Type Metadata:Page numeration","Item Type Metadata:Resolution","Item Type Metadata:Identifier","Item Type Metadata:Inventory","Item Type Metadata:URL","Item Type Metadata:Text","Item Type Metadata:Interviewee","Item Type Metadata:Location","Item Type Metadata:Transcription","Item Type Metadata:Local URL","Item Type Metadata:Original Format","Item Type Metadata:Physical Dimensions","Item Type Metadata:Duration","Item Type Metadata:Compression","Item Type Metadata:Producer","Item Type Metadata:Director","Item Type Metadata:Bit Rate/Frequency","Item Type Metadata:Email Body","Item Type Metadata:Event Type","Item Type Metadata:Lesson Plan Text","Item Type Metadata:Materials","Item Type Metadata:Objectives","Item Type Metadata:Standards","Item Type Metadata:Number of Attachments","Item Type Metadata:BCC","Item Type Metadata:CC","Item Type Metadata:To","Item Type Metadata:From","Item Type Metadata:Subject Line","Item Type Metadata:Time Summary","Item Type Metadata:Episode","Item Type Metadata:Season","Item Type Metadata:Episode Type","Item Type Metadata:Explicit","Item Type Metadata:Block","PDF Text:Text",tags,file,itemType,collection,public,featured
228,https://digitalarchives.sjc.edu/items/show/228,"Statement of the St. John's Program 2004-2005","College catalog for the years 2004-2005","St. John's College",,"Annapolis, MD; Santa Fe, NM",2004-2005,"St. John's College owns the rights to this publication.",text,pdf,,,,,English,,,,,,,,,,"88 pages",,,,,,,,,,paper,,,,,,,,,,,,,,,,,,,,,,,,,,"Catalog,Catalogue",https://s3.us-east-1.amazonaws.com/sjcdigitalarchives/original/bf710aeeb0857920115e3ad0421a75f2.pdf,Text,"College Catalogs and Statements of the Program",1,0
871,https://digitalarchives.sjc.edu/items/show/871,"First Semester Lecture/Concert Schedule 2004-2005 & Second Semester Lecture/Concert Schedule 2004-2005","Schedule of lectures and concerts for the 2004-2005 Academic Year.","Office of the Dean","St. John's College","Annapolis, MD",2004-2005,"St. John's College owns the rights to this publication.",text,pdf,,,"Flaumenhaft, Harvey, 1938-; Kates, Joshua; Berns, Gisela N.; American String Quartet; Carnay, Jonathan; Weiss, Peter; Higuera, Henry, 1952-; Pesic, Peter; Parens, Joshua, 1961-; Ludwig, Paul; Edwards, Harold; Nelson, Stephanie; Batik, Ronald; Tomarchio, John; The Orlando Consort; May, Thomas; Mansfield, Harvey; Casey, Dylan; Nambiar, Sriram; Hinterhuber, Christopher; Lund, Nelson; Duvoisin, Jacques; Sloan, Phillip; King William Players","September 17, 2004. Berns, Gisela. <a href=""http://digitalarchives.sjc.edu/items/show/1080"" title=""Towards &quot;a new birth of freedom&quot;"">Towards ""a new birth of freedom""</a> (audio); September 17, 2004. Berns, Gisela. <a href=""http://digitalarchives.sjc.edu/items/show/1081"" title=""Towards &quot;a new birth of freedom&quot;"">Towards ""a new birth of freedom""</a> (typescript)",English,"Lecture Schedule 2004-2005",,,,,,,,,"4 pages",,,,,,,,,,paper,,,,,,,,,,,,,,,,,,,,,,,,,,"Friday night lecture,Lecture schedule",https://s3.us-east-1.amazonaws.com/sjcdigitalarchives/original/b4cee662e3cd6cc69a66e7cc7d1cd26e.pdf,Text,"St. John's College Formal Lecture Series—Annapolis",1,0
2702,https://digitalarchives.sjc.edu/items/show/2702,"Mitchell Gallery Exhibition Schedule 2004-2005","Mitchell Gallery Exhibition Schedule 2004-2005.  Exhibitions include:  Where the Water Meets the Land: Selected Works from the Phelan Collection; Louise Nevelson: Selections from the Farnsworth Art Museum; The Book of Kings:  Art, War, and the Morgan Library's Medieval Picture Bible; A Community of Artists: The Collection of the Provincetown Art Association and Museum; Heroes, Villians, and Mermaids:  The Fantastical World of Ronald Markman; and St. John's College Community Art Exhibition.","St. John's College (Annapolis, Md.). Elizabeth Myers Mitchell Art Gallery",,"Annapolis, MD",2004-2005,"St. John's College owns the rights to this publication.",text,pdf,,"Art museums--Exhibitions",,,English,"Mitchell Gallery Exhibition Schedule 2004-2005",,,,,,,,,"2 pages",,,,,,,,,,,,,,,,,,,,,,,,,,,,,,,,,,,,"Mitchell Art Gallery",https://s3.us-east-1.amazonaws.com/sjcdigitalarchives/original/00f44f24bce798389ca0974fe108331a.pdf,Text,"Mitchell Art Gallery Exhibitions",1,0
561,https://digitalarchives.sjc.edu/items/show/561,"The St. John's Review, 2005/2","Volume XLVIII, number two of The St. John's Review.  Published in 2005.","Office of the Dean","St. John's College","Annapolis, MD",2005,"St. John's College owns the rights to this publication.",text,pdf,,,"Kraus, Pamela; Brann, Eva T. H.; Van Doren, John; Williamson, Robert B.; Zuckerman, Elliott; Price, Audra; Hunt, Frank; Sachs, Joe; Stephenson, David; Ruhm von Oppen, Beate; Benedict, Steve; Roochnik, David",,English,"ISSN 0277-4720; The_St_Johns_Review_Vol_48_No_2",,,,,,,,,"87 pages",,,,,,,,,,paper,,,,,,,,,,,,,,,,,,,,,,,,,,"St. John's Review",https://s3.us-east-1.amazonaws.com/sjcdigitalarchives/original/c9394d7fbf2c03ad028ff3d073f2229f.pdf,Text,"<em>The St. John's Review</em>",1,0
562,https://digitalarchives.sjc.edu/items/show/562,"The St. John's Review, 2005/3","Volume XLVIII, number three of The St. John's Review.  Published in 2005.","Office of the Dean","St. John's College","Annapolis, MD",2005,"St. John's College owns the rights to this publication.",text,pdf,,,"Kraus, Pamela; Brann, Eva T. H.; Van Doren, John; Williamson, Robert B.; Zuckerman, Elliott; Navarre, Sarah; Hunt, Frank; Sachs, Joe; Thompson, Jerry L.; Stephenson, David; Hopkins, Burt C.; Maschler, Chaninah",,English,"ISSN 0277-4720; The_St_Johns_Review_Vol_48_No_3",,,,,,,,,"89 pages",,,,,,,,,,paper,,,,,,,,,,,,,,,,,,,,,,,,,,"St. John's Review",https://s3.us-east-1.amazonaws.com/sjcdigitalarchives/original/27cf647ee1d07f84e3970649ca46bf7a.pdf,Text,"<em>The St. John's Review</em>",1,0
917,https://digitalarchives.sjc.edu/items/show/917,"Summer lectures 2005","Schedule of lectures and concerts in Summer 2005, sponsored by the Graduate Institute.","Graduate Institute","St. John's College","Annapolis, MD",2005,"St. John's College owns the rights to this publication.",text,pdf,,,,,English,"Lecture Schedule 2005 Summer",,,,,,,,,"1 page",,,,,,,,,,paper,,,,,,,,,,,,,,,,,,,,,,,,,,"Graduate Institute,Lecture schedule,Summer lecture series",https://s3.us-east-1.amazonaws.com/sjcdigitalarchives/original/36177aa40bac674c9caafdb610139551.pdf,Text,"Graduate Institute Summer Lecture Series",1,0
985,https://digitalarchives.sjc.edu/items/show/985,"The Gadfly, Vol. XXVI, Issue 14","Volume XXVI, Issue 14 of The Gadfly. Published in 2005.","Utter, Christopher B. (Editor in Chief)","St. John's College","Annapolis, MD",2005,"St. John's College owns the rights to this publication.",text,pdf,,,,,English,"Gadfly 26.14",,,,,,,,,"12 pages",,,,,,,,,,paper,,,,,,,,,,,,,,,,,,,,,,,,,,"Gadfly,Student publication",https://s3.us-east-1.amazonaws.com/sjcdigitalarchives/original/b63c2f17ead4a7a616cb423bfe79dae9.pdf,Text,"<em>The Gadfly</em>",1,0
1785,https://digitalarchives.sjc.edu/items/show/1785,"The College, Winter 2005","Volume 31, Issue 1 of The College Magazine. Published in Winter 2005.","St. John's College","St. John's College","Annapolis, MD; Santa Fe, NM",2005,"St. John's College owns the rights to this publication.",text,pdf,,,"Harty, Rosemary (editor) ; Hartnett, John (Santa Fe editor) ; Behrens, Jennifer (art director) ; Borden, Sus3an ; Deimel, August ; Goyette, Barbara ; Hughey-Comers, Erin ; Knapp, Carolyn ; Maguran, Andra ; Mattson, Jo Ann; Rinn, Natalie ; Seagraves, Roxanna ; Utter, Christopher; Weiss, Robin ; White, Roseanna ; Johnson, David ; Eoyang, Glenda H. ",,English,"The College Winter 2005",,,,,,,,,"48 pages",,,,,,,,,,paper,,,,,,,,,,,,,,,,,,,,,,,,,,"The College",https://s3.us-east-1.amazonaws.com/sjcdigitalarchives/original/df34baf445a146e2b019b7b9c3037f5b.pdf,Text,"<em>The College </em>(2001-2017)",1,0
1787,https://digitalarchives.sjc.edu/items/show/1787,"The College, Spring 2005","Volume 31, Issue 2 of The College Magazine. Published in Spring 2005.","St. John's College","St. John's College","Annapolis, MD; Santa Fe, NM",2005,"St. John's College owns the rights to this publication.",text,pdf,,,"Harty, Rosemary (editor) ; Dempsey, Patricia (managing editor) ; Hartnet, John (Santa Fe editor) ; Behrens, Jennifer (art director) ; Borden, Sus3an ; Goyette, Barbara ; Hughey-Commers, Erin ; Maguran, Andra ; Mattson, Jo Ann; Naone, Erica ; Weiss, Robin ; Martin, Roger H. ; Verdi, John ; Donnelly, Jennifer A. ; Myers, Linda ; Hughey-Commers, Erin ",,English,,,,,,,,,,"48 pages",,,,,,,,,,paper,,,,,,,,,,,,,,,,,,,,,,,,,,"The College",https://s3.us-east-1.amazonaws.com/sjcdigitalarchives/original/6b8d06ce38e6a21ddf56bf9ce5c6de77.pdf,Text,"<em>The College </em>(2001-2017)",1,0
986,https://digitalarchives.sjc.edu/items/show/986,"The Gadfly, Vol. XXVI, Issue 15","Volume XXVI, Issue 15 of The Gadfly. Published January 18, 2005.","Utter, Christopher B. (Editor in Chief)","St. John's College","Annapolis, MD",2005-01-18,"St. John's College owns the rights to this publication.",text,pdf,,,,,English,"Gadfly 26.15",,,,,,,,,"12 pages",,,,,,,,,,paper,,,,,,,,,,,,,,,,,,,,,,,,,,"Gadfly,Student publication",https://s3.us-east-1.amazonaws.com/sjcdigitalarchives/original/a58aa21cdcb2f3281cf2d278968dbda4.pdf,Text,"<em>The Gadfly</em>",1,0
987,https://digitalarchives.sjc.edu/items/show/987,"The Gadfly, Vol. XXVI, Issue 16.5","Volume XXVI, Issue 16.5 of The Gadfly. Published February 1, 2005.","Utter, Christopher B. (Editor in Chief); Goldstein, Shoshana (Editor in Chief)","St. John's College","Annapolis, MD",2005-02-01,"St. John's College owns the rights to this publication.",text,pdf,,,,,English,"Gadfly 26.16",,,,,,,,,"12 pages",,,,,,,,,,paper,,,,,,,,,,,,,,,,,,,,,,,,,,"Gadfly,Student publication",https://s3.us-east-1.amazonaws.com/sjcdigitalarchives/original/160e994389fb12718a7bb9007df74a6c.pdf,Text,"<em>The Gadfly</em>",1,0
759,https://digitalarchives.sjc.edu/items/show/759,"Making up our minds","Transcript of a lecture given on February 2, 2005 by Robert Richardson as part of the Dean's Lecture and Concert Series.","Richardson, Robert Allan, 1937-","St. John's College","Santa Fe, NM",2005-02-02,"Meem Library has been given permission to make this item available online.",text,pdf,,"Thought and thinking",,,English,24003298,,,,,,,,,"28 pages",,,,,,,,,,paper,,,,,,,,,,,,,,,,,,,,,,,,,,,https://s3.us-east-1.amazonaws.com/sjcdigitalarchives/original/4452524c2997744166e6ce100c8ed48f.pdf,Text,"St. John's College Lecture Transcripts—Santa Fe",1,0
7879,https://digitalarchives.sjc.edu/items/show/7879,"Argument Not Less But More Heroic: Milton's Advent'rous Song in <em>Paradise Lost</em>","Audio recording of a lecture delivered on February 11, 2005, by Thomas May as part of the Formal Lecture Series.","May, Thomas","St. John's College","Annapolis, MD",2005-02-11,"St. John's College has been given permission to make this item available online.",sound,mp3,,"Milton, John, 1608-1674. Paradise lost",,,English,LEC_May_Thomas_2005-02-11_ac,,,,,,,,,,,,,,,,,,,wav,,01:10:07,,,,,,,,,,,,,,,,,,,,,,,,"Friday night lecture,Tutors",https://s3.us-east-1.amazonaws.com/sjcdigitalarchives/original/d29e9c045e69232e417d175ef3c2ae97.mp3,Sound,"St. John's College Formal Lecture Series—Annapolis",1,0
988,https://digitalarchives.sjc.edu/items/show/988,"The Gadfly, Vol. XXVI, Issue 17","Volume XXVI, Issue 17 of The Gadfly. Published February 15, 2005.","Utter, Christopher B. (Editor in Chief); Goldstein, Shoshana (Editor in Chief)","St. John's College","Annapolis, MD",2005-02-15,"St. John's College owns the rights to this publication.",text,pdf,,,,,English,"Gadfly  26.17",,,,,,,,,"12 pages",,,,,,,,,,paper,,,,,,,,,,,,,,,,,,,,,,,,,,"Gadfly,Student publication",https://s3.us-east-1.amazonaws.com/sjcdigitalarchives/original/66293c9a8f97e1b5bf18a643c28b6dbd.pdf,Text,"<em>The Gadfly</em>",1,0
989,https://digitalarchives.sjc.edu/items/show/989,"The Gadfly, Vol. XXVI, Issue 18","Volume XXVI, Issue 18 of The Gadfly. Published February 22, 2005.","Utter, Christopher B. (Editor in Chief); Goldstein, Shoshana (Editor in Chief)","St. John's College","Annapolis, MD",2005-02-22,"St. John's College owns the rights to this publication.",text,pdf,,,,,English,"Gadfly 26.18",,,,,,,,,"8 pages",,,,,,,,,,paper,,,,,,,,,,,,,,,,,,,,,,,,,,"Gadfly,Student publication",https://s3.us-east-1.amazonaws.com/sjcdigitalarchives/original/0e84cdc9896527dce35953ae99ada03b.pdf,Text,"<em>The Gadfly</em>",1,0
6540,https://digitalarchives.sjc.edu/items/show/6540,"Sons of Homer: The Genealogy of an Epic Poem","Typescript of lecture given on March 17, 2005 by Jonathan Tuck.","Tuck, Jonathan",,"Annapolis, MD",2005-03-17,"St. John's College was given permission to make this item available online.",text,pdf,,,,,English,"lec Tuck 2005-03-17",,,,,,,,,"24 pages",,,,,,,,,,paper,,,,,,,,,,,,,,,,,,,,,,,,,,Tutors,https://s3.us-east-1.amazonaws.com/sjcdigitalarchives/original/69672e1f77398a6c6bd167851a019e05.pdf,Text,"St. John's College Formal Lecture Series—Annapolis",1,0
990,https://digitalarchives.sjc.edu/items/show/990,"The Gadfly, Vol. XXVI, Issue 19","Volume XXVI, Issue 19 of The Gadfly. Published March 22, 2005.","Utter, Christopher B. (Editor in Chief); Goldstein, Shoshana (Editor in Chief)","St. John's College","Annapolis, MD",2005-03-22,"St. John's College owns the rights to this publication.",text,pdf,,,,,English,"Gadfly 26.19",,,,,,,,,"8 pages",,,,,,,,,,paper,,,,,,,,,,,,,,,,,,,,,,,,,,"Gadfly,Student publication",https://s3.us-east-1.amazonaws.com/sjcdigitalarchives/original/c401b2a536465bbbe19941c7d93a6344.pdf,Text,"<em>The Gadfly</em>",1,0
991,https://digitalarchives.sjc.edu/items/show/991,"The Gadfly, Vol. XXVI, Issue 21","Volume XXVI, Issue 21 of The Gadfly. Published April 5, 2005.","Utter, Christopher B. (Editor in Chief); Goldstein, Shoshana (Editor in Chief)","St. John's College","Annapolis, MD",2005-04-05,"St. John's College owns the rights to this publication.",text,pdf,,,,,English,"Gadfly 26.21",,,,,,,,,"8 pages",,,,,,,,,,paper,,,,,,,,,,,,,,,,,,,,,,,,,,"Gadfly,Student publication",https://s3.us-east-1.amazonaws.com/sjcdigitalarchives/original/50f59d9a367af46ae1add1cfb98ee7ce.pdf,Text,"<em>The Gadfly</em>",1,0
992,https://digitalarchives.sjc.edu/items/show/992,"The Gadfly, Vol. XXVI, Issue 22","Volume XXVI, Issue 22 of The Gadfly. Published April 12, 2005.","Utter, Christopher B. (Editor in Chief); Goldstein, Shoshana (Editor in Chief)","St. John's College","Annapolis, MD",2005-04-12,"St. John's College owns the rights to this publication.",text,pdf,,,,,English,"Gadfly 26.22",,,,,,,,,"12 pages",,,,,,,,,,paper,,,,,,,,,,,,,,,,,,,,,,,,,,"Gadfly,Student publication",https://s3.us-east-1.amazonaws.com/sjcdigitalarchives/original/e9e6099a28320ca5269f5be9af6c0d7d.pdf,Text,"<em>The Gadfly</em>",1,0
993,https://digitalarchives.sjc.edu/items/show/993,"The Gadfly, Vol. XXVI, Issue 23","Volume XXVI, Issue 23 of The Gadfly. Published April 19, 2005.","Utter, Christopher B. (Editor in Chief); Goldstein, Shoshana (Editor in Chief)","St. John's College","Annapolis, MD",2005-04-19,"St. John's College owns the rights to this publication.",text,pdf,,,,,English,"Gadfly 26.23",,,,,,,,,"12 pages",,,,,,,,,,paper,,,,,,,,,,,,,,,,,,,,,,,,,,"Gadfly,Student publication",https://s3.us-east-1.amazonaws.com/sjcdigitalarchives/original/fdab4540945ef06034b44fab865a1967.pdf,Text,"<em>The Gadfly</em>",1,0
