﻿"Item Id","Item URI","Dublin Core:Title","Dublin Core:Description","Dublin Core:Creator","Dublin Core:Publisher","Dublin Core:Coverage","Dublin Core:Date","Dublin Core:Rights","Dublin Core:Type","Dublin Core:Format","Dublin Core:Source","Dublin Core:Subject","Dublin Core:Contributor","Dublin Core:Relation","Dublin Core:Language","Dublin Core:Identifier","Item Type Metadata:Occupation","Item Type Metadata:Participants","Item Type Metadata:Death Date","Item Type Metadata:Birthplace","Item Type Metadata:Birth Date","Item Type Metadata:Interviewer","Item Type Metadata:Biographical Text","Item Type Metadata:Bibliography","Item Type Metadata:Page numeration","Item Type Metadata:Resolution","Item Type Metadata:Identifier","Item Type Metadata:Inventory","Item Type Metadata:URL","Item Type Metadata:Text","Item Type Metadata:Interviewee","Item Type Metadata:Location","Item Type Metadata:Transcription","Item Type Metadata:Local URL","Item Type Metadata:Original Format","Item Type Metadata:Physical Dimensions","Item Type Metadata:Duration","Item Type Metadata:Compression","Item Type Metadata:Producer","Item Type Metadata:Director","Item Type Metadata:Bit Rate/Frequency","Item Type Metadata:Email Body","Item Type Metadata:Event Type","Item Type Metadata:Lesson Plan Text","Item Type Metadata:Materials","Item Type Metadata:Objectives","Item Type Metadata:Standards","Item Type Metadata:Number of Attachments","Item Type Metadata:BCC","Item Type Metadata:CC","Item Type Metadata:To","Item Type Metadata:From","Item Type Metadata:Subject Line","Item Type Metadata:Time Summary","Item Type Metadata:Episode","Item Type Metadata:Season","Item Type Metadata:Episode Type","Item Type Metadata:Explicit","Item Type Metadata:Block","PDF Text:Text",tags,file,itemType,collection,public,featured
7864,https://digitalarchives.sjc.edu/items/show/7864,"St. John's Collegian, October 26, 2023","Volume 1, issue 6 of the St. John's Collegian, published October 26, 2023. Corrected version of the publication. ","St. John's College (Annapolis, Md.)","St. John's College (Annapolis, Md.)","Annapolis, MD",2023-10-26,"St. John's College holds the rights to this publication.",text,pdf,,"St. John's College (Annapolis, Md.)--Periodicals",,,English,SJCCollegian_vol1_issue6_2023-10-26_Corrected,,,,,,,,,"2 pages",,,,,,,,,,pdf,,,,,,,,,,,,,,,,,,,,,,,,,,"Student publication,The Collegian,The Gadfly",https://s3.us-east-1.amazonaws.com/sjcdigitalarchives/original/ce997214bf4e7d6f7dda093ade2f6fe2.pdf,Text,"<em>The St. John's Collegian</em>",1,0
4026,https://digitalarchives.sjc.edu/items/show/4026,"St. John's Collegian, October 27, 1939","Vol. LV, No. 5 of the St. John's Collegian. Published on October 27, 1939.","Padgett, V. M. (Editor)","St. John's College","Annapolis, MD",1939-10-27,"St. John's College owns the rights to this publication.",text,pdf,,,,,English,Collegian_1939_10_27,,,,,,,,,"4 pages",,,,,,,,,,paper,,,,,,,,,,,,,,,,,,,,,,,,,,"Student publication",https://s3.us-east-1.amazonaws.com/sjcdigitalarchives/original/3ba72c46e044f7953433985bcf69541f.pdf,Text,"The Collegian",1,0
2586,https://digitalarchives.sjc.edu/items/show/2586,"St. John's Collegian, October 27, 1944","Vol. LVII, No. 20 of the St. John's Collegian. Published on October 27, 1944.",,"St. John's College","Annapolis, MD",1944-10-27,"St. John's College owns the rights to this publication.",text,pdf,,,,,English,"Collegian Vol. LVII No. 20",,,,,,,,,"2 pages",,,,,,,,,,paper,,,,,,,,,,,,,,,,,,,,,,,,,,"Student publication,The Collegian",https://s3.us-east-1.amazonaws.com/sjcdigitalarchives/original/72e898c3f0e4c75237096beb6a865431.pdf,Text,"The Collegian",1,0
2811,https://digitalarchives.sjc.edu/items/show/2811,"St. John's Collegian, October 27, 1947","Vol. LXII, No. 1 of the St. John's Collegian. Published on October 27, 1947.",,"St. John's College","Annapolis, MD",1947-10-27,"St. John's College owns the rights to this publication.",text,pdf,,,,,English,"Collegian Vol. LXII No. 01",,,,,,,,,"6 pages",,,,,,,,,,paper,,,,,,,,,,,,,,,,,,,,,,,,,,"The Collegian",https://s3.us-east-1.amazonaws.com/sjcdigitalarchives/original/bf9c5e9739e5ef5a5cf6ee27242cc6d1.pdf,Text,"The Collegian",1,0
6307,https://digitalarchives.sjc.edu/items/show/6307,"St. John's Collegian, October 28, 1927","Vol. XXXVII, No. 14 of the St. John's Collegian. Published on October 28, 1927.","Hartwell, A. A. (Editor-in-Chief)","St. John's College","Annapolis, MD",1927-10-28,"St. John's College owns the rights to this publication.",text,pdf,,,,,English,Collegian_1927_10_28,,,,,,,,,"4 pages",,,,,,,,,,paper,,,,,,,,,,,,,,,,,,,,,,,,,,"Student publication",https://s3.us-east-1.amazonaws.com/sjcdigitalarchives/original/c28c98ffc75bec0471cddc75116facb4.pdf,Text,"The Collegian",1,0
6405,https://digitalarchives.sjc.edu/items/show/6405,"St. John's Collegian, October 28, 1932","Vol. XLIII, No. 18 of the St. John's Collegian. Published on October 28, 1932.","Price, T. B. (Editor-in-Chief)","St. John's College","Annapolis, MD",1932-10-28,"St. John's College owns the rights to this publication.",text,,,pdf,,,English,"Collegian Oct 28 1932",,,,,,,,,"4 pages",,,,,,,,,,paper,,,,,,,,,,,,,,,,,,,,,,,,,,"Student publication",https://s3.us-east-1.amazonaws.com/sjcdigitalarchives/original/d1efdff094c6e35413a43d7ff12104d3.pdf,Text,"The Collegian",1,0
4006,https://digitalarchives.sjc.edu/items/show/4006,"St. John's Collegian, October 28, 1938","Vol. LIII, No. 7 of the St. John's Collegian. Published on October 28, 1938.","Tuckey, B. A. (Editor)","St. John's College","Annapolis, MD",1938-10-28,"St. John's College owns the rights to this publication.",text,pdf,,,,,English,Collegian_1938_10_28,,,,,,,,,"4 pages",,,,,,,,,,paper,,,,,,,,,,,,,,,,,,,,,,,,,,"Student publication",https://s3.us-east-1.amazonaws.com/sjcdigitalarchives/original/3fa66274bb592607db7bd1d1b75d0545.pdf,Text,"The Collegian",1,0
2557,https://digitalarchives.sjc.edu/items/show/2557,"St. John's Collegian, October 29, 1943","Vol. LVI, No. 11 of the St. John's Collegian. Published on October 29, 1943.",,"St. John's College","Annapolis, MD",1943-10-29,"St. John's College owns the rights to this publication.",text,pdf,,,,,English,"Collegian Vol. LVI No. 11",,,,,,,,,"4 pages",,,,,,,,,,paper,,,,,,,,,,,,,,,,,,,,,,,,,,"Student publication,The Collegian",https://s3.us-east-1.amazonaws.com/sjcdigitalarchives/original/19d2818a17f276c21a2f11f316a97303.pdf,Text,"The Collegian",1,0
6376,https://digitalarchives.sjc.edu/items/show/6376,"St. John's Collegian, October 3, 1930","Vol. XLL, No. 9  of the St. John's Collegian. Published on October 3, 1930.","Zimmerman, A. J. (Editor-in-Chief)","St. John's College","Annapolis, MD",1930-10-03,"St. John's College owns the rights to this publication.",text,pdf,,,,,English,Collegian_1930_10_3,,,,,,,,,"8 pages",,,,,,,,,,paper,,,,,,,,,,,,,,,,,,,,,,,,,,"Student publication",https://s3.us-east-1.amazonaws.com/sjcdigitalarchives/original/d999abe8e9391e8094b04404603a1760.pdf,Text,"The Collegian",1,0
2533,https://digitalarchives.sjc.edu/items/show/2533,"St. John's Collegian, October 30, 1942","Vol. XXV, No. 5 of the St. John's Collegian.  Published on October 30, 1942.",,"St. John's College","Annapolis, MD",1942-10-30,"St. John's College owns the rights to this publication.",text,pdf,,,,,English,"Collegian Vol. XXV No. 05",,,,,,,,,"4 pages",,,,,,,,,,paper,,,,,,,,,,,,,,,,,,,,,,,,,,"Student publication,The Collegian",https://s3.us-east-1.amazonaws.com/sjcdigitalarchives/original/93ab0804182eb5187ea730b4c5ff8141.pdf,Text,"The Collegian",1,0
6342,https://digitalarchives.sjc.edu/items/show/6342,"St. John's Collegian, October 31, 1929","Vol. XL, No. 3 of the St. John's Collegian. Published on October 31, 1929.","Monnett Jr., L. L. (Editor-in-Chief)","St. John's College","Annapolis, MD",1929-10-31,"St. John's College owns the rights to this publication.",text,pdf,,,,,English,Collegian_1929_10_31,,,,,,,,,"8 pages",,,,,,,,,,paper,,,,,,,,,,,,,,,,,,,,,,,,,,"Student publication",https://s3.us-east-1.amazonaws.com/sjcdigitalarchives/original/0c2f57dd8dcd5603c2834b9eeb0d4997.pdf,Text,"The Collegian",1,0
6434,https://digitalarchives.sjc.edu/items/show/6434,"St. John's Collegian, October 5, 1933","Vol. XLIV, No. 17 of the St. John's Collegian. Published on October 5, 1933.","Davis, Edwin P., (Editor-in-Chief)","St. John's College","Annapolis, MD",1933-10-05,"St. John's College owns the rights to this publication.",text,pdf,,,,,English,Collegian_10_05_1933,,,,,,,,,"4 pages",,,,,,,,,,paper,,,,,,,,,,,,,,,,,,,,,,,,,,"Student publication",https://s3.us-east-1.amazonaws.com/sjcdigitalarchives/original/bf5df8d1d1c54c7823ab3855aff4695f.pdf,Text,"The Collegian",1,0
6475,https://digitalarchives.sjc.edu/items/show/6475,"St. John's Collegian, October 5, 1934","Vol. XLV, No. 21 of the St. John's Collegian. Published on October 5, 1934.","Lampee, Robert H. (Editor-in-Chief)","St. John's College","Annapolis, MD",1934-10-05,"St. John's College owns the rights to this publication.",text,pdf,,,,,English,Collegian_1934_10_5,,,,,,,,,"4 pages",,,,,,,,,,paper,,,,,,,,,,,,,,,,,,,,,,,,,,"Student publication",https://s3.us-east-1.amazonaws.com/sjcdigitalarchives/original/7db2823210ff73f1fbda82cb438290c8.pdf,Text,"The Collegian",1,0
7855,https://digitalarchives.sjc.edu/items/show/7855,"St. John's Collegian, October 5, 2023","Volume 1, issue 4 of the St. John's Collegian, published October 5, 2023.","St. John's College (Annapolis, Md.)","St. John's College (Annapolis, Md.)","Annapolis, MD",2023-10-05,"St. John's College holds the rights to this publication.",text,pdf,,"St. John's College (Annapolis, Md.)--Periodicals",,,English,SJCCollegian_vol1_issue4_2023-10-05,,,,,,,,,"2 pages",,,,,,,,,,pdf,,,,,,,,,,,,,,,,,,,,,,,,,,"Student publication,The Collegian,The Gadfly",https://s3.us-east-1.amazonaws.com/sjcdigitalarchives/original/01e8588472dce7c3ba3a9793dfaf2a24.pdf,Text,"<em>The St. John's Collegian</em>",1,0
4023,https://digitalarchives.sjc.edu/items/show/4023,"St. John's Collegian, October 6, 1939","Vol. LV, No. 2 of the St. John's Collegian. Published on October 6, 1939.","Padgett, V. M. (Editor)","St. John's College","Annapolis, MD",1939-10-06,"St. John's College owns the rights to this publication.",text,pdf,,,,,English,Collegian_1939_10_6,,,,,,,,,"4 pages",,,,,,,,,,paper,,,,,,,,,,,,,,,,,,,,,,,,,,"Student publication",https://s3.us-east-1.amazonaws.com/sjcdigitalarchives/original/a53548e3534c703fdbe5666635e8a23e.pdf,Text,"The Collegian",1,0
6306,https://digitalarchives.sjc.edu/items/show/6306,"St. John's Collegian, October 7, 1927","Vol. XXXVII, No. 11 of the St. John's Collegian. Published on October 7, 1927.","Crowley Jr., David F. (Editor-in-Chief)","St. John's College","Annapolis, MD",1927-10-07,"St. John's College owns the rights to this publication.",text,pdf,,,,,English,Collegian_1927_10_7,,,,,,,,,"6 pages",,,,,,,,,,paper,,,,,,,,,,,,,,,,,,,,,,,,,,"Student publication",https://s3.us-east-1.amazonaws.com/sjcdigitalarchives/original/a14e8825fbe85d73e5d04c0ee8bf7726.pdf,Text,"The Collegian",1,0
6402,https://digitalarchives.sjc.edu/items/show/6402,"St. John's Collegian, October 7, 1932","Vol. XLIII, No. 15 of the St. John's Collegian. Published on October 7, 1932.","Price, T. B. (Editor-in-Chief)","St. John's College","Annapolis, MD",1932-10-07,"St. John's College owns the rights to this publication.",text,,,pdf,,,English,"Collegian Oct 7 1932",,,,,,,,,"4 pages",,,,,,,,,,paper,,,,,,,,,,,,,,,,,,,,,,,,,,"Student publication",https://s3.us-east-1.amazonaws.com/sjcdigitalarchives/original/6d428304b4da8668ca67ffc41c6537de.pdf,Text,"The Collegian",1,0
2582,https://digitalarchives.sjc.edu/items/show/2582,"St. John's Collegian, September 01, 1944","Vol. LVII, No. 16 of the St. John's Collegian. Published on September 01, 1944.",,"St. John's College","Annapolis, MD",1944-09-01,"St. John's College owns the rights to this publication.",text,pdf,,,,,English,"Collegian Vol. LVII No. 16",,,,,,,,,"4 pages",,,,,,,,,,paper,,,,,,,,,,,,,,,,,,,,,,,,,,"Student publication,The Collegian",https://s3.us-east-1.amazonaws.com/sjcdigitalarchives/original/5a09a4ba647bdc40937e082eb2075356.pdf,Text,"The Collegian",1,0
2552,https://digitalarchives.sjc.edu/items/show/2552,"St. John's Collegian, September 03, 1943","Vol. LVI, No. 6 of the St. John's Collegian. Published on September 03, 1943.",,"St. John's College","Annapolis, MD",1943-09-03,"St. John's College owns the rights to this publication.",text,pdf,,,,,English,"Collegian Vol. LVI No. 06",,,,,,,,,"4 pages",,,,,,,,,,paper,,,,,,,,,,,,,,,,,,,,,,,,,,"Student publication,The Collegian",https://s3.us-east-1.amazonaws.com/sjcdigitalarchives/original/0a907c9313252a5c29d1ed1d8c564d63.pdf,Text,"The Collegian",1,0
2583,https://digitalarchives.sjc.edu/items/show/2583,"St. John's Collegian, September 08, 1944","Vol. LVII, No. 17 of the St. John's Collegian. Published on September 08, 1944.",,"St. John's College","Annapolis, MD",1944-09-08,"St. John's College owns the rights to this publication.",text,pdf,,,,,English,"Collegian Vol. LVII No. 17",,,,,,,,,"4 pages",,,,,,,,,,paper,,,,,,,,,,,,,,,,,,,,,,,,,,"Student publication,The Collegian",https://s3.us-east-1.amazonaws.com/sjcdigitalarchives/original/5c9ee3a471c69c691dca1739747d7c13.pdf,Text,"The Collegian",1,0
