﻿"Item Id","Item URI","Dublin Core:Title","Dublin Core:Description","Dublin Core:Creator","Dublin Core:Publisher","Dublin Core:Coverage","Dublin Core:Date","Dublin Core:Rights","Dublin Core:Type","Dublin Core:Format","Dublin Core:Source","Dublin Core:Subject","Dublin Core:Contributor","Dublin Core:Relation","Dublin Core:Language","Dublin Core:Identifier","Item Type Metadata:Occupation","Item Type Metadata:Participants","Item Type Metadata:Death Date","Item Type Metadata:Birthplace","Item Type Metadata:Birth Date","Item Type Metadata:Interviewer","Item Type Metadata:Biographical Text","Item Type Metadata:Bibliography","Item Type Metadata:Page numeration","Item Type Metadata:Resolution","Item Type Metadata:Identifier","Item Type Metadata:Inventory","Item Type Metadata:URL","Item Type Metadata:Text","Item Type Metadata:Interviewee","Item Type Metadata:Location","Item Type Metadata:Transcription","Item Type Metadata:Local URL","Item Type Metadata:Original Format","Item Type Metadata:Physical Dimensions","Item Type Metadata:Duration","Item Type Metadata:Compression","Item Type Metadata:Producer","Item Type Metadata:Director","Item Type Metadata:Bit Rate/Frequency","Item Type Metadata:Email Body","Item Type Metadata:Event Type","Item Type Metadata:Lesson Plan Text","Item Type Metadata:Materials","Item Type Metadata:Objectives","Item Type Metadata:Standards","Item Type Metadata:Number of Attachments","Item Type Metadata:BCC","Item Type Metadata:CC","Item Type Metadata:To","Item Type Metadata:From","Item Type Metadata:Subject Line","Item Type Metadata:Time Summary","Item Type Metadata:Episode","Item Type Metadata:Season","Item Type Metadata:Episode Type","Item Type Metadata:Explicit","Item Type Metadata:Block","PDF Text:Text",tags,file,itemType,collection,public,featured
1885,https://digitalarchives.sjc.edu/items/show/1885,"The Gadfly, Vol. V, Issue 14","Volume V, Issue 14 of The Gadfly. Published January 24, 1984.","Walling, Karl (Editor)","St. John's College","Annapolis, MD",1984-01-24,"St. John's College owns the rights to this publication.",text,pdf,,,,,English,"Vol. 05 #14",,,,,,,,,"20 pages",,,,,,,,,,paper,,,,,,,,,,,,,,,,,,,,,,,,,,"Gadfly,Student publication",https://s3.us-east-1.amazonaws.com/sjcdigitalarchives/original/6f923cf3ee39b8bb0e45030cac438226.pdf,Text,"<em>The Gadfly</em>",1,0
1886,https://digitalarchives.sjc.edu/items/show/1886,"The Gadfly, Vol. V, Issue 15","Volume V, Issue 15 of The Gadfly. Published January 31, 1984.","Walling, Karl (Editor)","St. John's College","Annapolis, MD",1984-01-31,"St. John's College owns the rights to this publication.",text,pdf,,,,,English,"Vol. 05 #15",,,,,,,,,"12 pages",,,,,,,,,,paper,,,,,,,,,,,,,,,,,,,,,,,,,,"Gadfly,Student publication",https://s3.us-east-1.amazonaws.com/sjcdigitalarchives/original/93861d5f746a11095e714fc9debd455a.pdf,Text,"<em>The Gadfly</em>",1,0
3376,https://digitalarchives.sjc.edu/items/show/3376,"The St. John's Reporter, Volume 11 Issue 3","Volume 11, Issue 3 of The St. John's Reporter.  Published in February 1984.",,"Public Relations Office","Annapolis, MD; Santa Fe, NM",1984-02,"St. John's College owns the rights to this publication.",text,pdf,,,,,English,"Vol 11 issue 3 Feb 1984",,,,,,,,,"12 pages",,,,,,,,,,paper,,,,,,,,,,,,,,,,,,,,,,,,,,"The Reporter",https://s3.us-east-1.amazonaws.com/sjcdigitalarchives/original/936726579f0338a47ebe2bc229e01579.pdf,Text,"<em>The St. John's Reporter</em>",1,0
1887,https://digitalarchives.sjc.edu/items/show/1887,"The Gadfly, Vol. V, Issue 16","Volume V, Issue 16 of The Gadfly. Published February 08, 1984.","Walling, Karl (Editor)","St. John's College","Annapolis, MD",1984-02-08,"St. John's College owns the rights to this publication.",text,pdf,,,,,English,"Vol. 05 #16",,,,,,,,,"24 pages",,,,,,,,,,paper,,,,,,,,,,,,,,,,,,,,,,,,,,"Gadfly,Student publication",https://s3.us-east-1.amazonaws.com/sjcdigitalarchives/original/914dbbed6909c687eb346a6e4abe7896.pdf,Text,"<em>The Gadfly</em>",1,0
1888,https://digitalarchives.sjc.edu/items/show/1888,"The Gadfly, Vol. V, Issue 17","Volume V, Issue 17 of The Gadfly. Published February 21, 1984.  (Includes Special Addendum)","Walling, Karl (Editor)","St. John's College","Annapolis, MD",1984-02-21,"St. John's College owns the rights to this publication.",text,pdf,,,,,English,"Vol. 05 #17",,,,,,,,,"20, i pages",,,,,,,,,,paper,,,,,,,,,,,,,,,,,,,,,,,,,,"Gadfly,Student publication",https://s3.us-east-1.amazonaws.com/sjcdigitalarchives/original/0cb6aa44d86123d204c414011cff80f8.pdf,Text,"<em>The Gadfly</em>",1,0
1889,https://digitalarchives.sjc.edu/items/show/1889,"The Gadfly, Vol. V, Issue 18","Volume V, Issue 18 of The Gadfly. Published February 28, 1984.","Walling, Karl (Editor)","St. John's College","Annapolis, MD",1984-02-28,"St. John's College owns the rights to this publication.",text,pdf,,,,,English,"Vol. 05 #18",,,,,,,,,"20 pages",,,,,,,,,,paper,,,,,,,,,,,,,,,,,,,,,,,,,,"Gadfly,Student publication",https://s3.us-east-1.amazonaws.com/sjcdigitalarchives/original/8688003de51444d1c3f8f82b08093df8.pdf,Text,"<em>The Gadfly</em>",1,0
1890,https://digitalarchives.sjc.edu/items/show/1890,"The Gadfly, Vol. V, Issue 19","Volume V, Issue 19 of The Gadfly. Published March 06, 1984.","Walling, Karl (Editor)","St. John's College","Annapolis, MD",1984-03-06,"St. John's College owns the rights to this publication.",text,pdf,,,,,English,"Vol. 05 #19",,,,,,,,,"16 pages",,,,,,,,,,paper,,,,,,,,,,,,,,,,,,,,,,,,,,"Gadfly,Student publication",https://s3.us-east-1.amazonaws.com/sjcdigitalarchives/original/72c1af2eb2bea9ff96300e2d3dd9ff1d.pdf,Text,"<em>The Gadfly</em>",1,0
500,https://digitalarchives.sjc.edu/items/show/500,"The St. John's Review (formerly The College), Spring 1984","Volume XXXV, number 2 of The St. John's Review, formerly The College.  Published in Spring 1984.","Office of the Dean","St. John's College","Annapolis, MD",1984-04,"St. John's College owns the rights to this publication.",text,pdf,,,"Sterling, J. Walter; Parran, Jr., Thomas; Lord, Susan; Freis, S. Richard; Sachs, Joe; Stickney, Cary; Wilson, Curtis A.; Sachs, Joe; Allanbrook, Douglas; Brann, Eva T. H.; Berg, Gretchen; Berman, Ronald; Stephenson, David; Mensch, James; Flaumenhaft, Mera; Klein, Jacob; Spaeth, Robert L.",,English,"ISSN 0277-4720; The_St_Johns_Review_Vol_35_No_2_1984",,,,,,,,,"76 pages",,,,,,,,,,paper,,,,,,,,,,,,,,,,,,,,,,,,,,"St. John's Review",https://s3.us-east-1.amazonaws.com/sjcdigitalarchives/original/0cfdf4b66c5ee4f1d0fc4f9424e1a900.pdf,Text,"<em>The St. John's Review</em>",1,0
3377,https://digitalarchives.sjc.edu/items/show/3377,"The St. John's Reporter, Volume 11 Issue 4","Volume 11, Issue 4 of The St. John's Reporter.  Published in April 1984.",,"Public Relations Office","Annapolis, MD; Santa Fe, NM",1984-04,"St. John's College owns the rights to this publication.",text,pdf,,,,,English,"Vol 11 issue 4 April 1984",,,,,,,,,"12 pages",,,,,,,,,,paper,,,,,,,,,,,,,,,,,,,,,,,,,,"The Reporter",https://s3.us-east-1.amazonaws.com/sjcdigitalarchives/original/eab8f117d1e60cb3a4b7c7734c818bc9.pdf,Text,"<em>The St. John's Reporter</em>",1,0
7787,https://digitalarchives.sjc.edu/items/show/7787,"A Grecian Urn","Audio recording of a lecture delivered on April 6, 1984, by Howard J. Fisher as part of the Formal Lecture Series.","Fisher, Howard J., 1942-",,"Annapolis, MD",1984-04-06,"A signed permission form has been received giving St. John's College blanket permission to make audiovisual recordings of Howard J. Fisher's lectures, speeches, and addresses available online, and to make copes of typescripts of Howard J. Fisher's lectures speeches, and addresses available online.",sound,mp3,,"Symmetry; Art",,,English,LEC_Fisher_Howard_1984-04-06_ac,,,,,,,,,,,,,,,,,,,wav,,01:10:49,,,,,,,,,,,,,,,,,,,,,,,,"Friday night lecture,Tutors",https://s3.us-east-1.amazonaws.com/sjcdigitalarchives/original/77abfdeb9758ed9a7d57128e897740b4.mp3,Sound,"St. John's College Formal Lecture Series—Annapolis",1,0
1891,https://digitalarchives.sjc.edu/items/show/1891,"The Gadfly, Vol. V, Issue 20","Volume V, Issue 20 of The Gadfly. Published April 10, 1984.","Walling, Karl (Editor)","St. John's College","Annapolis, MD",1984-04-10,"St. John's College owns the rights to this publication.",text,pdf,,,,,English,"Vol. 05 #20",,,,,,,,,"16 pages",,,,,,,,,,paper,,,,,,,,,,,,,,,,,,,,,,,,,,"Gadfly,Student publication",https://s3.us-east-1.amazonaws.com/sjcdigitalarchives/original/604cfbc3ad39b41803d9e84558382541.pdf,Text,"<em>The Gadfly</em>",1,0
3809,https://digitalarchives.sjc.edu/items/show/3809,"The song of Timaeus","Audio recording of a lecture delivered on April 13, 1984 by Peter Kalkavage as part of the Formal Lecture Series.","Kalkavage, Peter",,"Annapolis, MD",1984-04-13,"St. John's College has been given permission to make this item available online.",sound,mp3,,,,"<a href=""http://digitalarchives.sjc.edu/items/show/3838"" title=""Typescript"">Typescript</a>",English,"lec Kalkavage 1984-04-13",,,,,,,,,,,,,,,,,,,"audio cassette tape (Tape 652 v. 1 & 2)",,01:12:09,,,,,,,,,,,,,,,,,,,,,,,,"Friday night lecture,Tutors",https://s3.us-east-1.amazonaws.com/sjcdigitalarchives/original/5a488a13fa594175b55aad4aa8244228.mp3,Sound,"St. John's College Formal Lecture Series—Annapolis",1,0
3838,https://digitalarchives.sjc.edu/items/show/3838,"The song of Timaeus","Typescript of a lecture delivered on April 13, 1984 by Peter Kalkavage as part of the Formal Lecture Series. (Reprinted in the St. John's Review, Winter 1985 Issue)","Kalkavage, Peter","St. John's College","Annapolis, MD",1984-04-13,"St. John's College has been given permission to make this item available online.",text,pdf,,,,"<a href=""http://digitalarchives.sjc.edu/items/show/3809"" title=""Audio recording"">Audio recording</a>",English,"lec Kalkavage 1984-04-13",,,,,,,,,"12 pages",,,,,,,,,,paper,,,,,,,,,,,,,,,,,,,,,,,,,,"Friday night lecture,Tutors",https://s3.us-east-1.amazonaws.com/sjcdigitalarchives/original/9fc63e1cfeb59c6d860d234e0fa6ef95.pdf,Text,"St. John's College Formal Lecture Series—Annapolis",1,0
764,https://digitalarchives.sjc.edu/items/show/764,"The fields of light","Transcript of a lecture given on April 20, 1984 by Peter Pesic as part of the Dean's Lecture and Concert Series.","Pesic, Peter","St. John's College","Santa Fe, NM",1984-04-20,"Meem Library has been given permission to make this item available online.",text,pdf,,"Wave theory of light; Light and darkness in literature",,,English,24000151,,,,,,,,,"15 pages",,,,,,,,,,paper,,,,,,,,,,,,,,,,,,,,,,,,,,"Friday night lecture",https://s3.us-east-1.amazonaws.com/sjcdigitalarchives/original/ce42560b8a2d848c7f77d35f6953b221.pdf,Text,"St. John's College Lecture Transcripts—Santa Fe",1,0
1892,https://digitalarchives.sjc.edu/items/show/1892,"The Gadfly, Vol. V, Issue 21","Volume V, Issue 21 of The Gadfly. Published April 21, 1984.","Walling, Karl (Editor)","St. John's College","Annapolis, MD",1984-04-21,"St. John's College owns the rights to this publication.",text,pdf,,,,,English,"Vol. 05 #21",,,,,,,,,"16 pages",,,,,,,,,,paper,,,,,,,,,,,,,,,,,,,,,,,,,,"Gadfly,Student publication",https://s3.us-east-1.amazonaws.com/sjcdigitalarchives/original/168dab0b8a64b54781f276202eabee3c.pdf,Text,"<em>The Gadfly</em>",1,0
1893,https://digitalarchives.sjc.edu/items/show/1893,"The Gadfly, Vol. V, Issue 22","Volume V, Issue 22 of The Gadfly. Published April 24, 1984.","Walling, Karl (Editor)","St. John's College","Annapolis, MD",1984-04-24,"St. John's College owns the rights to this publication.",text,pdf,,,,,English,"Vol. 05 #22",,,,,,,,,"16 pages",,,,,,,,,,paper,,,,,,,,,,,,,,,,,,,,,,,,,,"Gadfly,Student publication",https://s3.us-east-1.amazonaws.com/sjcdigitalarchives/original/e6c227aa1fd03a60619af4e76bbf3acc.pdf,Text,"<em>The Gadfly</em>",1,0
1894,https://digitalarchives.sjc.edu/items/show/1894,"The Gadfly, Vol. V, Issue 23","Volume V, Issue 23 of The Gadfly. Published May 08, 1984.","Walling, Karl (Editor)","St. John's College","Annapolis, MD",1984-05-08,"St. John's College owns the rights to this publication.",text,pdf,,,,,English,"Vol. 05 #23",,,,,,,,,"24 pages",,,,,,,,,,paper,,,,,,,,,,,,,,,,,,,,,,,,,,"Gadfly,Student publication",https://s3.us-east-1.amazonaws.com/sjcdigitalarchives/original/9ff39b78fb83d8d3d4ff68172fb59283.pdf,Text,"<em>The Gadfly</em>",1,0
4661,https://digitalarchives.sjc.edu/items/show/4661,"Santa Fe Commencement Program, Spring 1984","Program for the seventeenth commencement on the Santa Fe campus in the two hundred and eighty-eighth year of St. John's College ","St. John's College","St. John's College","Santa Fe, NM",1984-05-20,"St. John's College owns the rights to this publication. ",text,pdf,,"Commencement (St. John's College, Santa Fe, NM) ",,,"English ","SF Commencement Program 1984-05-20",,,,,,,,,10,,,,,,,,,,paper,,,,,,,,,,,,,,,,,,,,,,,,,,Commencement,https://s3.us-east-1.amazonaws.com/sjcdigitalarchives/original/19df33fb887f7e628bfe832952b03af3.pdf,Text,"Santa Fe Commencement Programs and Addresses",1,0
3308,https://digitalarchives.sjc.edu/items/show/3308,"Commencement Program,  1984","Program for the One Hundred Ninety-Second Commencement in the Two-Hundred and Eighty-Eighth Year of the College.","St. John's College","St. John's College","Annapolis, MD",1984-05-27,"St. John's College owns the rights to this publication.",text,pdf,,,,,English,"Commencement Exercises from 1984 {1984-05-27}",,,,,,,,,"10 pages",,,,,,,,,,paper,,,,,,,,,,,,,,,,,,,,,,,,,,Commencement,https://s3.us-east-1.amazonaws.com/sjcdigitalarchives/original/56afd6ff3e14e75af84df70c0be89a8b.pdf,Text,"Commencement Programs and Addresses",1,0
3378,https://digitalarchives.sjc.edu/items/show/3378,"The St. John's Reporter, Volume 11 Issue 5","Volume 11, Issue 5 of The St. John's Reporter.  Published in June 1984.",,"Public Relations Office","Annapolis, MD; Santa Fe, NM",1984-06,"St. John's College owns the rights to this publication.",text,pdf,,,,,English,"Vol 11 issue 5 June 1984",,,,,,,,,"12 pages",,,,,,,,,,paper,,,,,,,,,,,,,,,,,,,,,,,,,,"The Reporter",https://s3.us-east-1.amazonaws.com/sjcdigitalarchives/original/9511ee7a24d2710ebdd61e154b95537a.pdf,Text,"<em>The St. John's Reporter</em>",1,0
