﻿"Item Id","Item URI","Dublin Core:Title","Dublin Core:Description","Dublin Core:Creator","Dublin Core:Publisher","Dublin Core:Coverage","Dublin Core:Date","Dublin Core:Rights","Dublin Core:Type","Dublin Core:Format","Dublin Core:Source","Dublin Core:Subject","Dublin Core:Contributor","Dublin Core:Relation","Dublin Core:Language","Dublin Core:Identifier","Item Type Metadata:Occupation","Item Type Metadata:Participants","Item Type Metadata:Death Date","Item Type Metadata:Birthplace","Item Type Metadata:Birth Date","Item Type Metadata:Interviewer","Item Type Metadata:Biographical Text","Item Type Metadata:Bibliography","Item Type Metadata:Page numeration","Item Type Metadata:Resolution","Item Type Metadata:Identifier","Item Type Metadata:Inventory","Item Type Metadata:URL","Item Type Metadata:Text","Item Type Metadata:Interviewee","Item Type Metadata:Location","Item Type Metadata:Transcription","Item Type Metadata:Local URL","Item Type Metadata:Original Format","Item Type Metadata:Physical Dimensions","Item Type Metadata:Duration","Item Type Metadata:Compression","Item Type Metadata:Producer","Item Type Metadata:Director","Item Type Metadata:Bit Rate/Frequency","Item Type Metadata:Email Body","Item Type Metadata:Event Type","Item Type Metadata:Lesson Plan Text","Item Type Metadata:Materials","Item Type Metadata:Objectives","Item Type Metadata:Standards","Item Type Metadata:Number of Attachments","Item Type Metadata:BCC","Item Type Metadata:CC","Item Type Metadata:To","Item Type Metadata:From","Item Type Metadata:Subject Line","Item Type Metadata:Time Summary","Item Type Metadata:Episode","Item Type Metadata:Season","Item Type Metadata:Episode Type","Item Type Metadata:Explicit","Item Type Metadata:Block","PDF Text:Text",tags,file,itemType,collection,public,featured
3317,https://digitalarchives.sjc.edu/items/show/3317,"Commencement Program,  1975","Program for the One Hundred and Eighty-Third Commencement in the Two-Hundred and Seventy-Ninth Year of the College. Also includes program addendum for the Baccalaureate Service.","St. John's College","St. John's College","Annapolis, MD",1975-05-25,"St. John's College owns the rights to this publication.",text,pdf,,,,,English,"Commencement Exercise from 1975 {1975-05-25}",,,,,,,,,"8, 2 pages",,,,,,,,,,paper,,,,,,,,,,,,,,,,,,,,,,,,,,Commencement,https://s3.us-east-1.amazonaws.com/sjcdigitalarchives/original/7ea2d18211e028183ec956e6810035c5.pdf,Text,"Commencement Programs and Addresses",1,0
3318,https://digitalarchives.sjc.edu/items/show/3318,"Commencement Program,  1954","Program for the One Hundred and Sixty-Second Commencement in the Two Hundred and Fifty-Seventh Year of the College.","St. John's College","St. John's College","Annapolis, MD",1954-06-14,"St. John's College owns the rights to this publication.",text,pdf,,,,,English,"Commencement Exercises from 1954 {1954-06-14}",,,,,,,,,"6 pages",,,,,,,,,,paper,,,,,,,,,,,,,,,,,,,,,,,,,,Commencement,https://s3.us-east-1.amazonaws.com/sjcdigitalarchives/original/7b5b1d671327ec94f1cebd5e6b93d6c6.pdf,Text,"Commencement Programs and Addresses",1,0
3319,https://digitalarchives.sjc.edu/items/show/3319,"Commencement Program,  1950","Program for the One Hundred and Fifty-Eighth Commencement in the Two Hundred Fifty-Third Year of the College.","St. John's College","St. John's College","Annapolis, MD",1950-06-12,"St. John's College owns the rights to this publication.",text,pdf,,,,,English,"Commencement Exercises from 1950 {1950-06-12}",,,,,,,,,"6 pages",,,,,,,,,,paper,,,,,,,,,,,,,,,,,,,,,,,,,,Commencement,https://s3.us-east-1.amazonaws.com/sjcdigitalarchives/original/7537af574b33b0ac848f20a7d451dcec.pdf,Text,"Commencement Programs and Addresses",1,0
3320,https://digitalarchives.sjc.edu/items/show/3320,"Commencement Program,  1937","Commencement Exercises Under the Liberty Tree. 1696-1937","St. John's College","St. John's College","Annapolis, MD",1937-06-09,"St. John's College owns the rights to this publication.",text,pdf,,,,,English,"Commencement Exercises from 1937 {1937-06-09}",,,,,,,,,"4 pages",,,,,,,,,,paper,,,,,,,,,,,,,,,,,,,,,,,,,,Commencement,https://s3.us-east-1.amazonaws.com/sjcdigitalarchives/original/2c4c678add5564e2e4e5a260a2a2b925.pdf,Text,"Commencement Programs and Addresses",1,0
3420,https://digitalarchives.sjc.edu/items/show/3420,"JohnnieCast, October 24, 2017","Podcast entitled ""JohnnieCast"" featuring President Panayiotis Kanelos.  Moderated by Phelosha Collaros.  Recorded on October 24, 2017.","St. John's College","St. John's College",,2017-10-24,"St. John's College owns the rights to this sound recording.",sound,mp3,,,"Kanelos, Panayiotis; Collaros, Phelosha",,English,"JohnnieCast Oct 24, 2017",,,,,,,,,,,,,,,,,,,wav,,01:08:55,,,,,,,,,,,,,,,,,,,,,,,,Presidents,https://s3.us-east-1.amazonaws.com/sjcdigitalarchives/original/97ccead8ae68345900836126e149ebd2.mp3,Sound,JohnnieCast,1,0
3444,https://digitalarchives.sjc.edu/items/show/3444,"Inauguration Ceremony of Panayiotis Kanelos","Program for the Inauguration Ceremony of Panayiotis Kanelos as the 24th President of St. John's College, Annapolis. ","St. John's College","St. John's College","Annapolis, MD",2017-10-28,"St. John's College owns the rights to this publication.",text,pdf,,,"Saunders-Albin, Pamela
; Roosevelt, Mark; Macfarland, Joseph C.; Kemmer, Brittany; Ongley, Jennifer; Fielding, Ronald; Kanelos, Panayiotis","<a title=""Audio recording"" href=""http://digitalarchives.sjc.edu/items/show/3445"">Audio Recording</a>; <a title=""Typescript"" href=""http://digitalarchives.sjc.edu/items/show/3446"">Typescript</a>",English,"Inauguration Program for Panayiotis Kanelos (10-28-17)",,,,,,,,,"4 pages",,,,,,,,,,paper,,,,,,,,,,,,,,,,,,,,,,,,,,"Deans,Inauguration,Presidents",https://s3.us-east-1.amazonaws.com/sjcdigitalarchives/original/85d104f7b00e08fef105ff45f3aa302b.pdf,Text,"Playbills & Programs",1,0
3445,https://digitalarchives.sjc.edu/items/show/3445,"Inauguration Ceremony of Panayiotis Kanelos","Audio recording of the Inauguration Ceremony of Panayiotis Kanelos held on October 28, 2017 in Annapolis, MD.","St. John's College",,"Annapolis, MD",2017-10-28,,sound,mp3,,,"Saunders-Albin, Pamela; Roosevelt, Mark; Macfarland, Joseph C.; Kemmer, Brittany; Ongley, Jennifer; Fielding, Ronald; Kanelos, Panayiotis","<a title=""Inauguration Program"" href=""http://digitalarchives.sjc.edu/items/show/3444"">Inauguration Program</a>; <a title=""Typescript"" href=""http://digitalarchives.sjc.edu/items/show/3446"">Typescript</a>",English,"Kanelos Inauguration 10-28-17",,,,,,,,,,,,,,,,,,,mp3,,01:04:29,,,,,,,,,,,,,,,,,,,,,,,,"Deans,Inauguration,Presidents",https://s3.us-east-1.amazonaws.com/sjcdigitalarchives/original/3591dd1c6ac603dad961b82635b0e627.mp3,Sound,"Speeches, presentations, and other lectures",1,0
3448,https://digitalarchives.sjc.edu/items/show/3448,"The College, Fall 2017","Volume 42, Issue 2 of the The College Magazine. Published in Fall 2017.","St. John's College","St. John's College","Annapolis, MD; Santa Fe, NM",2017-10,"St. John's College owns the rights to this publication.",text,pdf,,,"Shook, Gregory (editor) ; Lee-Merrion, Harriet ; Petrich, Louise ; Pratt, Tim; Weiss, Robin ; Adam, Judith ; Perleberg Anderson, Anna; Ardoin, Samantha ; Barone, Jonathan ; Carpenter, Carol ; Jusinski, Charlotte ; Kniggendorf, Anne ; McDonald, David ; Tolpa, Eve ; Wice, Andrew ; Behrens, Jennifer (contributing designer) ",,English,"The College Vol. 42, Issue 2 Fall 2017",,,,,,,,,"50 pages",,,,,,,,,,paper,,,,,,,,,,,,,,,,,,,,,,,,,,"The College",https://s3.us-east-1.amazonaws.com/sjcdigitalarchives/original/4ff9a3d370d1e419335bdb3e846a5087.pdf,Text,"<em>The College </em>(2001-2017)",1,0
3622,https://digitalarchives.sjc.edu/items/show/3622,"Commencement Program, 1852","Some account of the commencement of St. John's College, Annapolis, and the attendant exercises, February 23rd, 1852, with a list of the graduates.  Also includes a handwritten poem ""by a non-graduate"".","St. John's College","Sands & Mills","Baltimore, MD",1852-02-23,"St. John's College owns the rights to this publication.",text,pdf,,,,"<a title=""Commencement Address"" href=""http://digitalarchives.sjc.edu/items/show/3621"">Commencement Address</a>",English,"Some Account of the Commencement (with handwritten poem) 1852-02-23",,,,,,,,,"18, 1 pages",,,,,,,,,,paper,,,,,,,,,,,,,,,,,,,,,,,,,,Commencement,https://s3.us-east-1.amazonaws.com/sjcdigitalarchives/original/b63e72e4a0a801bbbeec4f834e538f6b.pdf,Text,"Commencement Programs and Addresses",1,0
3624,https://digitalarchives.sjc.edu/items/show/3624,"Commencement Program, 1842","Annual Commencement.  St. John's College, February 22, 1842.  Order of Exercises.  (Includes handwritten note)","St. John's College","St. John's College","Annapolis, MD",1842-02-22,"St. John's College owns the rights to this publication.",text,pdf,,,,"<a title=""Commencement Address"" href=""http://digitalarchives.sjc.edu/items/show/3623"">Commencement Address</a>",English,"Commencement Program-1842-02-22",,,,,,,,,"2 pages",,,,,,,,,,paper,,,,,,,,,,,,,,,,,,,,,,,,,,Commencement,https://s3.us-east-1.amazonaws.com/sjcdigitalarchives/original/6a75d573cec101311e38ba90989994c5.pdf,Text,"Commencement Programs and Addresses",1,0
3673,https://digitalarchives.sjc.edu/items/show/3673,"Commencement Program, 1940","Commencement Exercises Under the Liberty Tree. 1696-1940","St. John's College","St. John's College","Annapolis, MD",1940-06-11,"St. John's College owns the rights to this publication.",text,pdf,,,,,English,"Commencement 1940",,,,,,,,,"4 pages",,,,,,,,,,paper,,,,,,,,,,,,,,,,,,,,,,,,,,Commencement,https://s3.us-east-1.amazonaws.com/sjcdigitalarchives/original/b4a16996285c3165fdd9eba2116a3db7.pdf,Text,"Commencement Programs and Addresses",1,0
3674,https://digitalarchives.sjc.edu/items/show/3674,"Commencement Program, 1939","Commencement Exercises Under the Liberty Tree. 1696-1939","St. John's College","St. John's College","Annapolis, MD",1939-06-06,"St. John's College owns the rights to this publication.",text,pdf,,,,,English,"Commencement 1939",,,,,,,,,"4 pages",,,,,,,,,,paper,,,,,,,,,,,,,,,,,,,,,,,,,,Commencement,https://s3.us-east-1.amazonaws.com/sjcdigitalarchives/original/b4a4abd96312def2a65249026543dc14.pdf,Text,"Commencement Programs and Addresses",1,0
3676,https://digitalarchives.sjc.edu/items/show/3676,"Commencement Program, 1932","Commencement Exercises Under the Liberty Tree. 1696-1932","St. John's College","St. John's College","Annapolis, MD",1932-06-07,"St. John's College owns the rights to this publication.",text,pdf,,,,,English,"Commencement 1932",,,,,,,,,"4 pages",,,,,,,,,,paper,,,,,,,,,,,,,,,,,,,,,,,,,,Commencement,https://s3.us-east-1.amazonaws.com/sjcdigitalarchives/original/4a39538ddaf66b17642f1fee2dd77a87.pdf,Text,"Commencement Programs and Addresses",1,0
3677,https://digitalarchives.sjc.edu/items/show/3677,"Commencement Program, 1929","Commencement Exercises Under the Liberty Tree. 1696-1929","St. John's College","St. John's College","Annapolis, MD",1929-06-05,"St. John's College owns the rights to this publication.",text,pdf,,,,,English,"Commencement 1929",,,,,,,,,"4 pages",,,,,,,,,,paper,,,,,,,,,,,,,,,,,,,,,,,,,,Commencement,https://s3.us-east-1.amazonaws.com/sjcdigitalarchives/original/8846cd48c96990377f5e2546dd390a03.pdf,Text,"Commencement Programs and Addresses",1,0
3678,https://digitalarchives.sjc.edu/items/show/3678,"Commencement Program, 1928","The Baccalaureate Service in McDowell Hall. Sunday, the third of June Nineteen hundred and twenty eight. Four-thirty o'clock in the afternoon.","St. John's College","St. John's College","Annapolis, MD",1928-06-03,"St. John's College owns the rights to this publication.",text,pdf,,,,,English,"Commencement 1928",,,,,,,,,"4 pages",,,,,,,,,,paper,,,,,,,,,,,,,,,,,,,,,,,,,,Commencement,https://s3.us-east-1.amazonaws.com/sjcdigitalarchives/original/7eb8bb2ac8bf642ba02d391710a2f1b1.pdf,Text,"Commencement Programs and Addresses",1,0
3679,https://digitalarchives.sjc.edu/items/show/3679,"Commencement Program, 1924","Commencement Day, Saint John's College 1696-1924. Wednesday, June 11, 1924.","St. John's College","St. John's College","Annapolis, MD",1924-06-11,"St. John's College owns the rights to this publication.",text,pdf,,,,,English,"Commencement 1924",,,,,,,,,"4 pages",,,,,,,,,,paper,,,,,,,,,,,,,,,,,,,,,,,,,,Commencement,https://s3.us-east-1.amazonaws.com/sjcdigitalarchives/original/263faa0dc25b2ee329ba18a906d0474b.pdf,Text,"Commencement Programs and Addresses",1,0
3680,https://digitalarchives.sjc.edu/items/show/3680,"Commencement Program, 1923","Commencement Day, Saint John's College 1696-1923. Wednesday, June 13, 1923.","St. John's College","St. John's College","Annapolis, MD",1923-06-13,"St. John's College owns the rights to this publication.",text,pdf,,,,,English,"Commencement 1923",,,,,,,,,"4 pages",,,,,,,,,,paper,,,,,,,,,,,,,,,,,,,,,,,,,,Commencement,https://s3.us-east-1.amazonaws.com/sjcdigitalarchives/original/5dbf877f81dbaf3b0f3067282ad4153a.pdf,Text,"Commencement Programs and Addresses",1,0
3681,https://digitalarchives.sjc.edu/items/show/3681,"Commencement Program, 1922","Commencement Day, Saint John's College 1696-1922. Wednesday, June 13, 1922.","St. John's College","St. John's College","Annapolis, MD",1922-06-13,"St. John's College owns the rights to this publication.",text,pdf,,,,,English,"Commencement 1922",,,,,,,,,"4 pages",,,,,,,,,,paper,,,,,,,,,,,,,,,,,,,,,,,,,,Commencement,https://s3.us-east-1.amazonaws.com/sjcdigitalarchives/original/7e741bcd5a0cec591ddcc6bee13b2aea.pdf,Text,"Commencement Programs and Addresses",1,0
3682,https://digitalarchives.sjc.edu/items/show/3682,"Commencement Program, 1921","Commencement Day, Saint John's College 1696-1921. Tuesday, June 14th, 1921.","St. John's College","St. John's College","Annapolis, MD",1921-06-14,"St. John's College owns the rights to this publication.",text,pdf,,,,,English,"Commencement 1921",,,,,,,,,"4 pages",,,,,,,,,,paper,,,,,,,,,,,,,,,,,,,,,,,,,,Commencement,https://s3.us-east-1.amazonaws.com/sjcdigitalarchives/original/6ce5fb3d236eab5bef590cc0abd5587f.pdf,Text,"Commencement Programs and Addresses",1,0
3683,https://digitalarchives.sjc.edu/items/show/3683,"Commencement Program, 1918","Commencement Day, Saint John's College 1696-1918. Wednesday, May 29.","St. John's College","St. John's College","Annapolis, MD",1918-05-29,"St. John's College owns the rights to this publication.",text,pdf,,,,,English,"Commencement 1918",,,,,,,,,"4 pages",,,,,,,,,,paper,,,,,,,,,,,,,,,,,,,,,,,,,,Commencement,https://s3.us-east-1.amazonaws.com/sjcdigitalarchives/original/47753b50c825885241e5c83be51703ea.pdf,Text,"Commencement Programs and Addresses",1,0
