﻿"Item Id","Item URI","Dublin Core:Title","Dublin Core:Description","Dublin Core:Creator","Dublin Core:Publisher","Dublin Core:Coverage","Dublin Core:Date","Dublin Core:Rights","Dublin Core:Type","Dublin Core:Format","Dublin Core:Source","Dublin Core:Subject","Dublin Core:Contributor","Dublin Core:Relation","Dublin Core:Language","Dublin Core:Identifier","Item Type Metadata:Occupation","Item Type Metadata:Participants","Item Type Metadata:Death Date","Item Type Metadata:Birthplace","Item Type Metadata:Birth Date","Item Type Metadata:Interviewer","Item Type Metadata:Biographical Text","Item Type Metadata:Bibliography","Item Type Metadata:Page numeration","Item Type Metadata:Resolution","Item Type Metadata:Identifier","Item Type Metadata:Inventory","Item Type Metadata:URL","Item Type Metadata:Text","Item Type Metadata:Interviewee","Item Type Metadata:Location","Item Type Metadata:Transcription","Item Type Metadata:Local URL","Item Type Metadata:Original Format","Item Type Metadata:Physical Dimensions","Item Type Metadata:Duration","Item Type Metadata:Compression","Item Type Metadata:Producer","Item Type Metadata:Director","Item Type Metadata:Bit Rate/Frequency","Item Type Metadata:Email Body","Item Type Metadata:Event Type","Item Type Metadata:Lesson Plan Text","Item Type Metadata:Materials","Item Type Metadata:Objectives","Item Type Metadata:Standards","Item Type Metadata:Number of Attachments","Item Type Metadata:BCC","Item Type Metadata:CC","Item Type Metadata:To","Item Type Metadata:From","Item Type Metadata:Subject Line","Item Type Metadata:Time Summary","Item Type Metadata:Episode","Item Type Metadata:Season","Item Type Metadata:Episode Type","Item Type Metadata:Explicit","Item Type Metadata:Block","PDF Text:Text",tags,file,itemType,collection,public,featured
1837,https://digitalarchives.sjc.edu/items/show/1837,"The Gadfly, Vol. II, Issue 18","Volume II, Issue 18 of The Gadfly. Published February 23, 1981.","Campbell, Rick (Editor)","St. John's College","Annapolis, MD",1981-02-23,"St. John's College owns the rights to this publication.",text,pdf,,,,,English,"Vol. 02 #18",,,,,,,,,"12 pages",,,,,,,,,,paper,,,,,,,,,,,,,,,,,,,,,,,,,,"Gadfly,Student publication",https://s3.us-east-1.amazonaws.com/sjcdigitalarchives/original/d95fbd1262b85f93bf5d121cadc846f5.pdf,Text,"<em>The Gadfly</em>",1,0
1838,https://digitalarchives.sjc.edu/items/show/1838,"The Gadfly, Vol. II, Issue 19","Volume II, Issue 19 of The Gadfly. Published March 02, 1981.","Campbell, Rick (Editor)","St. John's College","Annapolis, MD",1981-03-02,"St. John's College owns the rights to this publication.",text,pdf,,,,,English,"Vol. 02 #19",,,,,,,,,"12 pages",,,,,,,,,,paper,,,,,,,,,,,,,,,,,,,,,,,,,,"Gadfly,Student publication",https://s3.us-east-1.amazonaws.com/sjcdigitalarchives/original/5f1270e17b8b2f8ee5bc4f497e4cdcce.pdf,Text,"<em>The Gadfly</em>",1,0
1839,https://digitalarchives.sjc.edu/items/show/1839,"The Gadfly, Vol. II, Issue 20","Volume II, Issue 20 of The Gadfly. Published March 23, 1981.","Campbell, Rick (Editor)","St. John's College","Annapolis, MD",1981-03-23,"St. John's College owns the rights to this publication.",text,pdf,,,,,English,"Vol. 02 #20",,,,,,,,,"16 pages",,,,,,,,,,paper,,,,,,,,,,,,,,,,,,,,,,,,,,"Gadfly,Student publication",https://s3.us-east-1.amazonaws.com/sjcdigitalarchives/original/d404a4a118d8aacae32e33abe58e7f23.pdf,Text,"<em>The Gadfly</em>",1,0
1840,https://digitalarchives.sjc.edu/items/show/1840,"The Gadfly, Vol. II, Issue 21","Volume II, Issue 21 of The Gadfly. Published March 30, 1981.","Campbell, Rick (Editor)","St. John's College","Annapolis, MD",1981-03-30,"St. John's College owns the rights to this publication.",text,pdf,,,,,English,"Vol. 02 #21",,,,,,,,,"12 pages",,,,,,,,,,paper,,,,,,,,,,,,,,,,,,,,,,,,,,"Gadfly,Student publication",https://s3.us-east-1.amazonaws.com/sjcdigitalarchives/original/09cdf16a4c5195f69d70885121ac1df4.pdf,Text,"<em>The Gadfly</em>",1,0
3361,https://digitalarchives.sjc.edu/items/show/3361,"The St. John's Reporter, Volume VIII Issue 4","Volume VIII, Issue 4 of The St. John's Reporter.  Published in April 1981.",,"College Relations Office","Annapolis, MD; Santa Fe, NM",1981-04,"St. John's College owns the rights to this publication.",text,pdf,,,,,English,"Vol 8 issue 4 April 1981 - faded",,,,,,,,,"8 pages",,,,,,,,,,paper,,,,,,,,,,,,,,,,,,,,,,,,,,"The Reporter",https://s3.us-east-1.amazonaws.com/sjcdigitalarchives/original/1c450a0b855d9e6df41700eaa57b81a5.pdf,Text,"<em>The St. John's Reporter</em>",1,0
1841,https://digitalarchives.sjc.edu/items/show/1841,"The Gadfly, Vol. II, Issue 22","Volume II, Issue 22 of The Gadfly. Published April 06, 1981.","Campbell, Rick (Editor)","St. John's College","Annapolis, MD",1981-04-06,"St. John's College owns the rights to this publication.",text,pdf,,,,,English,"Vol. 02 #22",,,,,,,,,"12 pages",,,,,,,,,,paper,,,,,,,,,,,,,,,,,,,,,,,,,,"Gadfly,Student publication",https://s3.us-east-1.amazonaws.com/sjcdigitalarchives/original/7015c4e0fd71419b7c5293059a035cb5.pdf,Text,"<em>The Gadfly</em>",1,0
1842,https://digitalarchives.sjc.edu/items/show/1842,"The Gadfly, Vol. II, Issue 23","Volume II, Issue 23 of The Gadfly. Published April 13, 1981.","Campbell, Rick (Editor)","St. John's College","Annapolis, MD",1981-04-13,"St. John's College owns the rights to this publication.",text,pdf,,,,,English,"Vol. 02 #23",,,,,,,,,"12 pages",,,,,,,,,,paper,,,,,,,,,,,,,,,,,,,,,,,,,,"Gadfly,Student publication",https://s3.us-east-1.amazonaws.com/sjcdigitalarchives/original/f868004d03e9e01bfc96d144c55af46e.pdf,Text,"<em>The Gadfly</em>",1,0
1843,https://digitalarchives.sjc.edu/items/show/1843,"The Gadfly, Vol. II, Issue 24","Volume II, Issue 24 of The Gadfly. Published April 20, 1981.","Campbell, Rick (Editor)","St. John's College","Annapolis, MD",1981-04-20,"St. John's College owns the rights to this publication.",text,pdf,,,,,English,"Vol. 02 #24",,,,,,,,,"12 pages",,,,,,,,,,paper,,,,,,,,,,,,,,,,,,,,,,,,,,"Gadfly,Student publication",https://s3.us-east-1.amazonaws.com/sjcdigitalarchives/original/37a6ec37d07b0c39df9111526a73290f.pdf,Text,"<em>The Gadfly</em>",1,0
1844,https://digitalarchives.sjc.edu/items/show/1844,"The Gadfly, Vol. II, Issue 25","Volume II, Issue 25 of The Gadfly. Published April 27, 1981.","Campbell, Rick (Editor)","St. John's College","Annapolis, MD",1981-04-27,"St. John's College owns the rights to this publication.",text,pdf,,,,,English,"Vol. 02 #25",,,,,,,,,"12 pages",,,,,,,,,,paper,,,,,,,,,,,,,,,,,,,,,,,,,,"Gadfly,Student publication",https://s3.us-east-1.amazonaws.com/sjcdigitalarchives/original/2742147ab4358518243d8dbc7b3feab7.pdf,Text,"<em>The Gadfly</em>",1,0
6081,https://digitalarchives.sjc.edu/items/show/6081,"The Greek Tragedy Dance Audience before Joseph Hoeseal's Performance:  Lydia Sparrow, Marcia D. Talley, Laurence Berns, Gisela Berns, Rebecca Wilson, Kathryn Kinzer and Mera J. Flaumenhaft","1 photographic print : color",Unknown,,"Annapolis, MD ",1981-05,"St. John's College owns the rights to this photograph.","Still Image",jpeg,,"Sparrow, Lydia;  Talley, Marcia Dutton, 1943-;  Berns, Laurence, 1928-;  Berns, Gisela;  Wilson, Rebecca;  Kinzer, Kathryn;  Flaumenhaft, Mera J.",,,,SJC-P-2297,,,,,,,,,,,,,,,,,,,Photograph,"12.5 x 9 cm.",,,,,,,,,,,,,,,,,,,,,,,,,"Librarians,Tutors",https://s3.us-east-1.amazonaws.com/sjcdigitalarchives/original/415d14f85e8096835e294476da999193.jpg,"Still Image","Photographic Archive—Annapolis",1,0
1845,https://digitalarchives.sjc.edu/items/show/1845,"The Gadfly, Vol. II, Issue 26","Volume II, Issue 26 of The Gadfly. Published May 04, 1981.","Campbell, Rick (Editor)","St. John's College","Annapolis, MD",1981-05-04,"St. John's College owns the rights to this publication.",text,pdf,,,,,English,"Vol. 02 #26",,,,,,,,,"12 pages",,,,,,,,,,paper,,,,,,,,,,,,,,,,,,,,,,,,,,"Gadfly,Student publication",https://s3.us-east-1.amazonaws.com/sjcdigitalarchives/original/a7900174334e77ab9f732ad61ad4644a.pdf,Text,"<em>The Gadfly</em>",1,0
1352,https://digitalarchives.sjc.edu/items/show/1352,"West Street Story","The script of ""West Street Story"" performed as part of the Reality Variety Show",,"St. John's College","Annapolis, MD",1981-05-09,"St. John's College owns the rights to this publication.",text,pdf,,,,,English,Bx2-25,,,,,,,,,"27 pages",,,,,,,,,,paper,,,,,,,,,,,,,,,,,,,,,,,,,,,https://s3.us-east-1.amazonaws.com/sjcdigitalarchives/original/8e7a3cdca28fe3dd1a7df3efbcb382c3.pdf,Text,"Playbills & Programs",1,0
1846,https://digitalarchives.sjc.edu/items/show/1846,"The Gadfly, Vol. II, Issue 27","Volume II, Issue 27 of The Gadfly. Published May 11, 1981.","Campbell, Rick (Editor)","St. John's College","Annapolis, MD",1981-05-11,"St. John's College owns the rights to this publication.",text,pdf,,,,,English,"Vol. 02 #27",,,,,,,,,"8 pages",,,,,,,,,,paper,,,,,,,,,,,,,,,,,,,,,,,,,,"Gadfly,Student publication",https://s3.us-east-1.amazonaws.com/sjcdigitalarchives/original/747c3a07c2f08ffe181c728933203912.pdf,Text,"<em>The Gadfly</em>",1,0
3305,https://digitalarchives.sjc.edu/items/show/3305,"Commencement Program,  1981","Program for the One Hundred and Eighty-Ninth Commencement in the Two-Hundred and Eighty-Fifth Year of the College.","St. John's College","St. John's College","Annapolis, MD",1981-05-17,"St. John's College owns the rights to this publication.",text,pdf,,,,,English,"Commencement Exercises from 1981 {1981-05-17}",,,,,,,,,"8 pages",,,,,,,,,,paper,,,,,,,,,,,,,,,,,,,,,,,,,,Commencement,https://s3.us-east-1.amazonaws.com/sjcdigitalarchives/original/4200054e4a1227eeb46fca3b9a11793d.pdf,Text,"Commencement Programs and Addresses",1,0
4738,https://digitalarchives.sjc.edu/items/show/4738,"Santa Fe Commencement Program, Spring 1981","Program for the fourteenth commencement on the Santa Fe campus in the two hundred and eighty-fifth year of St. John's College. ","St. John's College","St. John's College","Santa Fe, NM",1981-05-24,"St. John's College owns the rights to this publication.",text,pdf,,"Commencement (St. John's College, Santa Fe, NM)",,,English,"SF Commencment Program 1981-05-24",,,,,,,,,"8 pages",,,,,,,,,,paper,,,,,,,,,,,,,,,,,,,,,,,,,,Commencement,https://s3.us-east-1.amazonaws.com/sjcdigitalarchives/original/c3ba2edf8c3066f785d91ab22d6ecb6e.pdf,Text,"Santa Fe Commencement Programs and Addresses",1,0
3362,https://digitalarchives.sjc.edu/items/show/3362,"The St. John's Reporter, Volume VIII Issue [4]","Volume VIII, Issue [4] of The St. John's Reporter.  Published in June 1981.",,"College Relations Office","Annapolis, MD; Santa Fe, NM",1981-06,"St. John's College owns the rights to this publication.",text,pdf,,,,,English,"Vol 8 issue 4.2 June 1981",,,,,,,,,"12 pages",,,,,,,,,,paper,,,,,,,,,,,,,,,,,,,,,,,,,,"The Reporter",https://s3.us-east-1.amazonaws.com/sjcdigitalarchives/original/0a66957557b3de8544aa8f9e34fd6233.pdf,Text,"<em>The St. John's Reporter</em>",1,0
3363,https://digitalarchives.sjc.edu/items/show/3363,"The St. John's Reporter, Volume VIII Issue [5]","Volume VIII, Issue [5] of The St. John's Reporter.  Published in June 1981. (Santa Fe edition)",,"St. John's College","Santa Fe, NM",1981-06,"St. John's College owns the rights to this publication.",text,pdf,,,,,English,"Vol 8 issue 5 June 1981",,,,,,,,,"12 pages",,,,,,,,,,paper,,,,,,,,,,,,,,,,,,,,,,,,,,"The Reporter",https://s3.us-east-1.amazonaws.com/sjcdigitalarchives/original/9219c9c1b58738d8bde271f575123dc5.pdf,Text,"<em>The St. John's Reporter</em>",1,0
491,https://digitalarchives.sjc.edu/items/show/491,"The St. John's Review (formerly The College), Summer 1981","Volume XXXII, Number 3 of The St. John's Review, formerly The College.  Published in Summer 1981.","Office of the Dean","St. John's College","Annapolis, MD",1981-07,"St. John's College owns the rights to this publication.",text,pdf,,,"Radista, Leo; Parran, Jr., Thomas; Sisson, Barbara J.; von Oppen, Beate Ruhm; Wilson, Curtis A.; Sachs, Joe; Brann, Eva T. H.; Bacon, Helen H.; Blum, Etta; Aron, Raymond; Bruell, Christopher; Liben, Meyer; Roth, Robert; West, Thomas G.",,English,"ISSN 0010-0862; The_St_Johns_Review_Vol_32_No_3_1981",,,,,,,,,"81 pages",,,,,,,,,,paper,,,,,,,,,,,,,,,,,,,,,,,,,,"St. John's Review",https://s3.us-east-1.amazonaws.com/sjcdigitalarchives/original/a86b0251a287cc0834212303aee73791.pdf,Text,"<em>The St. John's Review</em>",1,0
4636,https://digitalarchives.sjc.edu/items/show/4636,"Woman with Reproductions of  Paintings of King William III and Queen Mary II,  Royalty of Great Britain, by Annapolis, Maryland Artist Joseph Thoms","1 photographic print : b&w","Parran, Tom",,"Annapolis, MD",1981-08,"St. John's College owns the rights to this photograph.","Still Image",jpeg,,"Paintings ;  Thoms, Joseph ;  William III, King of England, 1650-1702. ;  Mary II, Queen of England, 1662-1694.",,,,SJC-P-0711,,,,,,,,,,,,,,,,,,,Photograph,"17 x 12.5 cm.",,,,,,,,,,,,,,,,,,,,,,,,,,https://s3.us-east-1.amazonaws.com/sjcdigitalarchives/original/674068a530055d31ecf53f22d22ed715.jpg,"Still Image","Photographic Archive—Annapolis",1,0
3364,https://digitalarchives.sjc.edu/items/show/3364,"The St. John's Reporter, Volume 9 Issue 1","Volume 9, Issue 1 of The St. John's Reporter.  Published in September 1981.",,"College Relations Office","Annapolis, MD; Santa Fe, NM",1981-09,"St. John's College owns the rights to this publication.",text,pdf,,,,,English,"Vol 9 issue 1 Sept 1981",,,,,,,,,"8 pages",,,,,,,,,,paper,,,,,,,,,,,,,,,,,,,,,,,,,,"The Reporter",https://s3.us-east-1.amazonaws.com/sjcdigitalarchives/original/d64796a267c3b3825cde4c994573a3c6.pdf,Text,"<em>The St. John's Reporter</em>",1,0
