﻿"Item Id","Item URI","Dublin Core:Title","Dublin Core:Description","Dublin Core:Creator","Dublin Core:Publisher","Dublin Core:Coverage","Dublin Core:Date","Dublin Core:Rights","Dublin Core:Type","Dublin Core:Format","Dublin Core:Source","Dublin Core:Subject","Dublin Core:Contributor","Dublin Core:Relation","Dublin Core:Language","Dublin Core:Identifier","Item Type Metadata:Occupation","Item Type Metadata:Participants","Item Type Metadata:Death Date","Item Type Metadata:Birthplace","Item Type Metadata:Birth Date","Item Type Metadata:Interviewer","Item Type Metadata:Biographical Text","Item Type Metadata:Bibliography","Item Type Metadata:Page numeration","Item Type Metadata:Resolution","Item Type Metadata:Identifier","Item Type Metadata:Inventory","Item Type Metadata:URL","Item Type Metadata:Text","Item Type Metadata:Interviewee","Item Type Metadata:Location","Item Type Metadata:Transcription","Item Type Metadata:Local URL","Item Type Metadata:Original Format","Item Type Metadata:Physical Dimensions","Item Type Metadata:Duration","Item Type Metadata:Compression","Item Type Metadata:Producer","Item Type Metadata:Director","Item Type Metadata:Bit Rate/Frequency","Item Type Metadata:Email Body","Item Type Metadata:Event Type","Item Type Metadata:Lesson Plan Text","Item Type Metadata:Materials","Item Type Metadata:Objectives","Item Type Metadata:Standards","Item Type Metadata:Number of Attachments","Item Type Metadata:BCC","Item Type Metadata:CC","Item Type Metadata:To","Item Type Metadata:From","Item Type Metadata:Subject Line","Item Type Metadata:Time Summary","Item Type Metadata:Episode","Item Type Metadata:Season","Item Type Metadata:Episode Type","Item Type Metadata:Explicit","Item Type Metadata:Block","PDF Text:Text",tags,file,itemType,collection,public,featured
7732,https://digitalarchives.sjc.edu/items/show/7732,"Remarks on the Inauguration of President Nora Demleitner: Citizenship, Undergraduate Education, and Great Books","Typescript of a lecture delivered on March 24, 2023, by Robert Post as part of the Formal Lecture Series. <br /><br />The lecture was the first President's Law and Society lecture and was part of the events celebrating the inauguration of Nora Demleitner.","Post, Robert, 1947-",,"Annapolis, MD",2023-03-24,"A signed permission form has been received stating: ""I hereby grant St. John's College permission to:  make a recording of my lecture, and retain copies for circulation and archival preservation at the St. John’s College Greenfield Library; make a recording of my lecture available online; make typescript copies of my lecture available for circulation and archival preservation at the St. John’s College Greenfield Library; make a copy of my typescript available online.""",text,pdf,,"Education, Humanistic--United States; Books and reading--United States; Citizenship--United States; Demleitner, Nora V., 1966-; St. John's College",,,English,LEC_Post_Robert_2023-03-24,,,,,,,,,"25 pages",,,,,,,,,,paper,,,,,,,,,,,,,,,,,,,,,,,,,,"Friday night lecture,Inauguration,President's Law and Society lecture",https://s3.us-east-1.amazonaws.com/sjcdigitalarchives/original/2f4c6970da0823d39796f012856ad085.pdf,Text,"St. John's College Formal Lecture Series—Annapolis",1,0
3788,https://digitalarchives.sjc.edu/items/show/3788,"Reminiscences of Scott Buchanan","Audio recording of a discussion entitled ""Reminiscences of Scott Buchanan"" circa 1973; with Nicholas Nabokov, Ford K. Brown, Simon Kaplan, John Kieffer, Jacob Klein, J. Winfree Smith, W. Kyle Smith, and Miriam Strange.","Nabokov, Nicolas, 1903-1978",,"Annapolis, MD",1973,"St. John's College owns the rights to this publication.",sound,mp3,,,"Buchanan, Scott Milross, 1895-1968; Brown, Ford Keeler; Kaplan, Simon, 1893-1979; Kieffer, John Spangler; Klein, Jacob, 1899-1978; Smith, J. Winfree; Stange, Miriam",,English,"lec Nabokov et al 1973",,,,,,,,,,,,,,,,,,,"audio cassette tape",,01:44:35,,,,,,,,,,,,,,,,,,,,,,,,,https://s3.us-east-1.amazonaws.com/sjcdigitalarchives/original/26978450e46703d0d6317f1754f58a94.mp3,Sound,"Speeches, presentations, and other lectures",1,0
4433,https://digitalarchives.sjc.edu/items/show/4433,"Renovation of Chase-Stone House Staircase, St. John's College, Annapolis, Maryland","1 photographic print : b&w","Laporte, Jan",,"Annapolis, MD",1963,"St. John's College owns the rights to this photograph.","still image",jpeg,,"Chase-Stone House (St. John's College, Annapolis, MD) 1963.",,,,SJC-P-0414,,,,,,,,,,,,,,,,,,,Photograph,"25.5 x 20.5 cm.",,,,,,,,,,,,,,,,,,,,,,,,,"Chase-Stone House",https://s3.us-east-1.amazonaws.com/sjcdigitalarchives/original/99c9cfbc5490f7b9fc71d5ce3e378eb1.jpg,"Still Image","Photographic Archive—Annapolis",1,0
4434,https://digitalarchives.sjc.edu/items/show/4434,"Renovation of Chase-Stone House Staircase, St. John's College, Annapolis, Maryland","1 photographic print : b&w","Laporte, Jan",,"Annapolis, MD",1963,"St. John's College owns the rights to this photograph.","still image",jpeg,,"Chase-Stone House (St. John's College, Annapolis, MD) 1963.",,,,SJC-P-0415,,,,,,,,,,,,,,,,,,,Photograph,"25.5 x 20.5 cm.",,,,,,,,,,,,,,,,,,,,,,,,,"Chase-Stone House",https://s3.us-east-1.amazonaws.com/sjcdigitalarchives/original/36ce83a2861bca1470015b137035f044.jpg,"Still Image","Photographic Archive—Annapolis",1,0
5957,https://digitalarchives.sjc.edu/items/show/5957,"Report on the 1914 Intersociety Debate between the Philomathian Literary Society and the Philokalian Literary Society, St. John's College, Annapolis, Maryland","1 photographic copy from page 138 of the [1914] St. John's College Yearbook : b&w",Unknown,,"Annapolis, MD","1914 [circa]","St. John's College owns the rights to this photograph.","Still Image",jpeg,,"Moore, Orville M.;  Miles, Luther Thomas Jr.",,,,SJC-P-2177,,,,,,,,,,,,,,,,,,,Photograph,"20.5 x 25.5 cm.",,,,,,,,,,,,,,,,,,,,,,,,,,https://s3.us-east-1.amazonaws.com/sjcdigitalarchives/original/07bba0708347020945f3c8f3087d44f6.jpg,"Still Image","Photographic Archive—Annapolis",1,0
3423,https://digitalarchives.sjc.edu/items/show/3423,"Reporter, Spring 1995","Volume 21 of The St. John's Reporter.  Published in Spring 1995.","Goyette, Barbara (editor); Allison, Lesli (editor)","Public Relations Office","Annapolis, MD; Santa Fe, NM",1995-04,"St. John's College owns the rights to this publication.",text,pdf,,,,,English,"vol 21 Spring 1995",,,,,,,,,"24 pages",,,,,,,,,,paper,,,,,,,,,,,,,,,,,,,,,,,,,,"The Reporter",https://s3.us-east-1.amazonaws.com/sjcdigitalarchives/original/52feb4fdfc36b14b47297528404c8d89.pdf,Text,"<em>The St. John's Reporter</em>",1,0
3424,https://digitalarchives.sjc.edu/items/show/3424,"Reporter, Volume 22 Issue 1","Volume 22, Issue 1 of The St. John's Reporter.  Published in Fall 1995. (Santa Fe edition)","Goyette, Barbara (editor); Allison, Lesli (editor)","Public Relations Office","Annapolis, MD; Santa Fe, NM",1995-10,"St. John's College owns the rights to this publication.",text,pdf,,,,,English,"vol 22 issue 1 Fall 1995",,,,,,,,,"24 pages",,,,,,,,,,paper,,,,,,,,,,,,,,,,,,,,,,,,,,"The Reporter",https://s3.us-east-1.amazonaws.com/sjcdigitalarchives/original/878f3dc86d8ccdaaf2ce4ed4c0824d02.pdf,Text,"<em>The St. John's Reporter</em>",1,0
3425,https://digitalarchives.sjc.edu/items/show/3425,"Reporter, Volume 22 Issue 2","Volume 22, Issue 2 of The St. John's Reporter.  Published in Winter 1996. (Annapolsi edition)","Goyette, Barbara (editor); Allison, Lesli (editor)","Public Relations Office","Annapolis, MD; Santa Fe, NM",1996-01,"St. John's College owns the rights to this publication.",text,pdf,,,,,English,"vol 22 issue 2 Winter 1996",,,,,,,,,"24 pages",,,,,,,,,,paper,,,,,,,,,,,,,,,,,,,,,,,,,,"The Reporter",https://s3.us-east-1.amazonaws.com/sjcdigitalarchives/original/de20bdb824ca8ff48d3b62730326fbdd.pdf,Text,"<em>The St. John's Reporter</em>",1,0
3426,https://digitalarchives.sjc.edu/items/show/3426,"Reporter, Volume 22 Issue 3","Volume 22, Issue 3 of The St. John's Reporter.  Published in Spring 1996. (Santa Fe edition)","Goyette, Barbara (editor); Allison, Lesli (editor)","Public Relations Office","Annapolis, MD; Santa Fe, NM",1996-04,"St. John's College owns the rights to this publication.",text,pdf,,,,,English,"vol 22 issue 3 Spring 1996",,,,,,,,,"20 pages",,,,,,,,,,paper,,,,,,,,,,,,,,,,,,,,,,,,,,"The Reporter",https://s3.us-east-1.amazonaws.com/sjcdigitalarchives/original/1bfef98f8a1b1688a4cd2f2bb7aee0be.pdf,Text,"<em>The St. John's Reporter</em>",1,0
3427,https://digitalarchives.sjc.edu/items/show/3427,"Reporter, Volume 22 Issue 4","Volume 22, Issue [3] of The St. John's Reporter.  Published in Summer 1996. (Annapolis edition)","Goyette, Barbara (editor); Skewes, Elizabeth (editor)","Public Relations Office","Annapolis, MD; Santa Fe, NM",1996-07,"St. John's College owns the rights to this publication.",text,pdf,,,,,English,"vol 22 issue 4 Summer 1996",,,,,,,,,"24 pages",,,,,,,,,,paper,,,,,,,,,,,,,,,,,,,,,,,,,,"The Reporter",https://s3.us-east-1.amazonaws.com/sjcdigitalarchives/original/83a4d4499bd6fc7816329e60a7d1e1b4.pdf,Text,"<em>The St. John's Reporter</em>",1,0
3428,https://digitalarchives.sjc.edu/items/show/3428,"Reporter, Volume 23 Issue 2","Volume 23, Issue 2 of The St. John's Reporter.  Published in Winter 1997. (Annapolis edition)","Goyette, Barbara (editor); Skewes, Elizabeth (editor)","Public Relations Office","Annapolis, MD; Santa Fe, NM",1997-01,"St. John's College owns the rights to this publication.",text,pdf,,,,,English,"vol 23 issue 2 Winter 1997",,,,,,,,,"24 pages",,,,,,,,,,paper,,,,,,,,,,,,,,,,,,,,,,,,,,"The Reporter",https://s3.us-east-1.amazonaws.com/sjcdigitalarchives/original/8f29d079127d10e86c464d2015cd16a1.pdf,Text,"<em>The St. John's Reporter</em>",1,0
3429,https://digitalarchives.sjc.edu/items/show/3429,"Reporter, Volume 23 Issue 3","Volume 23, Issue 3 of The St. John's Reporter.  Published in Spring 1997. (Santa Fe edition)","Goyette, Barbara (editor); Skewes, Elizabeth (editor)","Public Relations Office","Annapolis, MD; Santa Fe, NM",1997-04,"St. John's College owns the rights to this publication.",text,pdf,,,,,English,"vol 23 issue 3 Spring 1997",,,,,,,,,"28 pages",,,,,,,,,,paper,,,,,,,,,,,,,,,,,,,,,,,,,,"The Reporter",https://s3.us-east-1.amazonaws.com/sjcdigitalarchives/original/678cc3288e2be7c408041e3e5f0cf728.pdf,Text,"<em>The St. John's Reporter</em>",1,0
3430,https://digitalarchives.sjc.edu/items/show/3430,"Reporter, Volume 23 Issue 4","Volume 23, Issue 4 of The St. John's Reporter.  Published in Summer 1997. (Annapolis edition)","Goyette, Barbara (editor); Skewes, Elizabeth (editor)","Public Relations Office","Annapolis, MD; Santa Fe, NM",1997-07,"St. John's College owns the rights to this publication.",text,pdf,,,,,English,"vol 23 issue 4 Summer 1997",,,,,,,,,"28 pages",,,,,,,,,,paper,,,,,,,,,,,,,,,,,,,,,,,,,,"The Reporter",https://s3.us-east-1.amazonaws.com/sjcdigitalarchives/original/0a44b818b44ed1eb58b8414b82a58443.pdf,Text,"<em>The St. John's Reporter</em>",1,0
3431,https://digitalarchives.sjc.edu/items/show/3431,"Reporter, Volume 24 Issue 1","Volume 24, Issue 1 of The St. John's Reporter.  Published in Fall 1997.","Goyette, Barbara (editor); Skewes, Elizabeth (editor)","Public Relations Office","Annapolis, MD; Santa Fe, NM",1997-10,"St. John's College owns the rights to this publication.",text,pdf,,,,,English,"vol 24 issue 1 fall 1997",,,,,,,,,"24 pages",,,,,,,,,,paper,,,,,,,,,,,,,,,,,,,,,,,,,,"The Reporter",https://s3.us-east-1.amazonaws.com/sjcdigitalarchives/original/a8893f8af24ea1413d1d65f90f119d76.pdf,Text,"<em>The St. John's Reporter</em>",1,0
3432,https://digitalarchives.sjc.edu/items/show/3432,"Reporter, Volume 24 Issue 2","Volume 24, Issue 2 of The St. John's Reporter.  Published in Winter 1998.","Goyette, Barbara (editor); Skewes, Elizabeth (editor)","Public Relations Office","Annapolis, MD; Santa Fe, NM",1998-01,"St. John's College owns the rights to this publication.",text,pdf,,,,,English,"vol 24 issue 2 Winter 1998",,,,,,,,,"28 pages",,,,,,,,,,paper,,,,,,,,,,,,,,,,,,,,,,,,,,"The Reporter",https://s3.us-east-1.amazonaws.com/sjcdigitalarchives/original/09ce5b5521144890dc8bfc5f877cef13.pdf,Text,"<em>The St. John's Reporter</em>",1,0
3433,https://digitalarchives.sjc.edu/items/show/3433,"Reporter, Volume 24 Issue 3","Volume 24, Issue 3 of The St. John's Reporter.  Published in Spring 1998.","Goyette, Barbara (editor); Skewes, Elizabeth (editor)","Public Relations Office","Annapolis, MD; Santa Fe, NM",1998-04,"St. John's College owns the rights to this publication.",text,pdf,,,,,English,"vol 24 issue 3 Spring 1998",,,,,,,,,"24 pages",,,,,,,,,,paper,,,,,,,,,,,,,,,,,,,,,,,,,,"The Reporter",https://s3.us-east-1.amazonaws.com/sjcdigitalarchives/original/dffa3261baed212b9fe460b0f032a20e.pdf,Text,"<em>The St. John's Reporter</em>",1,0
3434,https://digitalarchives.sjc.edu/items/show/3434,"Reporter, Volume 24 Issue 4","Volume 24, Issue 4 of The St. John's Reporter.  Published in Summer 1998.","Goyette, Barbara (editor); Skewes, Elizabeth (editor); Mulry, Laura J. (editor)","Public Relations Office","Annapolis, MD; Santa Fe, NM",1998-07,"St. John's College owns the rights to this publication.",text,pdf,,,,,English,"vol 24 issue 4 Summer 1998",,,,,,,,,"24 pages",,,,,,,,,,paper,,,,,,,,,,,,,,,,,,,,,,,,,,"The Reporter",https://s3.us-east-1.amazonaws.com/sjcdigitalarchives/original/218dffd011633a9890f989e1be57d192.pdf,Text,"<em>The St. John's Reporter</em>",1,0
3435,https://digitalarchives.sjc.edu/items/show/3435,"Reporter, Volume 25 Issue 1","Volume 25, Issue 1 of The St. John's Reporter.  Published in Fall 1998.  (Corrected from Volume 24, Issue 4)","Goyette, Barbara (editor); Mulry, Laura J. (editor)","Public Relations Office","Annapolis, MD; Santa Fe, NM",1998-10,"St. John's College owns the rights to this publication.",text,pdf,,,,,English,"vol 25 issue 1 Fall 1998",,,,,,,,,"24 pages",,,,,,,,,,paper,,,,,,,,,,,,,,,,,,,,,,,,,,"The Reporter",https://s3.us-east-1.amazonaws.com/sjcdigitalarchives/original/795255a0ab99fb6b68df0c03ec0d7306.pdf,Text,"<em>The St. John's Reporter</em>",1,0
3436,https://digitalarchives.sjc.edu/items/show/3436,"Reporter, Volume 25 Issue 2","Volume 25, Issue 2 of The St. John's Reporter.  Published in Winter 1999.  (Corrected from Issue 1)","Goyette, Barbara (editor); Mulry, Laura J. (editor)","Public Relations Office","Annapolis, MD; Santa Fe, NM",1999-01,"St. John's College owns the rights to this publication.",text,pdf,,,,,English,"vol 25 issue 2 Winter 1999",,,,,,,,,"28 pages",,,,,,,,,,paper,,,,,,,,,,,,,,,,,,,,,,,,,,"The Reporter",https://s3.us-east-1.amazonaws.com/sjcdigitalarchives/original/8e6bd915aaa5e7e889f42fb64e2f4b82.pdf,Text,"<em>The St. John's Reporter</em>",1,0
3437,https://digitalarchives.sjc.edu/items/show/3437,"Reporter, Volume 25 Issue 3","Volume 25, Issue 3 of The St. John's Reporter.  Published in Spring 1999.  (Corrected from Issue 2)","Goyette, Barbara (editor); Mulry, Laura J. (editor)","Public Relations Office","Annapolis, MD; Santa Fe, NM",1999-04,"St. John's College owns the rights to this publication.",text,pdf,,,,,English,"vol 25 issue 3 Spring 1999",,,,,,,,,"24 pages",,,,,,,,,,paper,,,,,,,,,,,,,,,,,,,,,,,,,,"The Reporter",https://s3.us-east-1.amazonaws.com/sjcdigitalarchives/original/d6be5ade8a53e66adf36c62963f46ab6.pdf,Text,"<em>The St. John's Reporter</em>",1,0
