﻿"Item Id","Item URI","Dublin Core:Title","Dublin Core:Description","Dublin Core:Creator","Dublin Core:Publisher","Dublin Core:Coverage","Dublin Core:Date","Dublin Core:Rights","Dublin Core:Type","Dublin Core:Format","Dublin Core:Source","Dublin Core:Subject","Dublin Core:Contributor","Dublin Core:Relation","Dublin Core:Language","Dublin Core:Identifier","Item Type Metadata:Occupation","Item Type Metadata:Participants","Item Type Metadata:Death Date","Item Type Metadata:Birthplace","Item Type Metadata:Birth Date","Item Type Metadata:Interviewer","Item Type Metadata:Biographical Text","Item Type Metadata:Bibliography","Item Type Metadata:Page numeration","Item Type Metadata:Resolution","Item Type Metadata:Identifier","Item Type Metadata:Inventory","Item Type Metadata:URL","Item Type Metadata:Text","Item Type Metadata:Interviewee","Item Type Metadata:Location","Item Type Metadata:Transcription","Item Type Metadata:Local URL","Item Type Metadata:Original Format","Item Type Metadata:Physical Dimensions","Item Type Metadata:Duration","Item Type Metadata:Compression","Item Type Metadata:Producer","Item Type Metadata:Director","Item Type Metadata:Bit Rate/Frequency","Item Type Metadata:Email Body","Item Type Metadata:Event Type","Item Type Metadata:Lesson Plan Text","Item Type Metadata:Materials","Item Type Metadata:Objectives","Item Type Metadata:Standards","Item Type Metadata:Number of Attachments","Item Type Metadata:BCC","Item Type Metadata:CC","Item Type Metadata:To","Item Type Metadata:From","Item Type Metadata:Subject Line","Item Type Metadata:Time Summary","Item Type Metadata:Episode","Item Type Metadata:Season","Item Type Metadata:Episode Type","Item Type Metadata:Explicit","Item Type Metadata:Block","PDF Text:Text",tags,file,itemType,collection,public,featured
5737,https://digitalarchives.sjc.edu/items/show/5737,"Stringfellow Barr Seated in the Goodwin House, Alexandria, VA","1 photographic print : color","Hoffman, Allan",,"Annapolis, MD","1974 [circa]","St. John's College owns the rights to this photograph.","Still Image",jpeg,,"Barr, Stringfellow, 1897- ;  St. John's College (Annapolis, Md.). -- Presidents. ;  Portraits.",,,,SJC-P-1814,,,,,,,,,,,,,,,,,,,Photograph,"9 x 10.5 cm.",,,,,,,,,,,,,,,,,,,,,,,,,"Honorary Alumni,Presidents",https://s3.us-east-1.amazonaws.com/sjcdigitalarchives/original/5c99746541863fbac92ae538e0d2b90a.jpg,"Still Image","Photographic Archive—Annapolis",1,0
5747,https://digitalarchives.sjc.edu/items/show/5747,"Stringfellow Barr Seated in his Living Room in in Hilltop, Kingston, New Jersey","1 photographic print : color","Hoffman, Allan",,"Annapolis, MD","1974 [circa]","St. John's College owns the rights to this photograph.","Still Image",jpeg,,"Barr, Stringfellow, 1897-",,,,SJC-P-1824,,,,,,,,,,,,,,,,,,,Photograph,"17.5 x 13 cm.",,,,,,,,,,,,,,,,,,,,,,,,,"Honorary Alumni,Presidents",https://s3.us-east-1.amazonaws.com/sjcdigitalarchives/original/713c5dafcd848059a3fe376ac1906c86.jpg,"Still Image","Photographic Archive—Annapolis",1,0
460,https://digitalarchives.sjc.edu/items/show/460,"The College, January 1974","Volume XXV, Number 4 of The College. Published in January 1974.","Development Offices of St. John's College","St. John's College","Annapolis, MD",1974-01,"St. John's College owns the rights to this publication.",text,pdf,,,"von Oppen, Beate Ruhm; Parran, Jr., Thomas; Dunham, William B.; Ham, Michael W.; Newland, Paul D.; Oosterhout, Barbara Brunner; Wyatt, E. Malcolm; Zelenka, Robert S.",,English,The_College_Vol_25_No_4_1974,,,,,,,,,"16 pages",,,,,,,,,,paper,,,,,,,,,,,,,,,,,,,,,,,,,,"The College",https://s3.us-east-1.amazonaws.com/sjcdigitalarchives/original/d90a7da56a772cfc0ce719c6b0698431.pdf,Text,"<em>The College </em>(1969-1981)",1,0
5498,https://digitalarchives.sjc.edu/items/show/5498,"Marcia Talley and John Hedeman Seated in the Woodward Hall Library with a Gift of Books about Winston Churchill","1 photographic print : b&w",Unknown,,"Annapolis, MD",1974-02,"St. John's College owns the rights to this photograph.","Still Image",jpeg,,"Talley, Marcia;  Hedeman, John",,,,SJC-P-1471,,,,,,,,,,,,,,,,,,,Photograph,"20.5 x 25.5 cm.",,,,,,,,,,,,,,,,,,,,,,,,,Librarians,https://s3.us-east-1.amazonaws.com/sjcdigitalarchives/original/7294799aea412b14e9854b68f71cfb72.jpg,"Still Image","Photographic Archive—Annapolis",1,0
5499,https://digitalarchives.sjc.edu/items/show/5499,"Marcia Talley and John Hedeman Seated in the Woodward Hall Library with a Gift of Books about Winston Churchill","1 photographic print : b&w",Unknown,,"Annapolis, MD",1974-02,"St. John's College owns the rights to this photograph.","Still Image",jpeg,,"Talley, Marcia;  Hedeman, John",,,,SJC-P-1472,,,,,,,,,,,,,,,,,,,Photograph,"17 x 25.5 cm.",,,,,,,,,,,,,,,,,,,,,,,,,Librarians,https://s3.us-east-1.amazonaws.com/sjcdigitalarchives/original/69374905f548748a23e22084fb4c5d95.jpg,"Still Image","Photographic Archive—Annapolis",1,0
3355,https://digitalarchives.sjc.edu/items/show/3355,"The St. John's Reporter, Volume I Issue 1","Volume I, Issue 1 of The St. John's Reporter.  Published on February 1, 1974.",,"Development Office","Annapolis, MD",1974-02-01,"St. John's College owns the rights to this publication.",text,pdf,,,,,English,"vol 1 issue 1 Feb 1974",,,,,,,,,"4 pages",,,,,,,,,,paper,,,,,,,,,,,,,,,,,,,,,,,,,,"The Reporter",https://s3.us-east-1.amazonaws.com/sjcdigitalarchives/original/7329ad02964f5cf43622186a035304ba.pdf,Text,"<em>The St. John's Reporter</em>",1,0
1343,https://digitalarchives.sjc.edu/items/show/1343,"Michael Ian Campbell","Program of Michael Ian Campbell in concert",,"St. John's College","Annapolis, MD",1974-02-24,"St. John's College owns the rights to this publication.",text,pdf,,,,,English,Bx2-15,,,,,,,,,"2 pages",,,,,,,,,,paper,,,,,,,,,,,,,,,,,,,,,,,,,,,https://s3.us-east-1.amazonaws.com/sjcdigitalarchives/original/80089d537b0e1b5f88ea234c659addc3.pdf,Text,"Playbills & Programs",1,0
1082,https://digitalarchives.sjc.edu/items/show/1082,"Time and nature in Lucretius' De rerum natura","Audio recording of a lecture delivered on March 8, 1974 by Gisela Berns as part of the Formal Lecture Series.","Berns, Gisela N.","St. John's College","Annapolis, MD",1974-03-08,"St. John's College has been given permission to make this item available online.",sound,mp3,,"Lucretius Carus, Titus. De rerum natura; Philosophy, Ancient",,"<a href=""http://digitalarchives.sjc.edu/items/show/1088"" title=""Typescript"">Typsecript</a>",English,"Bib # 10010",,,,,,,,,,,,,,,,,,,"cassette tape",,00:54:21,,,,,,,,,,,,,,,,,,,,,,,,"Friday night lecture,Tutors",https://s3.us-east-1.amazonaws.com/sjcdigitalarchives/original/50e88d199c529ac41487bf8d699c11e1.mp3,Sound,"St. John's College Formal Lecture Series—Annapolis",1,0
1088,https://digitalarchives.sjc.edu/items/show/1088,"Time and nature in Lucretius' De rerum natura","Typescript of a lecture delivered on March 8, 1974 by Gisela Berns as part of the Formal Lecture Series.","Berns, Gisela N.","St. John's College","Annapolis, MD",1974-03-08,"St. John's College has been given permission to make this item available online.",text,pdf,,"Lucretius Carus, Titus. De rerum natura; Philosophy, Ancient",,"<a href=""http://digitalarchives.sjc.edu/items/show/1082"" title=""Sound recording"">Sound recording</a>",English,"Bib # 57328",,,,,,,,,"16 pages",,,,,,,,,,paper,,,,,,,,,,,,,,,,,,,,,,,,,,"Friday night lecture,Tutors",https://s3.us-east-1.amazonaws.com/sjcdigitalarchives/original/5a000f7802f4341cb5b151e0cfd5e5c5.pdf,Text,"St. John's College Formal Lecture Series—Annapolis",1,0
461,https://digitalarchives.sjc.edu/items/show/461,"The College, April 1974","Volume XXVI, Number 1 of The College. Published in April 1974.","Development Offices of St. John's College","St. John's College","Annapolis, MD",1974-04,"St. John's College owns the rights to this publication.",text,pdf,,,"von Oppen, Beate Ruhm; Parran, Jr., Thomas; Dunham, William B.; Ham, Michael W.; Newland, Paul D.; Oosterhout, Barbara Brunner; Wyatt, E. Malcolm; Zelenka, Robert S.; Allanbrook, Wye Jamison",,English,The_College_Vol_26_No_1_1974,,,,,,,,,"24 pages",,,,,,,,,,paper,,,,,,,,,,,,,,,,,,,,,,,,,,"The College",https://s3.us-east-1.amazonaws.com/sjcdigitalarchives/original/52514cbfcd4ab73efa907d7f92949532.pdf,Text,"<em>The College </em>(1969-1981)",1,0
5116,https://digitalarchives.sjc.edu/items/show/5116,"Burning Notes for Senior Papers in Common Room Fireplace, Annapolis, Maryland","1 photographic print : b&w",Unknown,,"Annapolis, MD",1974-04,"St. John's College owns the rights to this photograph.","Still Image",jpeg,,,,,,SJC-P-1094,,,,,,,,,,,,,,,,,,,Photograph,"20.5 x 25.5 cm.",,,,,,,,,,,,,,,,,,,,,,,,,,https://s3.us-east-1.amazonaws.com/sjcdigitalarchives/original/0fbdbd6ae291bd77ff7b14deafd651fd.jpg,"Still Image","Photographic Archive—Annapolis",1,0
3356,https://digitalarchives.sjc.edu/items/show/3356,"The St. John's Reporter, Volume I Issue 2","Volume I, Issue 2 of The St. John's Reporter.  Published on April 1, 1974.",,"Development Office","Annapolis, MD",1974-04-01,"St. John's College owns the rights to this publication.",text,pdf,,,,,English,"vol 1 issue 2 April 1974",,,,,,,,,"4 pages",,,,,,,,,,paper,,,,,,,,,,,,,,,,,,,,,,,,,,"The Reporter",https://s3.us-east-1.amazonaws.com/sjcdigitalarchives/original/20ac0f503f16fcff7574f4b66d22d6fd.pdf,Text,"<em>The St. John's Reporter</em>",1,0
1045,https://digitalarchives.sjc.edu/items/show/1045,"Surprise Dinner for Richard D. Weigle","1 photographic print : b&w",Unknown,,"Annapolis, MD",1974-04-12,"St. John's College owns the rights to this photograph.","still image",jpeg,,"St. John's College (Annapolis, Md.). -- Presidents. ;  St. John's College (Santa Fe, N. M.). -- Presidents.; Weigle, Richard Daniel, 1912- ;  Weigle, Mary ;  Staley, J.I. ;  Luce, Henry III",,,,SJC-P-0111,,,,,,,,,,,,,,,,,,,photograph,"23.5 x 17 cm.",,,,,,,,,,,,,,,,,,,,,,,,,"Honorary Alumni,Presidents",https://s3.us-east-1.amazonaws.com/sjcdigitalarchives/original/ac1b323892e32f62538e778ddd495c51.jpg,"Still Image","Photographic Archive—Annapolis",1,1
1046,https://digitalarchives.sjc.edu/items/show/1046,"Richard D. Weigle and Mary Weigle Receiving Gifts at a Surprise Dinner","1 photographic print : b&w",Unknown,,"Annapolis, MD",1974-04-12,"St. John's College owns the rights to this photograph.","still image",jpeg,,"St. John's College (Annapolis, Md.). -- Presidents. ;  St. John's College (Santa Fe, N. M.). -- Presidents.; Weigle, Richard Daniel, 1912- ;  Weigle, Mary",,,,SJC-P-0112,,,,,,,,,,,,,,,,,,,photograph,"15.5 x 17 cm.",,,,,,,,,,,,,,,,,,,,,,,,,"Honorary Alumni,Presidents",https://s3.us-east-1.amazonaws.com/sjcdigitalarchives/original/79f5dec4013986744d205e4da98f611d.jpg,"Still Image","Photographic Archive—Annapolis",1,1
1050,https://digitalarchives.sjc.edu/items/show/1050,"John S. Kieffer Presents Richard D. Weigle with a Medallion, [St. John's College, Annapolis, Maryland]","1 photographic print : b&w",Unknown,,"Annapolis, MD",1974-04-24,"St. John's College owns the rights to this photograph.","still image",jpeg,,"St. John's College (Annapolis, Md.). -- Presidents. ;  St. John's College (Santa Fe, N. M.). -- Presidents. ;  St. John's College (Annapolis, Md.). -- Deans. ;  St. John's College (Annapolis, Md.). -- Faculty.; Kieffer, John Spangler. ;  Weigle, Richard Daniel, 1912-",,,,SJC-P-0116,,,,,,,,,,,,,,,,,,,photograph,"19 x 23 cm.",,,,,,,,,,,,,,,,,,,,,,,,,"Honorary Alumni,Presidents",https://s3.us-east-1.amazonaws.com/sjcdigitalarchives/original/56638794770d6fb8e772a676e2322bfe.jpg,"Still Image","Photographic Archive—Annapolis",1,1
5113,https://digitalarchives.sjc.edu/items/show/5113,"Portrait of David Huston with Jane Shaw in Background at the Real Olympics, Annapolis, Maryland","1 photographic print : b&w",Unknown,,"Annapolis, MD",1974-05,"St. John's College owns the rights to this photograph.","Still Image",jpeg,,"Huston, David D.;  Shaw, Jane",,,,SJC-P-1091,,,,,,,,,,,,,,,,,,,Photograph,"20.5 x 25.5 cm.",,,,,,,,,,,,,,,,,,,,,,,,,"Alumni,Real Olympics",https://s3.us-east-1.amazonaws.com/sjcdigitalarchives/original/37f51a99589bc1de436c9b4195b92cc8.jpg,"Still Image","Photographic Archive—Annapolis",1,0
5114,https://digitalarchives.sjc.edu/items/show/5114,"Jacqueline Blue and Barbara Leonard at the Real Olympics, Annapolis, Maryland","1 photographic print : b&w",Unknown,,"Annapolis, MD",1974-05,"St. John's College owns the rights to this photograph.","Still Image",jpeg,,"Blue, Jacqueline ;  Leonard, Barbara Hopkins",,,,SJC-P-1092,,,,,,,,,,,,,,,,,,,Photograph,"20.5 x 25.5 cm.",,,,,,,,,,,,,,,,,,,,,,,,,"Alumni,Real Olympics,Tutors",https://s3.us-east-1.amazonaws.com/sjcdigitalarchives/original/adaf22b6cce5df278a1f36c9d9495e0a.jpg,"Still Image","Photographic Archive—Annapolis",1,0
5115,https://digitalarchives.sjc.edu/items/show/5115,"Portrait of Edward Grandi In Laurel Wreath and Toga at the Real Olympics, Annapolis, Maryland","1 photographic print : b&w",Unknown,,"Annapolis, MD",1974-05,"St. John's College owns the rights to this photograph.","Still Image",jpeg,,"Grandi, Edward",,,,SJC-P-1093,,,,,,,,,,,,,,,,,,,Photograph,"20.5 x 25.5 cm.",,,,,,,,,,,,,,,,,,,,,,,,,"Alumni,Real Olympics",https://s3.us-east-1.amazonaws.com/sjcdigitalarchives/original/46e07307aa484573b785b0c0259ecf68.jpg,"Still Image","Photographic Archive—Annapolis",1,0
5117,https://digitalarchives.sjc.edu/items/show/5117,"Daniel O'Flynn and Theodore Wolfe Seated on the Steps of  McDowell Hall","1 photographic print : b&w",Unknown,,"Annapolis, MD",1974-05,"St. John's College owns the rights to this photograph.","Still Image",jpeg,,"O'Flynn, Daniel;  Wolfe, Theodore",,,,SJC-P-1095,,,,,,,,,,,,,,,,,,,Photograph,"20.5 x 25.5 cm.",,,,,,,,,,,,,,,,,,,,,,,,,"Alumni,McDowell Hall",https://s3.us-east-1.amazonaws.com/sjcdigitalarchives/original/f2dba4e6fd4131ca064450971c3790c4.jpg,"Still Image","Photographic Archive—Annapolis",1,0
361,https://digitalarchives.sjc.edu/items/show/361,"Eva T. H. Brann in Academic Robe Speaking at Commencement, Annapolis, Maryland","1 photographic print : b&w ",Unknown,,"Annapolis, MD",1974-05-14,"St. John's College owns the rights to this photograph.","still image",jpeg,,"Commencement (St. John's College, Annapolis, MD) ;  Brann, Eva T. H.",,,,SJC-P-1134,,,,,,,,,,"600 dpi",,,,,,,,,photograph," 25.5 x 20.5 cm.",,,,,,,,,,,,,,,,,,,,,,,,,"Commencement,Deans,Tutors",https://s3.us-east-1.amazonaws.com/sjcdigitalarchives/original/b91f8cc04bfc84e12121dc49d3eb8a0d.jpg,"Still Image","Photographic Archive—Annapolis",1,1
