﻿"Item Id","Item URI","Dublin Core:Title","Dublin Core:Description","Dublin Core:Creator","Dublin Core:Publisher","Dublin Core:Coverage","Dublin Core:Date","Dublin Core:Rights","Dublin Core:Type","Dublin Core:Format","Dublin Core:Source","Dublin Core:Subject","Dublin Core:Contributor","Dublin Core:Relation","Dublin Core:Language","Dublin Core:Identifier","Item Type Metadata:Occupation","Item Type Metadata:Participants","Item Type Metadata:Death Date","Item Type Metadata:Birthplace","Item Type Metadata:Birth Date","Item Type Metadata:Interviewer","Item Type Metadata:Biographical Text","Item Type Metadata:Bibliography","Item Type Metadata:Page numeration","Item Type Metadata:Resolution","Item Type Metadata:Identifier","Item Type Metadata:Inventory","Item Type Metadata:URL","Item Type Metadata:Text","Item Type Metadata:Interviewee","Item Type Metadata:Location","Item Type Metadata:Transcription","Item Type Metadata:Local URL","Item Type Metadata:Original Format","Item Type Metadata:Physical Dimensions","Item Type Metadata:Duration","Item Type Metadata:Compression","Item Type Metadata:Producer","Item Type Metadata:Director","Item Type Metadata:Bit Rate/Frequency","Item Type Metadata:Email Body","Item Type Metadata:Event Type","Item Type Metadata:Lesson Plan Text","Item Type Metadata:Materials","Item Type Metadata:Objectives","Item Type Metadata:Standards","Item Type Metadata:Number of Attachments","Item Type Metadata:BCC","Item Type Metadata:CC","Item Type Metadata:To","Item Type Metadata:From","Item Type Metadata:Subject Line","Item Type Metadata:Time Summary","Item Type Metadata:Episode","Item Type Metadata:Season","Item Type Metadata:Episode Type","Item Type Metadata:Explicit","Item Type Metadata:Block","PDF Text:Text",tags,file,itemType,collection,public,featured
4280,https://digitalarchives.sjc.edu/items/show/4280,"North Portico of McDowell Hall, St. John's College, Annapolis, Maryland","1 photographic print : b&w","McKay, Hugh",,"Annapolis, MD","1937-1938 [circa]","St. John's College owns the rights to this photograph.","still image",jpeg,,"St. John's College (Annapolis, Md.). -- McDowell Hall -- 1930-1940.",,,,SJC-P-0364,,,,,,,,,,,,,,,,,,,photograph,"10 x 12.5 cm.",,,,,,,,,,,,,,,,,,,,,,,,,"McDowell Hall",https://s3.us-east-1.amazonaws.com/sjcdigitalarchives/original/55a36780702dc5bce8beb93d14393462.jpg,"Still Image","Photographic Archive—Annapolis",1,0
4281,https://digitalarchives.sjc.edu/items/show/4281,"North Portico of McDowell Hall, St. John's College, Annapolis, Maryland","1 photographic print : b&w",Unknown,,"Annapolis, MD","1920-1940 [circa]","St. John's College owns the rights to this photograph.","still image",jpeg,,"St. John's College (Annapolis, Md.). -- McDowell Hall --1920-1940.",,,,SJC-P-0366,,,,,,,,,,,,,,,,,,,photograph,"8 x 9.5 cm.",,,,,,,,,,,,,,,,,,,,,,,,,"McDowell Hall",https://s3.us-east-1.amazonaws.com/sjcdigitalarchives/original/94cebc88bfe137040bb81d556d649d12.jpg,"Still Image","Photographic Archive—Annapolis",1,0
4419,https://digitalarchives.sjc.edu/items/show/4419,"Page with Front View of  McDowell Hall with Cupola, St. John's College, Annapolis, Maryland","1 printed page : b&w",Unknown,,"Annapolis,MD","1930-1960 [circa]","St. John's College owns the rights to this photograph.","still image",jpeg,,"McDowell Hall (St. John's College, Annapolis, MD) 1930-1960.",,,,SJC-P-0393,,,,,,,,,,,,,,,,,,,page,"25 x 20 cm.",,,,,,,,,,,,,,,,,,,,,,,,,"McDowell Hall",https://s3.us-east-1.amazonaws.com/sjcdigitalarchives/original/60322506e57a80c32bd4c353b4c0d349.jpg,"Still Image","Photographic Archive—Annapolis",1,0
4416,https://digitalarchives.sjc.edu/items/show/4416,"Panoramic View of McDowell Hall with Cupola and Alumni Memorial Tablet, St. John's College, Annapolis, Maryland","1 photographic print : b&w",Unknown,,"Annapolis,MD","1950-1970 [circa]","St. John's College owns the rights to this photograph.","still image",jpeg,,"McDowell Hall (St. John's College, Annapolis, MD) 1950-1970.;  Alumni Memorial Tablet (St. John's College, MD) 1950-1970.",,,,SJC-P-0389,,,,,,,,,,,,,,,,,,,photograph,"26 x 20.5 cm.",,,,,,,,,,,,,,,,,,,,,,,,,"Alumni Memorial Tablet,McDowell Hall",https://s3.us-east-1.amazonaws.com/sjcdigitalarchives/original/e4b20ad2b217bf37f2fd4cff5c96459e.jpg,"Still Image","Photographic Archive—Annapolis",1,0
6025,https://digitalarchives.sjc.edu/items/show/6025,"Portrait of Edward Edgecomb Gray, as a Child, on the Steps of McDowell Hall, St. John's College, Annapolis, Maryland","1 photographic print : b&w",Unknown,,"Annapolis, MD",1915-09,"St. John's College owns the rights to this photograph.","Still Image",jpeg,,"St. John's College (Annapolis, Md.) -- Alumni and Alumnae. ;  Portraits ;  Gray, Edward Edgecomb",,,,SJC-P-2290,,,,,,,,,,,,,,,,,,,Photograph,"9 x 6.5 cm.",,,,,,,,,,,,,,,,,,,,,,,,,"McDowell Hall",https://s3.us-east-1.amazonaws.com/sjcdigitalarchives/original/690af1ed0f058f206596b9ed2a38aaab.jpg,"Still Image","Photographic Archive—Annapolis",1,0
375,https://digitalarchives.sjc.edu/items/show/375,"Portrait of James S. Martin on Steps of McDowell Hall, St. John's College, Annapolis, Maryland","1 photographic print : b&w ",Unknown,,"Annapolis, MD","1938-1942 [circa]","St. John's College owns the rights to this photograph.","still image",jpeg,,"St. John's College (Annapolis, Md.). -- Faculty. ;  Portraits ;  Martin, James Stewart",,,,SJC-P-0603,,,,,,,,,,"600 dpi",,,,,,,,,photograph,"9 x 11 cm.",,,,,,,,,,,,,,,,,,,,,,,,,"McDowell Hall,Tutors",https://s3.us-east-1.amazonaws.com/sjcdigitalarchives/original/29decd1697fefcc3888140509528afdb.jpg,"Still Image","Photographic Archive—Annapolis",1,0
376,https://digitalarchives.sjc.edu/items/show/376,"Portrait of James S. Martin on Steps of McDowell Hall, St. John's College, Annapolis, Maryland","1 photographic print : b&w ",Unknown,,"Annapolis, MD","1938-1942 [circa]","St. John's College owns the rights to this photograph.","still image",jpeg,,"St. John's College (Annapolis, Md.). -- Faculty. ;  Portraits ;  Martin, James Stewart",,,,SJC-P-0604,,,,,,,,,,"600 dpi",,,,,,,,,photograph,"9.5 x 12.5 cm.",,,,,,,,,,,,,,,,,,,,,,,,,"McDowell Hall,Tutors",https://s3.us-east-1.amazonaws.com/sjcdigitalarchives/original/109c3ef51618cb8541873a6ff2d76138.jpg,"Still Image","Photographic Archive—Annapolis",1,0
4283,https://digitalarchives.sjc.edu/items/show/4283,"Postcard of McDowell Hall during the Fire of 1909, St. John's College, Annapolis, Maryland","1 postcard : b&w",Unknown,,"Annapolis, MD",1909,"St. John's College owns the rights to this photograph.","still image",jpeg,,"St. John's College (Annapolis, Md.). -- McDowell Hall -- 1909. ;  Postcards -- 1909.",,,,SJC-P-0368,,,,,,,,,,,,,,,,,,,postcard,"14 x 9 cm.",,,,,,,,,,,,,,,,,,,,,,,,,"McDowell Hall",https://s3.us-east-1.amazonaws.com/sjcdigitalarchives/original/821b2f1354c0653e9830e78aff6b8747.jpg,"Still Image","Photographic Archive—Annapolis",1,0
4272,https://digitalarchives.sjc.edu/items/show/4272,"Postcard of McDowell Hall, St. John's College, Annapolis, Maryland","1 postcard : color",Unknown,,"Annapolis, MD","1915-1930 [circa]","St. John's College owns the rights to this photograph.","still image",jpeg,,"St. John's College (Annapolis, Md.). -- McDowell Hall -- 1920-1930. ;  Postcards -- 1920-1930.",,,,SJC-P-0355,,,,,,,,,,,,,,,,,,,postcard,"14 x 9 cm.",,,,,,,,,,,,,,,,,,,,,,,,,"McDowell Hall",https://s3.us-east-1.amazonaws.com/sjcdigitalarchives/original/61b59841028b6a6299243332912c4716.jpg,"Still Image","Photographic Archive—Annapolis",1,0
4415,https://digitalarchives.sjc.edu/items/show/4415,"Rear Side of McDowell Hall with Telephone Pole on Ground, St. John's College, Annapolis, Maryland","1 photographic print : b&w",Unknown,,"Annapolis,MD","1967 [circa]","St. John's College owns the rights to this photograph.","still image",jpeg,,"McDowell Hall (St. John's College, Annapolis, MD) 1960-1970.",,,,SJC-P-0388,,,,,,,,,,,,,,,,,,,photograph,"25.5 x 20.5 cm.",,,,,,,,,,,,,,,,,,,,,,,,,"McDowell Hall",https://s3.us-east-1.amazonaws.com/sjcdigitalarchives/original/c4408a9f33bb3bc41b7c2e10ad1487e3.jpg,"Still Image","Photographic Archive—Annapolis",1,0
4417,https://digitalarchives.sjc.edu/items/show/4417,"Rear View of McDowell Hall, St. John's College, Annapolis, Maryland","1 photographic print : b&w",Unknown,,"Annapolis,MD",1930-1940,"St. John's College owns the rights to this photograph.","still image",jpeg,,"McDowell Hall (St. John's College, Annapolis, MD) 1930-1940.",,,,SJC-P-0390,,,,,,,,,,,,,,,,,,,photograph,"25.5 x 20.5 cm.",,,,,,,,,,,,,,,,,,,,,,,,,"McDowell Hall",https://s3.us-east-1.amazonaws.com/sjcdigitalarchives/original/c5175ad4ffbadc958cd4f1c648ad209d.jpg,"Still Image","Photographic Archive—Annapolis",1,0
3467,https://digitalarchives.sjc.edu/items/show/3467,"Registrar's Office in McDowell Hall","1 photographic print : b&w","Pearson, Celia",,"Annapolis, MD",1988-08-05,"St. John’s College owns the rights to this photograph.","still  image",jpeg,,,,,,COM-MCD-P-0114,,,,,,,,,,,,,,,,,,,photograph,"25.25 x 20.25 cm.",,,,,,,,,,,,,,,,,,,,,,,,,"McDowell Hall,Registrar",https://s3.us-east-1.amazonaws.com/sjcdigitalarchives/original/ef6cc63bc50d6f718b490195ac3d3252.jpg,"Still Image","Photographic Archive—Annapolis",1,0
4411,https://digitalarchives.sjc.edu/items/show/4411,"Reproductions of Lithographs of McDowell Hall and Humphreys Hall on the St. John's College Annapolis Maryland Campus, by E. Sachse and Co., 1850","2 reproductions of lithographs on 1 matboard : b&w",Unknown,,"Annapolis, MD","circa 1960-1990 ","St. John's College owns the rights to this photograph.","still image",jpeg,,"Brick buildings",,,,SJC-P-0383,,,,,,,,,,,,,,,,,,,lithograph,"28 x 13 cm",,,,,,,,,,,,,,,,,,,,,,,,,"Humphreys Hall,McDowell Hall",https://s3.us-east-1.amazonaws.com/sjcdigitalarchives/original/3bd32d0c97c78ab292807c04c88b959a.jpg,"Still Image","Photographic Archive—Annapolis",1,0
5227,https://digitalarchives.sjc.edu/items/show/5227,"Richard D. Weigle and Construction Crew with Utility Pole near McDowell Hall during the Burying of the Power Lines, Annapolis, Maryland","1 photographic print : b&w",Unknown,,"Annapolis, MD",1967,"St. John's College owns the rights to this photograph.","Still Image",jpeg,,"Weigle, Richard Daniel 1912-",,,,SJC-P-1214,,,,,,,,,,,,,,,,,,,Photograph,"12.5 x 9 cm.",,,,,,,,,,,,,,,,,,,,,,,,,"Honorary Alumni,McDowell Hall,Presidents",https://s3.us-east-1.amazonaws.com/sjcdigitalarchives/original/d81c01c84d4cc477ea2cb680a2f4b4b0.jpg,"Still Image","Photographic Archive—Annapolis",1,0
5229,https://digitalarchives.sjc.edu/items/show/5229,"Richard D. Weigle and Construction Crew with Utility Pole near McDowell Hall during the Burying of the Power Lines, Annapolis, Maryland","1 photographic print : b&w",Unknown,,"Annapolis, MD",1967,"St. John's College owns the rights to this photograph.","Still Image",jpeg,,"Weigle, Richard Daniel 1912-",,,,SJC-P-1216,,,,,,,,,,,,,,,,,,,Photograph,"12.5 x 9 cm.",,,,,,,,,,,,,,,,,,,,,,,,,"Honorary Alumni,McDowell Hall,Presidents",https://s3.us-east-1.amazonaws.com/sjcdigitalarchives/original/8101a06fba183d3b5f3622a6bdd8796e.jpg,"Still Image","Photographic Archive—Annapolis",1,0
5228,https://digitalarchives.sjc.edu/items/show/5228,"Richard D. Weigle and Construction Crew with Utility Pole near Randall Hall during the Burying of the Power Lines, Annapolis, Maryland","1 photographic print : b&w",Unknown,,"Annapolis, MD",1967,"St. John's College owns the rights to this photograph.","Still Image",jpeg,,"Weigle, Richard Daniel 1912-",,,,SJC-P-1215,,,,,,,,,,,,,,,,,,,Photograph,"12.5 x 9 cm.",,,,,,,,,,,,,,,,,,,,,,,,,"Honorary Alumni,McDowell Hall,Presidents",https://s3.us-east-1.amazonaws.com/sjcdigitalarchives/original/b9e7900fc692668dc21efd8dcdca70e3.jpg,"Still Image","Photographic Archive—Annapolis",1,0
1192,https://digitalarchives.sjc.edu/items/show/1192,"Senior Cocktail Party in the Great Hall in McDowell Hall, St. John's College, Annapolis, Maryland","1 photographic print : b&w",Unknown,,"Annapolis, MD",1948-06,"St. John's College owns the rights to this photograph.","still image",jpeg,,"Cocktail parties ;  St. John's College (Annapolis, MD) -- Students. ;  McDowell Hall (St. John's College, Annapolis, MD) -- Great Hall -- 1948.",,,,SJC-P-0686,,,,,,,,,,,,,,,,,,,photograph,"17.5 x 13 cm.",,,,,,,,,,,,,,,,,,,,,,,,,"McDowell Hall",https://s3.us-east-1.amazonaws.com/sjcdigitalarchives/original/38cb392b51c77eb88fabb1c7cc20da23.jpg,"Still Image","Photographic Archive—Annapolis",1,0
4418,https://digitalarchives.sjc.edu/items/show/4418,"Side View of McDowell Hall in Snow with Cars, St. John's College, Annapolis, Maryland","1 photographic print : b&w",Unknown,,"Annapolis,MD","1940-1960 [circa]","St. John's College owns the rights to this photograph.","still image",jpeg,,"McDowell Hall (St. John's College, Annapolis, MD) 1940-1960.",,,,SJC-P-0392,,,,,,,,,,,,,,,,,,,photograph,"25 x 20 cm.",,,,,,,,,,,,,,,,,,,,,,,,,"McDowell Hall",https://s3.us-east-1.amazonaws.com/sjcdigitalarchives/original/1906fffce6e58481ca8d8b61f85a2028.jpg,"Still Image","Photographic Archive—Annapolis",1,0
4277,https://digitalarchives.sjc.edu/items/show/4277,"Side View of McDowell Hall in Snow, St. John's College, Annapolis, Maryland","1 photographic print : b&w",Unknown,,"Annapolis, MD","1930-1940 [circa]","St. John's College owns the rights to this photograph.","still image",jpeg,,"St. John's College (Annapolis, Md.). -- McDowell Hall --1930-1940.",,,,SJC-P-0361,,,,,,,,,,,,,,,,,,,photograph,"6.5 x 9 cm.",,,,,,,,,,,,,,,,,,,,,,,,,"McDowell Hall",https://s3.us-east-1.amazonaws.com/sjcdigitalarchives/original/d36ef8bb6ab7508dad670511f2c107fb.jpg,"Still Image","Photographic Archive—Annapolis",1,0
4414,https://digitalarchives.sjc.edu/items/show/4414,"Side View of McDowell Hall with Cupola and Students, St. John's College, Annapolis, Maryland","1 photographic print : color",Unknown,,"Annapolis,MD","1960-1980 [circa]","St. John's College owns the rights to this photograph.","still image",jpeg,,"McDowell Hall (St. John's College, Annapolis, MD) 1960-1980.",,,,SJC-P-0386,,,,,,,,,,,,,,,,,,,photograph,"25 x 20 cm.",,,,,,,,,,,,,,,,,,,,,,,,,"McDowell Hall",https://s3.us-east-1.amazonaws.com/sjcdigitalarchives/original/5fcb42aa682a31a9218f2915a62d1f63.jpg,"Still Image","Photographic Archive—Annapolis",1,0
<br />
<b>Deprecated</b>:  Directive 'allow_url_include' is deprecated in <b>Unknown</b> on line <b>0</b><br />
