﻿"Item Id","Item URI","Dublin Core:Title","Dublin Core:Description","Dublin Core:Creator","Dublin Core:Publisher","Dublin Core:Coverage","Dublin Core:Date","Dublin Core:Rights","Dublin Core:Type","Dublin Core:Format","Dublin Core:Source","Dublin Core:Subject","Dublin Core:Contributor","Dublin Core:Relation","Dublin Core:Language","Dublin Core:Identifier","Item Type Metadata:Occupation","Item Type Metadata:Participants","Item Type Metadata:Death Date","Item Type Metadata:Birthplace","Item Type Metadata:Birth Date","Item Type Metadata:Interviewer","Item Type Metadata:Biographical Text","Item Type Metadata:Bibliography","Item Type Metadata:Page numeration","Item Type Metadata:Resolution","Item Type Metadata:Identifier","Item Type Metadata:Inventory","Item Type Metadata:URL","Item Type Metadata:Text","Item Type Metadata:Interviewee","Item Type Metadata:Location","Item Type Metadata:Transcription","Item Type Metadata:Local URL","Item Type Metadata:Original Format","Item Type Metadata:Physical Dimensions","Item Type Metadata:Duration","Item Type Metadata:Compression","Item Type Metadata:Producer","Item Type Metadata:Director","Item Type Metadata:Bit Rate/Frequency","Item Type Metadata:Email Body","Item Type Metadata:Event Type","Item Type Metadata:Lesson Plan Text","Item Type Metadata:Materials","Item Type Metadata:Objectives","Item Type Metadata:Standards","Item Type Metadata:Number of Attachments","Item Type Metadata:BCC","Item Type Metadata:CC","Item Type Metadata:To","Item Type Metadata:From","Item Type Metadata:Subject Line","Item Type Metadata:Time Summary","Item Type Metadata:Episode","Item Type Metadata:Season","Item Type Metadata:Episode Type","Item Type Metadata:Explicit","Item Type Metadata:Block","PDF Text:Text",tags,file,itemType,collection,public,featured
3770,https://digitalarchives.sjc.edu/items/show/3770,"Bulletin of St. John's College in Annapolis, September 1952","Volume IV, No. 3 of the Bulletin of St. John's College in Annapolis, Report of the President.  Published in September 1952.","St. John's College","St. John's College","Annapolis, MD",1952-09,"St. John's College owns the rights to this publication.",text,pdf,,"Weigle, Richard Daniel, 1912- ",,,English,"Bulletin September 1952-Vol. IV No. 3-Report of the President",,,,,,,,,"16 pages",,,,,,,,,,paper,,,,,,,,,,,,,,,,,,,,,,,,,,Presidents,https://s3.us-east-1.amazonaws.com/sjcdigitalarchives/original/c29c31ddb4ec92532bde65c6c5518f53.pdf,Text,"The Bulletin",1,0
3771,https://digitalarchives.sjc.edu/items/show/3771,"Bulletin of St. John's College in Annapolis, September 1953","Volume V, No. 3 of the Bulletin of St. John's College in Annapolis, Report of the President.  Published in September 1953.","St. John's College","St. John's College","Annapolis, MD",1953-09,"St. John's College owns the rights to this publication.",text,pdf,,"Weigle, Richard Daniel, 1912- ",,,English,"Bulletin September 1953-Vol V No. 3-Report of the President",,,,,,,,,"20 pages",,,,,,,,,,paper,,,,,,,,,,,,,,,,,,,,,,,,,,"President's Report,Presidents",https://s3.us-east-1.amazonaws.com/sjcdigitalarchives/original/5b7578cdd25f79b7d5a4b69d97b39d6e.pdf,Text,"The Bulletin",1,0
3775,https://digitalarchives.sjc.edu/items/show/3775,"Bulletin of St. John's College, June 1949","Volume I, Number 3 of the Bulletin of St. John's College, Address Delivered at the 157th Commencement of St. John's College on June 6th, 1949 by Mr. John S. Kieffer, the President of the College.  Published in June 1949.","St. John's College","St. John's College","Annapolis, MD",1949-06-06,"St. John's College owns the rights to this publication.",text,pdf,,"Kieffer, John Spangler",,,English,"Bulletin, July 1949 Vol. I, #3 Commencement Address of John Kieffer, June 6th, 1949",,,,,,,,,"9 pages",,,,,,,,,,paper,,,,,,,,,,,,,,,,,,,,,,,,,,Presidents,https://s3.us-east-1.amazonaws.com/sjcdigitalarchives/original/21daf9fddd90365e24749a5cb80d5c81.pdf,Text,"The Bulletin",1,0
3829,https://digitalarchives.sjc.edu/items/show/3829,"JohnnieCast, April 17, 2018","Podcast entitled ""JohnnieCast"" featuring Presidents Pano Kanelos and Mark Roosevelt. Moderated by Phelosha Collaros. Recorded on April 17, 2018.","St. John's College","St. John's College","Annapolis, MD",2018-04-17,"St. John's College owns the rights to this sound recording.",sound,mp3,,,"Collaros, Phelosha; Kanelos, Panayiotis; Roosevelt, Mark",,English,"JC-2018-04-17 Call Recording",,,,,,,,,,,,,,,,,,,mp3,,01:01:41,,,,,,,,,,,,,,,,,,,,,,,,Presidents,https://s3.us-east-1.amazonaws.com/sjcdigitalarchives/original/682b0374c79922c9d481db96ad0654cc.WAV,Sound,JohnnieCast,1,0
6412,https://digitalarchives.sjc.edu/items/show/6412,"Supplement to the Bulletin, July 1937, The New Program at St. John's College in Annapolis","Supplement to the Bulletin, entitled ""The New Program at St. John's College in Annapolis"".  Published in July 1937.","St. John's College","St. John's College","Annapolis, MD",1937-07,"St. John's College owns the rights to this publication.",text,pdf,,,,,English,Bulletin_Supplement_1937_July,,,,,,,,,"22 pages",,,,,,,,,,paper,,,,,,,,,,,,,,,,,,,,,,,,,,"Deans,Presidents,Tutors",https://s3.us-east-1.amazonaws.com/sjcdigitalarchives/original/300e06d23ecf6c56dc40320ad224a634.pdf,Text,"The Bulletin",1,1
7798,https://digitalarchives.sjc.edu/items/show/7798,"Bulletin of St. John's College in Annapolis, August 1933","Volume III, No. 3 of the Bulletin of St. John's College in Annapolis, ""President's Report"". Published in August 1933.","St. John's College","St. John's College","Annapolis, MD",1933-08,"St. John's College owns the rights to this publication.",text,pdf,,"St. John's College (Annapolis, Md.)--Periodicals",,,English,Bulletin_volIII_no3_1933_August,,,,,,,,,"6 pages",,,,,,,,,,paper,,,,,,,,,,,,,,,,,,,,,,,,,,"President's Report,Presidents",https://s3.us-east-1.amazonaws.com/sjcdigitalarchives/original/d56472bee849689e65af0727ff6c23b2.pdf,Text,"The Bulletin",1,0
7799,https://digitalarchives.sjc.edu/items/show/7799,"Supplement to the Bulletin of St. John's College, April 1939","Supplement to the Bulletin of St. John's College, ""Report of the President."" Published in April 1939.","St. John's College","St. John's College","Annapolis, MD",1939-04,"St. John's College owns the rights to this publication.",text,pdf,,"St. John's College (Annapolis, Md.)--Periodicals",,,English,Bulletin_Supplement_1939_April,,,,,,,,,"27 pages",,,,,,,,,,paper,,,,,,,,,,,,,,,,,,,,,,,,,,"President's Report,Presidents",https://s3.us-east-1.amazonaws.com/sjcdigitalarchives/original/01b1d47c0f05eee78567066f8d5d8034.pdf,Text,"The Bulletin",1,0
7800,https://digitalarchives.sjc.edu/items/show/7800,"Supplement to the Bulletin of St. John's College, April 1940","Supplement to the Bulletin of St. John's College, ""Report of the President."" Published in April 1940.","St. John's College","St. John's College","Annapolis, MD",1940-04,"St. John's College owns the rights to this publication.",text,pdf,,"St. John's College (Annapolis, Md.)--Periodicals",,,English,Bulletin_Supplement_1940_April,,,,,,,,,"18 pages",,,,,,,,,,paper,,,,,,,,,,,,,,,,,,,,,,,,,,"President's Report,Presidents",https://s3.us-east-1.amazonaws.com/sjcdigitalarchives/original/d1ed1aaf3ee3f3ce7a5d2ec18f44e700.pdf,Text,"The Bulletin",1,0
7801,https://digitalarchives.sjc.edu/items/show/7801,"Supplementary Bulletin, St. John's College, May 1941","Supplementary Bulletin, St. John's College, ""Report of the President."" Published in May 1941.","St. John's College","St. John's College","Annapolis, MD",1941-05,"St. John's College owns the rights to this publication.",text,pdf,,"St. John's College (Annapolis, Md.)--Periodicals",,,English,SupplementaryBulletin_1941_May,,,,,,,,,"20 pages",,,,,,,,,,paper,,,,,,,,,,,,,,,,,,,,,,,,,,"President's Report,Presidents",https://s3.us-east-1.amazonaws.com/sjcdigitalarchives/original/61e389ea7ccdca47ae4f0d75f411ad77.pdf,Text,"The Bulletin",1,0
7802,https://digitalarchives.sjc.edu/items/show/7802,"Supplementary Bulletin, St. John's College, July 1942","Supplementary Bulletin, St. John's College, ""Report of the President."" Published in July 1942.","St. John's College","St. John's College","Annapolis, MD",1942-07,"St. John's College owns the rights to this publication.",text,pdf,,"St. John's College (Annapolis, Md.)--Periodicals",,,English,SupplementaryBulletin_1942_July,,,,,,,,,"21 pages",,,,,,,,,,paper,,,,,,,,,,,,,,,,,,,,,,,,,,"President's Report,Presidents",https://s3.us-east-1.amazonaws.com/sjcdigitalarchives/original/558694b58c19aa8951802e0971d3ebcf.pdf,Text,"The Bulletin",1,0
7803,https://digitalarchives.sjc.edu/items/show/7803,"Supplementary Bulletin, St. John's College, July 1943","Supplementary Bulletin, St. John's College, ""Report of the President."" Published in July 1943.","St. John's College","St. John's College","Annapolis, MD",1943-07,"St. John's College owns the rights to this publication.",text,pdf,,"St. John's College (Annapolis, Md.)--Periodicals",,,English,SupplementaryBulletin_1943_July,,,,,,,,,"14 pages",,,,,,,,,,paper,,,,,,,,,,,,,,,,,,,,,,,,,,"President's Report,Presidents",https://s3.us-east-1.amazonaws.com/sjcdigitalarchives/original/64b2006d90d62ee484b774e2d44fe5d2.pdf,Text,"The Bulletin",1,0
7805,https://digitalarchives.sjc.edu/items/show/7805,"Bulletin of St. John's College in Annapolis, September 1951","Volume III, No. 3 of the Bulletin of St. John's College in Annapolis, ""Report of the President."" Published in September 1951.","St. John's College","St. John's College","Annapolis, MD",1951-09,"St. John's College owns the rights to this publication.",text,pdf,,"St. John's College (Annapolis, Md.)--Periodicals",,,English,Bulletin_volIII_no3_1951_September,,,,,,,,,"18 pages",,,,,,,,,,paper,,,,,,,,,,,,,,,,,,,,,,,,,,"President's Report,Presidents",https://s3.us-east-1.amazonaws.com/sjcdigitalarchives/original/de2281fce0bdfae826f0315e1059711b.pdf,Text,"The Bulletin",1,0
7806,https://digitalarchives.sjc.edu/items/show/7806,"Bulletin of St. John's College in Annapolis, September 1952","Volume IV, No. 3 of the Bulletin of St. John's College in Annapolis, ""Report of the President."" Published in September 1952.","St. John's College","St. John's College","Annapolis, MD",1952-09,"St. John's College owns the rights to this publication.",text,pdf,,"St. John's College (Annapolis, Md.)--Periodicals",,,English,Bulletin_volIV_no3_1952_September,,,,,,,,,"18 pages",,,,,,,,,,paper,,,,,,,,,,,,,,,,,,,,,,,,,,"President's Report,Presidents",https://s3.us-east-1.amazonaws.com/sjcdigitalarchives/original/b720966b0322ed53c1d57dbfed2f1103.pdf,Text,"The Bulletin",1,0
7807,https://digitalarchives.sjc.edu/items/show/7807,"Biennial Report of St. John's College, Annapolis, MD., to the General Assembly of Maryland, 1876","Biennial Report of St. John's College, Annapolis, MD., to the General Assembly of Maryland, January Session 1876. By James M. Garnett, Principal.","St. John's College","John F. Wiley; State of Maryland","Annapolis, MD",1876,,text,pdf,,"St. John's College (Annapolis, Md.)",,,English,PresidentsReport_1876_January,,,,,,,,,"14 pages",,,,,,,,,,paper,,,,,,,,,,,,,,,,,,,,,,,,,,"President's Report,Presidents",https://s3.us-east-1.amazonaws.com/sjcdigitalarchives/original/ca0c0092830bbc067f90a9397fd21726.pdf,Text,"President's Reports",1,0
7808,https://digitalarchives.sjc.edu/items/show/7808,"Bulletin of St. John's College in Annapolis, January 1959","Volume XI, No. 1 of the Bulletin of St. John's College in Annapolis, ""Report of the President."" Published in January 1959.","St. John's College","St. John's College","Annapolis, MD",1959-01,"St. John's College owns the rights to this publication.",text,pdf,,"St. John's College (Annapolis, Md.)--Periodicals",,,English,Bulletin_volXI_no1_1959_January,,,,,,,,,"18 pages",,,,,,,,,,paper,,,,,,,,,,,,,,,,,,,,,,,,,,"President's Report,Presidents",https://s3.us-east-1.amazonaws.com/sjcdigitalarchives/original/fdaa51820e2d39c3949bb17527c41237.pdf,Text,"The Bulletin",1,0
7809,https://digitalarchives.sjc.edu/items/show/7809,"Bulletin of St. John's College in Annapolis, October 1960","Volume XII, No. 4 of the Bulletin of St. John's College in Annapolis, ""Report of the President."" Published in October 1960.","St. John's College","St. John's College","Annapolis, MD",1960-10,"St. John's College owns the rights to this publication.",text,pdf,,"St. John's College (Annapolis, Md.)--Periodicals",,,English,Bulletin_volXII_no4_1960_October,,,,,,,,,"23 pages",,,,,,,,,,paper,,,,,,,,,,,,,,,,,,,,,,,,,,"President's Report,Presidents",https://s3.us-east-1.amazonaws.com/sjcdigitalarchives/original/faac00066a61d5f36cb076ab5d823068.pdf,Text,"The Bulletin",1,0
7810,https://digitalarchives.sjc.edu/items/show/7810,"Bulletin of St. John's College in Annapolis, October 1961","Volume XIII, No. 4 of the Bulletin of St. John's College in Annapolis, ""Report of the President."" Published in October 1961.","St. John's College","St. John's College","Annapolis, MD",1961-10,"St. John's College owns the rights to this publication.",text,pdf,,"St. John's College (Annapolis, Md.)--Periodicals",,,English,Bulletin_volXIII_no4_1961_October,,,,,,,,,"20 pages",,,,,,,,,,paper,,,,,,,,,,,,,,,,,,,,,,,,,,"President's Report,Presidents",https://s3.us-east-1.amazonaws.com/sjcdigitalarchives/original/c44006add8d31714349ee671c6bcbb39.pdf,Text,"The Bulletin",1,0
7811,https://digitalarchives.sjc.edu/items/show/7811,"Bulletin of St. John's College in Annapolis, November 1962","Volume XIV, No. 4 of the Bulletin of St. John's College in Annapolis, ""Report of the President."" Published in November 1962.","St. John's College","St. John's College","Annapolis, MD",1962-11,"St. John's College owns the rights to this publication.",text,pdf,,"St. John's College (Annapolis, Md.)--Periodicals",,,English,Bulletin_volXIV_no4_1962_November,,,,,,,,,"16 pages",,,,,,,,,,paper,,,,,,,,,,,,,,,,,,,,,,,,,,"President's Report,Presidents",https://s3.us-east-1.amazonaws.com/sjcdigitalarchives/original/301aa77c4fb15bac99a7e5dc54114c6f.pdf,Text,"The Bulletin",1,0
7812,https://digitalarchives.sjc.edu/items/show/7812,"Bulletin of St. John's College, September 1963","Volume XV, No. 3 of the Bulletin of St. John's College, ""Report of the President."" Published in September 1963.","St. John's College","St. John's College","Annapolis, MD",1963-09,"St. John's College owns the rights to this publication.",text,pdf,,"St. John's College (Annapolis, Md.)--Periodicals",,,English,Bulletin_volXV_no3_1963_September,,,,,,,,,"35 pages",,,,,,,,,,paper,,,,,,,,,,,,,,,,,,,,,,,,,,"President's Report,Presidents",https://s3.us-east-1.amazonaws.com/sjcdigitalarchives/original/6e107a9172dd3f271e8556f629a5f78c.pdf,Text,"The Bulletin",1,0
7813,https://digitalarchives.sjc.edu/items/show/7813,"Bulletin of St. John's College, September 1964","Volume XVI, No. 3 of the Bulletin of St. John's College, ""Report of the President."" Published in September 1964.","St. John's College","St. John's College","Annapolis, MD",1964-09,"St. John's College owns the rights to this publication.",text,pdf,,"St. John's College (Annapolis, Md.)--Periodicals",,,English,Bulletin_volXVI_no3_1964_September,,,,,,,,,"20 pages",,,,,,,,,,paper,,,,,,,,,,,,,,,,,,,,,,,,,,"President's Report,Presidents",https://s3.us-east-1.amazonaws.com/sjcdigitalarchives/original/50579e74630c9d01e77dc8b8710f588e.pdf,Text,"The Bulletin",1,0
