﻿"Item Id","Item URI","Dublin Core:Title","Dublin Core:Description","Dublin Core:Creator","Dublin Core:Publisher","Dublin Core:Coverage","Dublin Core:Date","Dublin Core:Rights","Dublin Core:Type","Dublin Core:Format","Dublin Core:Source","Dublin Core:Subject","Dublin Core:Contributor","Dublin Core:Relation","Dublin Core:Language","Dublin Core:Identifier","Item Type Metadata:Occupation","Item Type Metadata:Participants","Item Type Metadata:Death Date","Item Type Metadata:Birthplace","Item Type Metadata:Birth Date","Item Type Metadata:Interviewer","Item Type Metadata:Biographical Text","Item Type Metadata:Bibliography","Item Type Metadata:Page numeration","Item Type Metadata:Resolution","Item Type Metadata:Identifier","Item Type Metadata:Inventory","Item Type Metadata:URL","Item Type Metadata:Text","Item Type Metadata:Interviewee","Item Type Metadata:Location","Item Type Metadata:Transcription","Item Type Metadata:Local URL","Item Type Metadata:Original Format","Item Type Metadata:Physical Dimensions","Item Type Metadata:Duration","Item Type Metadata:Compression","Item Type Metadata:Producer","Item Type Metadata:Director","Item Type Metadata:Bit Rate/Frequency","Item Type Metadata:Email Body","Item Type Metadata:Event Type","Item Type Metadata:Lesson Plan Text","Item Type Metadata:Materials","Item Type Metadata:Objectives","Item Type Metadata:Standards","Item Type Metadata:Number of Attachments","Item Type Metadata:BCC","Item Type Metadata:CC","Item Type Metadata:To","Item Type Metadata:From","Item Type Metadata:Subject Line","Item Type Metadata:Time Summary","Item Type Metadata:Episode","Item Type Metadata:Season","Item Type Metadata:Episode Type","Item Type Metadata:Explicit","Item Type Metadata:Block","PDF Text:Text",tags,file,itemType,collection,public,featured
5448,https://digitalarchives.sjc.edu/items/show/5448,"The West Reading Room of the Woodward Hall Library, St. John's College, Annapolis, Maryland","1 photographic print : b&w","Anne Arundel Photographers",,"Annapolis, MD","1960-1968 [circa]","St. John's college owns the rights to this photograph.","Still Image",jpeg,,"St. John's College (Annapolis, Md.). -- Students.",,,,SJC-P-1415,,,,,,,,,,,,,,,,,,,Photograph,"25.5 x 20.5 cm.",,,,,,,,,,,,,,,,,,,,,,,,,"Woodward Hall Library",https://s3.us-east-1.amazonaws.com/sjcdigitalarchives/original/d34c81094e626fe325928d8eaa8b5c83.jpg,"Still Image","Photographic Archive—Annapolis",1,0
5350,https://digitalarchives.sjc.edu/items/show/5350,"Top View of Woodward Hall Library with Columns, Annapolis Maryland","1 photographic print : b&w",Unknown,,"Annapolis, MD","1968 [circa]","St. John's College owns the rights to this photograph.","Still Image",jpeg,,,,,,SJC-P-1321,,,,,,,,,,,,,,,,,,,Photograph,"11 x 8 cm.",,,,,,,,,,,,,,,,,,,,,,,,,"Woodward Hall Library",https://s3.us-east-1.amazonaws.com/sjcdigitalarchives/original/7d6a04a45213302bede1945a29915316.jpg,"Still Image","Photographic Archive—Annapolis",1,0
5104,https://digitalarchives.sjc.edu/items/show/5104,"Two Students Holding a Model of the Five Platonic Solids in the Woodward Hall Library","1 photographic print : b&w",Unknown,,"Annapolis, MD",,"St. John's College owns the rights to this photograph.","Still Image",jpeg,,,,,,SJC-P-1040,,,,,,,,,,,,,,,,,,,Photograph,"25.5 x 20.5 cm.",,,,,,,,,,,,,,,,,,,,,,,,,"Woodward Hall Library",https://s3.us-east-1.amazonaws.com/sjcdigitalarchives/original/613396c4d5b3812c7349c2e219caf168.jpg,"Still Image","Photographic Archive—Annapolis",1,0
4403,https://digitalarchives.sjc.edu/items/show/4403,"View of Woodward Hall Library from the Front Porch of  McDowell Hall, St. John's College, Annapolis, Maryland","1 photographic print : b&w",Unknown,,"Annapolis,MD",1946,"St. John's College owns the rights to this photograph.","still image",jpeg,,"St. John's College (Annapolis, Md.). -- McDowell Hall -- 1940-1950. ;  St. John's College (Annapolis, Md.). -- Woodward Hall --1940-1950.",,,,SJC-P-0375,,,,,,,,,,,,,,,,,,,photograph,"25.5 x 20.5 cm.",,,,,,,,,,,,,,,,,,,,,,,,,"McDowell Hall,Woodward Hall Library",https://s3.us-east-1.amazonaws.com/sjcdigitalarchives/original/df90bab13fcb9481815a0130825d6d82.jpg,"Still Image","Photographic Archive—Annapolis",1,0
3204,https://digitalarchives.sjc.edu/items/show/3204,"Walking Tour of St. John's College, Brochure Circa 1970s","A place to learn...a place to walk...St. John's College","St. John's College",,"Annapolis, MD","1970-1979 (Circa)","St. John's College owns the rights to this publication.",text,pdf,,,,,English,"A Walking Tour St. John's College 2",,,,,,,,,"8 pages",,,,,,,,,,"paper (folded pamphlet)",,,,,,,,,,,,,,,,,,,,,,,,,,"Alumni Memorial Tablet,Campbell Hall,Carroll Barrister House,Chancellor Johnson House,Chase-Stone House,College Cannon,French Monument,Harrison Health Center,Hodson Boathouse,Humphreys Hall,Iglehart Hall,Liberty Bell,Liberty tree,McDowell Hall,Mellon Hall,Paca-Carroll House,Pinkney Hall,Randall Hall,Woodward Hall Library",https://s3.us-east-1.amazonaws.com/sjcdigitalarchives/original/7c3b5b4fcd6d2cb5217b07b56cced7af.pdf,Text,"Promotional Publications",1,0
3206,https://digitalarchives.sjc.edu/items/show/3206,"Walking Tour of St. John's College, Brochure Circa 1970s/1980s","St. John's College.  Brochure including information about the campus.","St. John's College",,"Annapolis, MD","1970s-1980s (Circa)","St. John's College owns the rights to this publication.",text,pdf,,,,,English,"A Walking Tour St. John's College 4",,,,,,,,,"7 pages",,,,,,,,,,"paper (folded pamphlet)",,,,,,,,,,,,,,,,,,,,,,,,,,"Alumni Memorial Tablet,Campbell Hall,Carroll Barrister House,Chancellor Johnson House,Chase-Stone House,College Cannon,French Monument,Harrison Health Center,Hodson Boathouse,Humphreys Hall,Iglehart Hall,Liberty Bell,Liberty tree,McDowell Hall,Mellon Hall,Paca-Carroll House,Pinkney Hall,Randall Hall,Woodward Hall Library",https://s3.us-east-1.amazonaws.com/sjcdigitalarchives/original/153d66bc4b439f276ce277347273741e.pdf,Text,"Promotional Publications",1,0
3205,https://digitalarchives.sjc.edu/items/show/3205,"Walking Tour of St. John's College, Brochure Circa 2003-2008","A Walking Tour of St. John's College","St. John's College",,"Annapolis, MJD","2003-2008 (Circa)","St. John's College owns the rights to this publication.",text,pdf,,,,,English,"A Walking Tour of St. John's College 3",,,,,,,,,"16 pages",,,,,,,,,,paper,,,,,,,,,,,,,,,,,,,,,,,,,,"Alumni Memorial Tablet,Barr-Buchanan Center,Campbell Hall,Carroll Barrister House,Chancellor Johnson House,Chase-Stone House,College Cannon,French Monument,Gilliam Hall,Greenfield Library,Harrison Health Center,Hodson Boathouse,Humphreys Hall,Iglehart Hall,Liberty Bell,Liberty tree,McDowell Hall,Mellon Hall,Paca-Carroll House,Pinkney Hall,Randall Hall,Spector Hall,Woodward Hall Library",https://s3.us-east-1.amazonaws.com/sjcdigitalarchives/original/a36f60bdc5cda45e0eabd2e5fc0856ff.pdf,Text,"Promotional Publications",1,0
89,https://digitalarchives.sjc.edu/items/show/89,"Woodward Hall Library and Pinkney Hall in the Snow, Annapolis, Maryland","1 photographic print : b&w ",Unknown,,"Annapolis, MD",,"St. John's College owns the rights to this photograph.","still image",jpeg,,,,,,SJC-P-1411,,,,,,,,,,"600 dpi",,,,,,,,,photograph,"25.5 x 20.5 cm.",,,,,,,,,,,,,,,,,,,,,,,,,"Pinkney Hall,Woodward Hall Library",https://s3.us-east-1.amazonaws.com/sjcdigitalarchives/original/51ed931aa7fac653ced385a150ae4c31.jpg,"Still Image","Photographic Archive—Annapolis",1,1
5363,https://digitalarchives.sjc.edu/items/show/5363,"Woodward Hall Library Annex under Construction, Annapolis, Maryland","1 photographic print : b&w",Unknown,,"Annapolis, MD","1968 [circa]","St. John's College owns the rights to this photograph.","Still Image",jpeg,,,,,,SJC-P-1334,,,,,,,,,,,,,,,,,,,Photograph,"8 x 11 cm.",,,,,,,,,,,,,,,,,,,,,,,,,"Woodward Hall Library",https://s3.us-east-1.amazonaws.com/sjcdigitalarchives/original/d1e34d1cb360b196664adbf7fb22fd7c.jpg,"Still Image","Photographic Archive—Annapolis",1,0
5403,https://digitalarchives.sjc.edu/items/show/5403,"Woodward Hall Library Annex under Construction, Annapolis, Maryland","1 photographic print : b&w",Unknown,,"Annapolis, MD","1968 [circa]","St. John's College owns the rights to this photograph.","Still Image",jpeg,,,,,,SJC-P-1372,,,,,,,,,,,,,,,,,,,Photograph,"11 x 8 cm.",,,,,,,,,,,,,,,,,,,,,,,,,"Woodward Hall Library",https://s3.us-east-1.amazonaws.com/sjcdigitalarchives/original/0addfe3b011aff81ec9ec3fd2aab69b2.jpg,"Still Image","Photographic Archive—Annapolis",1,0
5379,https://digitalarchives.sjc.edu/items/show/5379,"Woodward Hall Library Attic under Construction, Annapolis, Maryland","1 photographic print : b&w",Unknown,,"Annapolis, MD","1968 [circa]","St. John's College owns the rights to this photograph.","Still Image",jpeg,,,,,,SJC-P-1348,,,,,,,,,,,,,,,,,,,Photograph,"11 x 8 cm.",,,,,,,,,,,,,,,,,,,,,,,,,"Woodward Hall Library",https://s3.us-east-1.amazonaws.com/sjcdigitalarchives/original/4d39359b2acf816b03110d547d74ef74.jpg,"Still Image","Photographic Archive—Annapolis",1,0
5394,https://digitalarchives.sjc.edu/items/show/5394,"Woodward Hall Library Attic under Construction, Annapolis, Maryland","1 photographic print : b&w",Unknown,,"Annapolis, MD","1968 [circa]","St. John's College owns the rights to this photograph.","Still Image",jpeg,,,,,,SJC-P-1363,,,,,,,,,,,,,,,,,,,Photograph,"11 x 8 cm.",,,,,,,,,,,,,,,,,,,,,,,,,"Woodward Hall Library",https://s3.us-east-1.amazonaws.com/sjcdigitalarchives/original/7b5c1d974b020cd9f9fa523ef05e5989.jpg,"Still Image","Photographic Archive—Annapolis",1,0
5417,https://digitalarchives.sjc.edu/items/show/5417,"Woodward Hall Library Attic under Construction, Annapolis, Maryland","1 photographic print : b&w",Unknown,,"Annapolis, MD","1968 [circa]","St. John's College owns the rights to this photograph.","Still Image",jpeg,,,,,,SJC-P-1386,,,,,,,,,,,,,,,,,,,Photograph,"11 x 8 cm.",,,,,,,,,,,,,,,,,,,,,,,,,"Woodward Hall Library",https://s3.us-east-1.amazonaws.com/sjcdigitalarchives/original/e17634e411871d0422609e9db098a7f5.jpg,"Still Image","Photographic Archive—Annapolis",1,0
5422,https://digitalarchives.sjc.edu/items/show/5422,"Woodward Hall Library Attic under Construction, Annapolis, Maryland","1 photographic print : b&w",Unknown,,"Annapolis, MD","1968 [circa]","St. John's College owns the rights to this photograph.","Still Image",jpeg,,,,,,SJC-P-1391,,,,,,,,,,,,,,,,,,,Photograph,"11 x 8 cm.",,,,,,,,,,,,,,,,,,,,,,,,,"Woodward Hall Library",https://s3.us-east-1.amazonaws.com/sjcdigitalarchives/original/850b77a3a6e76195b15b8df0bdcfdf7a.jpg,"Still Image","Photographic Archive—Annapolis",1,0
5420,https://digitalarchives.sjc.edu/items/show/5420,"Woodward Hall Library Basement Interior under Construction, Annapolis, Maryland","1 photographic print : b&w",Unknown,,"Annapolis, MD","1968 [circa]","St. John's College owns the rights to this photograph.","Still Image",jpeg,,,,,,SJC-P-1389,,,,,,,,,,,,,,,,,,,Photograph,"11 x 8 cm.",,,,,,,,,,,,,,,,,,,,,,,,,"Woodward Hall Library",https://s3.us-east-1.amazonaws.com/sjcdigitalarchives/original/ed1bff3772ffbb6184c3d7d687f8e23b.jpg,"Still Image","Photographic Archive—Annapolis",1,0
5853,https://digitalarchives.sjc.edu/items/show/5853,"Woodward Hall Library Basement Interior under Construction, St. John's College, Annapolis, Maryland","1 photographic print : b&w","Stewart Brothers, Inc.",,"Annapolis, MD",2/27/1969,"St. John's College owns the rights to this photograph.","Still Image",jpeg,,,,,,SJC-P-2052,,,,,,,,,,,,,,,,,,,Photograph,"25.5 x 20.5 cm.",,,,,,,,,,,,,,,,,,,,,,,,,"Woodward Hall Library",https://s3.us-east-1.amazonaws.com/sjcdigitalarchives/original/2c22e837873478dfa39bc9c0dcc45bf6.jpg,"Still Image","Photographic Archive—Annapolis",1,0
5855,https://digitalarchives.sjc.edu/items/show/5855,"Woodward Hall Library Basement Interior under Construction, St. John's College, Annapolis, Maryland","1 photographic print : b&w","Stewart Brothers, Inc.",,"Annapolis, MD",1969-01-28,"St. John's College owns the rights to this photograph.","Still Image",jpeg,,,,,,SJC-P-2054,,,,,,,,,,,,,,,,,,,Photograph,"25.5 x 20.5 cm.",,,,,,,,,,,,,,,,,,,,,,,,,"Woodward Hall Library",https://s3.us-east-1.amazonaws.com/sjcdigitalarchives/original/743fcafeb29ae5d2638fb94a20dd2ca5.jpg,"Still Image","Photographic Archive—Annapolis",1,0
5854,https://digitalarchives.sjc.edu/items/show/5854,"Woodward Hall Library Basement Sub Level  Interior under Construction, St. John's College, Annapolis, Maryland","1 photographic print : b&w","Stewart Brothers, Inc.",,"Annapolis, MD",1969-01-28,"St. John's College owns the rights to this photograph.","Still Image",jpeg,,,,,,SJC-P-2053,,,,,,,,,,,,,,,,,,,Photograph,"25.5 x 20.5 cm.",,,,,,,,,,,,,,,,,,,,,,,,,"Woodward Hall Library",https://s3.us-east-1.amazonaws.com/sjcdigitalarchives/original/58cb12cb86186e8404df6b4ce351db8f.jpg,"Still Image","Photographic Archive—Annapolis",1,0
5355,https://digitalarchives.sjc.edu/items/show/5355,"Woodward Hall Library Columns under Construction, Annapolis, Maryland","1 photographic print : b&w",Unknown,,"Annapolis, MD","1968 [circa]","St. John's College owns the rights to this photograph.","Still Image",jpeg,,,,,,SJC-P-1326,,,,,,,,,,,,,,,,,,,Photograph,"11 x 8 cm.",,,,,,,,,,,,,,,,,,,,,,,,,"Woodward Hall Library",https://s3.us-east-1.amazonaws.com/sjcdigitalarchives/original/9390b23c3238b04f6db3e82bd9e148a4.jpg,"Still Image","Photographic Archive—Annapolis",1,0
5357,https://digitalarchives.sjc.edu/items/show/5357,"Woodward Hall Library Columns under Construction, Annapolis, Maryland","1 photographic print : b&w",Unknown,,"Annapolis, MD","1968 [circa]","St. John's College owns the rights to this photograph.","Still Image",jpeg,,,,,,SJC-P-1328,,,,,,,,,,,,,,,,,,,Photograph,"11 x 8 cm.",,,,,,,,,,,,,,,,,,,,,,,,,"Woodward Hall Library",https://s3.us-east-1.amazonaws.com/sjcdigitalarchives/original/d8538b7398a084a974aae2bf39f98aaa.jpg,"Still Image","Photographic Archive—Annapolis",1,0
