﻿"Item Id","Item URI","Dublin Core:Title","Dublin Core:Description","Dublin Core:Creator","Dublin Core:Publisher","Dublin Core:Coverage","Dublin Core:Date","Dublin Core:Rights","Dublin Core:Type","Dublin Core:Format","Dublin Core:Source","Dublin Core:Subject","Dublin Core:Contributor","Dublin Core:Relation","Dublin Core:Language","Dublin Core:Identifier","Item Type Metadata:Occupation","Item Type Metadata:Participants","Item Type Metadata:Death Date","Item Type Metadata:Birthplace","Item Type Metadata:Birth Date","Item Type Metadata:Interviewer","Item Type Metadata:Biographical Text","Item Type Metadata:Bibliography","Item Type Metadata:Page numeration","Item Type Metadata:Resolution","Item Type Metadata:Identifier","Item Type Metadata:Inventory","Item Type Metadata:URL","Item Type Metadata:Text","Item Type Metadata:Interviewee","Item Type Metadata:Location","Item Type Metadata:Transcription","Item Type Metadata:Local URL","Item Type Metadata:Original Format","Item Type Metadata:Physical Dimensions","Item Type Metadata:Duration","Item Type Metadata:Compression","Item Type Metadata:Producer","Item Type Metadata:Director","Item Type Metadata:Bit Rate/Frequency","Item Type Metadata:Email Body","Item Type Metadata:Event Type","Item Type Metadata:Lesson Plan Text","Item Type Metadata:Materials","Item Type Metadata:Objectives","Item Type Metadata:Standards","Item Type Metadata:Number of Attachments","Item Type Metadata:BCC","Item Type Metadata:CC","Item Type Metadata:To","Item Type Metadata:From","Item Type Metadata:Subject Line","Item Type Metadata:Time Summary","Item Type Metadata:Episode","Item Type Metadata:Season","Item Type Metadata:Episode Type","Item Type Metadata:Explicit","Item Type Metadata:Block","PDF Text:Text",tags,file,itemType,collection,public,featured
6523,https://digitalarchives.sjc.edu/items/show/6523,"Nietzsche contra Wagner, Wagner contra Nietzsche","Audio recording of a lecture delivered by Karol Berger on February 15, 2019 as part of the Formal Lecture Series.","Berger, Karol, 1947-","St. John's College","Annapolis, MD",2019-02-15,"A signed permission form has been received stating, ""I hereby grant St. John's College permission make an audio recording of my lecture, and retain copies for circulation and archival preservation at the St. John's College Greenfield Library. Make an audio recording of my lecture available online.""",sound,mp3,,,,,English,Berger_Karol_2019-02-15,,,,,,,,,,,,,,,,,,,wav,,00:54:27,,,,,,,,,,,,,,,,,,,,,,,,"Friday night lecture",https://s3.us-east-1.amazonaws.com/sjcdigitalarchives/original/32d77ec78240e4de991cd212908d7d62.mp3,Sound,"St. John's College Formal Lecture Series—Annapolis",1,0
6504,https://digitalarchives.sjc.edu/items/show/6504,"On the Philoctetes of Sophocles : the story of a sickness","Audio recording of a lecture delivered on February 15, 2019 by Richard McCombs as part of the Dean's Lecture and Concert Series.","McCombs, Richard A., II, 1967-","St. John's College","Santa Fe, NM",2019-02-15,"Meem Library has been given permission to make this item available online.",sound,mp3,,"Sophocles. Philoctetes",,,English,"McCombs, 02-2019",,,,,,,,,,,,,,,,,,,wav,,01:02:32,,,,,,,,,,,,,,,,,,,,,,,,"Friday night lecture",https://s3.us-east-1.amazonaws.com/sjcdigitalarchives/original/172db0d859b45f83cac3f46b4b43e586.mp3,Sound,"St. John's College Lecture Recordings—Santa Fe",1,0
6502,https://digitalarchives.sjc.edu/items/show/6502,"Recognizing Odysseus","Transcript of a lecture given on February 1, 2019 by Margaret Kirby as part of the Dean's Lecture and Concert Series.","Kirby, Margaret Anne, 1956-","St. John's College","Santa Fe, NM",2019-02-01,"Meem Library has been given permission to make this item available online.",text,pdf,,"Homer. Odyssey",,,English,"Kirby, M. Recognizing Odysseus",,,,,,,,,"31 pages",,,,,,,,,,pdf,,,,,,,,,,,,,,,,,,,,,,,,,,"Friday night lecture",https://s3.us-east-1.amazonaws.com/sjcdigitalarchives/original/e24fe9dc88497b8ab9d22f763a9e7ff9.pdf,Text,"St. John's College Lecture Transcripts—Santa Fe",1,0
6501,https://digitalarchives.sjc.edu/items/show/6501,"Recognizing Odysseus","Audio recording of a lecture delivered on February 1, 2019 by Margaret Kirby as part of the Dean's Lecture and Concert Series.","Kirby, Margaret Anne, 1956-","St. John's College","Santa Fe, NM",2019-02-01,"Meem Library has been given permission to make this item available online.",sound,mp3,,"Homer. Odyssey",,,English,"Kirby, 2-19",,,,,,,,,,,,,,,,,,,wav,,00:57:58,,,,,,,,,,,,,,,,,,,,,,,,"Friday night lecture",https://s3.us-east-1.amazonaws.com/sjcdigitalarchives/original/c11175f962f83248249d4db232818d87.mp3,Sound,"St. John's College Lecture Recordings—Santa Fe",1,0
6320,https://digitalarchives.sjc.edu/items/show/6320,"Nothing more than what the world offers : on Nietzsche's eternal return of the same","Audio recording of a lecture delivered on January 25, 2019 by Michael Grenke as part of the Dean's Lecture and Concert Series.","Grenke, Michael W.","St. John's College","Santa Fe, NM",2019-01-25,"Meem Library has been given permission to make this item available online.",sound,mp3,,"Nietzsche, Friedrich Wilhelm, 1844-1900",,,English,"Grenke, 01-2019",,,,,,,,,,,,,,,,,,,wav,,00:58:13,,,,,,,,,,,,,,,,,,,,,,,,"Friday night lecture,Tutors",https://s3.us-east-1.amazonaws.com/sjcdigitalarchives/original/dd063ce7c708a146c1e91f567b4d3345.mp3,Sound,"St. John's College Lecture Recordings—Santa Fe",1,0
6282,https://digitalarchives.sjc.edu/items/show/6282,"Augustine on the Foundations of Christian Political Thought","Audio recording of a lecture delivered by Daniel Burns on January 25, 2019 as part of the Formal Lecture Series.","Burns, Daniel E.","St. John's College","Annapolis, MD",2019-01-25,"A signed permission form has been received stating, ""I hereby grant St. John's College permission make an audio recording of my lecture, and retain copies for circulation and archival preservation at the St. John's College Greenfield Library. Make an audio recording of my lecture available online. Make typescript copies of my lecture available for circulation and archival preservation at the St. John's College Greenfield Library.""",sound,mp3,,,,,English,Burns_Daniel_2019-01-25,,,,,,,,,,,,,,,,,,,wav,,00:50:59,,,,,,,,,,,,,,,,,,,,,,,,"Friday night lecture",https://s3.us-east-1.amazonaws.com/sjcdigitalarchives/original/29cb761b7d960b5fe686df8de3fcc003.mp3,Sound,"St. John's College Formal Lecture Series—Annapolis",1,0
6265,https://digitalarchives.sjc.edu/items/show/6265,"The Serpent and An Octopus:  On Reading","Audio recording of a lecture delivered by Matt Linck on January 18, 2019 as part of the Formal Lecture Series.","Linck, Matthew S.","St. John's College","Annapolis, MD",2019-01-18,"A signed permission form has been received stating, ""I hereby grant St. John's College permission make an audio recording of my lecture, and retain copies for circulation and archival preservation at the St. John's College Greenfield Library. Make an audio recording of my lecture available online.""",sound,mp3,,,,,English,Linck_Matt_2019-01-18,,,,,,,,,,,,,,,,,,,wav,,00:47:33,,,,,,,,,,,,,,,,,,,,,,,,"Friday night lecture,Tutors",https://s3.us-east-1.amazonaws.com/sjcdigitalarchives/original/59a573b4953919a9a1a32de6e9405335.mp3,Sound,"St. John's College Formal Lecture Series—Annapolis",1,0
6137,https://digitalarchives.sjc.edu/items/show/6137,"The science of forgetfulness : philosophy and tradition in the essays of Montaigne","Audio recording of a lecture given on January 18, 2019 by Ann Hartle as part of the Dean's Lecture and Concert Series.","Hartle, Ann","St. John's College","Santa Fe, NM",2019-01-18,"Meem Library has been given permission to make this item available online.",sound,mp3,,"Montaigne, Michel de, 1533-1592. Essais",,,English,"Hartle, 01-19",,,,,,,,,,,,,,,,,,,wav,,01:05:07,,,,,,,,,,,,,,,,,,,,,,,,"Friday night lecture",https://s3.us-east-1.amazonaws.com/sjcdigitalarchives/original/a9a085380627308bd5b6210fdc7a1a94.mp3,Sound,"St. John's College Lecture Recordings—Santa Fe",1,0
6032,https://digitalarchives.sjc.edu/items/show/6032,"Insane Emotions?","Audio recording of a lecture delivered by Agness Callard on January 11, 2019 as part of the Formal Lecture Series.","Callard, Agnes","St. John's College","Annapolis, MD",2019-01-11,"A signed permission form has been received stating, ""I hereby grant St. John's College permission make an audio recording of my lecture, and retain copies for circulation and archival preservation at the St. John's College Greenfield Library. Make an audio recording of my lecture available online.  Make typescript copies of my lecture available for circulation and archival preservation at the St. John's College Greenfield Library.  Make a copy of my typescript available online.""",sound,mp3,,,,,English,Callard_Agnes_2019-01-11,,,,,,,,,,,,,,,,,,,wav,,00:51:41,,,,,,,,,,,,,,,,,,,,,,,,"Friday night lecture",https://s3.us-east-1.amazonaws.com/sjcdigitalarchives/original/75f538c96f7817e2782e77bc86ca3fdc.mp3,Sound,"St. John's College Formal Lecture Series—Annapolis",1,0
5999,https://digitalarchives.sjc.edu/items/show/5999,"The swine and the chatterbox : Wittgenstein and Augustine on talking (and not talking) about God","Audio recording of a lecture given on December 7, 2018 by Caleb Thompson as part of the Dean's Lecture and Concert Series.","Thompson, Caleb","St. John's College","Santa Fe, NM",2018-12-07,"Meem Library has been given permission to make this item available online.",sound,mp3,,"Augustine, of Hippo, Saint, 354-430. Confessiones; Wittgenstein, Ludwig, 1889-1951",,,English,"Thompson, 2018-12",,,,,,,,,,,,,,,,,,,wav,,00:37:56,,,,,,,,,,,,,,,,,,,,,,,,"Friday night lecture",https://s3.us-east-1.amazonaws.com/sjcdigitalarchives/original/8194b6ae1f7f081423e60b031781dc92.mp3,Sound,"St. John's College Lecture Recordings—Santa Fe",1,0
5998,https://digitalarchives.sjc.edu/items/show/5998,"Truths about quantum mechanics","Audio recording of a lecture given on November 30, 2018 by Bernhardt Trout as part of the Dean's Lecture and Concert Series.","Trout, Bernhardt L.","St. John's College","Santa Fe, NM",2018-11-30,"Meem Library has been given the permission to make this item available online.",sound,mp3,,"Quantum theory",,,English,"Trout 2018-11-30",,,,,,,,,,,,,,,,,,,wav,,00:54:46,,,,,,,,,,,,,,,,,,,,,,,,"Friday night lecture",https://s3.us-east-1.amazonaws.com/sjcdigitalarchives/original/91e9097233e6f55e03c519654e44771f.mp3,Sound,"St. John's College Lecture Recordings—Santa Fe",1,0
5935,https://digitalarchives.sjc.edu/items/show/5935,"Truths about quantum mechanics","Transcript of a lecture given on November 30, 2018 by Bernhardt Trout as part of the Dean's Lecture and Concern Series.","Trout, Bernhardt L.","St. John's College","Santa Fe, NM",2018-11-30,"Meem Library has been given permission to make this item available online.",text,pdf,,"Quantum theory",,,English,"Trout, B. Truths about Quantum Mechanics",,,,,,,,,"33 pages",,,,,,,,,,pdf,,,,,,,,,,,,,,,,,,,,,,,,,,"Friday night lecture",https://s3.us-east-1.amazonaws.com/sjcdigitalarchives/original/c71f19b6a666d027cec9ed79d9f07cc9.pdf,Text,"St. John's College Lecture Transcripts—Santa Fe",1,0
5831,https://digitalarchives.sjc.edu/items/show/5831,"Matrix Mechanics to Quantum Logic","Audio recording of a lecture delivered by Mark Sinnett on November 30, 2018 as part of the Formal Lecture Series.","Sinnett, Mark, 1963-","St. John's College","Annapolis, MD",2018-11-30,"A signed permission form has been received stating, ""I hereby grant St. John's College permission make an audio recording of my lecture, and retain copies for circulation and archival preservation at the St. John's College Greenfield Library. Make an audio recording of my lecture available online. ",sound,mp3,,,,,English,Sinnett_Mark_2018-11-30,,,,,,,,,,,,,,,,,,,wav,,00:59:17,,,,,,,,,,,,,,,,,,,,,,,,"Friday night lecture,Tutors",https://s3.us-east-1.amazonaws.com/sjcdigitalarchives/original/acc6b3048ed2ebf310956d4316967249.mp3,Sound,"St. John's College Formal Lecture Series—Annapolis",1,0
5832,https://digitalarchives.sjc.edu/items/show/5832,"A Many Headed Beast","Audio recording of a lecture delivered by Jason Tipton on November 16, 2018, as part of the Formal Lecture Series.","Tipton, Jason A.","St. John's College","Annapolis, MD",2018-11-16,"A signed permission form has been received stating, ""I hereby grant St. John's College permission make an audio recording of my lecture, and retain copies for circulation and archival preservation at the St. John's College Greenfield Library. Make an audio recording of my lecture available online. Make typescript copies of my lecture available for circulation and archival preservation at the St. John's College Greenfield Library. Make copies of my typescript available online""",sound,mp3,,"Plato. Republic; Soul",,,English,Tipton_Jason_2018-11-16,,,,,,,,,,,,,,,,,,,wav,,00:52:46,,,,,,,,,,,,,,,,,,,,,,,,"Friday night lecture,Tutors",https://s3.us-east-1.amazonaws.com/sjcdigitalarchives/original/c6683e75b0320650ae65aa6e7049027c.mp3,Sound,"St. John's College Formal Lecture Series—Annapolis",1,0
5587,https://digitalarchives.sjc.edu/items/show/5587,"Maimonides's Guide of the Perplexed : its three great themes","Audio recording of a lecture given on November 16, 2018 as part of the Dean's Lecture and Concert Series.","Parens, Joshua, 1961-","St. John's College","Santa Fe, NM",2018-11-16,"Meem Library has been given permission to make this item available online.",sound,mp3,,"Maimonides, Moses, 1135-1204. Dalālat al-ḥāʾirīn",,,English,"Parens, 2018-11",,,,,,,,,,,,,,,,,,,wav,,00:59:07,,,,,,,,,,,,,,,,,,,,,,,,"Friday night lecture",https://s3.us-east-1.amazonaws.com/sjcdigitalarchives/original/4156309879f01a566f30f06f7f681ae3.mp3,Sound,"St. John's College Lecture Recordings—Santa Fe",1,0
6417,https://digitalarchives.sjc.edu/items/show/6417,"Much Ado About Nothing: A Brief History of 'Empty Space'","Typescript of a lecture delivered on October 26, 2018 by Bryan Luther as part of the Formal Lecture Series.","Luther, Bryan","St. John's College","Annapolis, MD",2018-10-26,"Permission has been granted to put this online.",text,pdf,,,,,English,Luther_Bryan_2018-10-26_Typescript,,,,,,,,,"11 pages",,,,,,,,,,paper,,,,,,,,,,,,,,,,,,,,,,,,,,"Friday night lecture,Tutors",https://s3.us-east-1.amazonaws.com/sjcdigitalarchives/original/ffd7ec9abc748a6ae9af6ef916ce8870.pdf,Text,"St. John's College Formal Lecture Series—Annapolis",1,0
5307,https://digitalarchives.sjc.edu/items/show/5307,"""Deeds of balanced vengeance"" and the end of The Iliad","Audio recording of a lecture given on October 26, 2018 by Emily Austin as part of the Dean's Lecture and Concert Series.","Austin, Emily","St. John's College","Santa Fe, NM",2018-10-26,"Meem Library has been given permission to make this item available online.",sound,mp3,,"Homer. Iliad",,,English,"Austin, 2018-10",,,,,,,,,,,,,,,,,,,wav,,00:44:39,,,,,,,,,,,,,,,,,,,,,,,,"Friday night lecture",https://s3.us-east-1.amazonaws.com/sjcdigitalarchives/original/e553d77c227b743eed847bbe38d4704c.mp3,Sound,"St. John's College Lecture Recordings—Santa Fe",1,0
5584,https://digitalarchives.sjc.edu/items/show/5584,"Translating the Odyssey Again:  Why and How (Steiner Lecture)","Audio recording of a lecture delivered by Emily Wilson on October 19, 2018 as part of the Formal Lecture Series.","Wilson, Emily","St. John's College","Annapolis, MD",2018-10-19,"A signed permission form has been received stating, ""I hereby grant St. John's College permission to: Make an audio recording of my lecture, and retain copies for circulation and archival preservation in the St. John's College Greenfield Library. Make an audio recording of my lecture available online.""",sound,mp3,,,,,"English; Greek",Wilson_Emily_2018-10-19,,,,,,,,,,,,,,,,,,,wav,,00:53:06,,,,,,,,,,,,,,,,,,,,,,,,"Friday night lecture,Steiner lecture",https://s3.us-east-1.amazonaws.com/sjcdigitalarchives/original/c55939f48eb4e36d5d146b1eb3df74de.mp3,Sound,"St. John's College Formal Lecture Series—Annapolis",1,0
5001,https://digitalarchives.sjc.edu/items/show/5001,"The dream of reason : a poetry reading by Jenny George","Audio recording of a lecture given on October 19, 2018 by Jenny George as part of the Dean's Lecture and Concert Series.","George, Jenny","St. John's College","Santa Fe, NM",2018-10-19,"Meem Library has been given permission to make this item available online.",sound,mp3,,,,,English,"George, 2018-10",,,,,,,,,,,,,,,,,,,wav,,00:38:32,,,,,,,,,,,,,,,,,,,,,,,,"Friday night lecture",https://s3.us-east-1.amazonaws.com/sjcdigitalarchives/original/d0ecedd1fa778468af1c22fb25a0e315.mp3,Sound,"St. John's College Lecture Recordings—Santa Fe",1,0
4943,https://digitalarchives.sjc.edu/items/show/4943,"The laboratory's trivium","Audio recording of a lecture given on October 5, 2018 by Eric Poppele as part of the Dean's Lecture and Concert Series.","Poppele, Eric Hunter","St. John's College","Santa Fe, NM",2018-10-05,"Meem Library has been given permission to make this item available online.",sound,mp3,,,,,English,"Poppele, 2018-10",,,,,,,,,,,,,,,,,,,wav,,01:00:54,,,,,,,,,,,,,,,,,,,,,,,,"Friday night lecture",https://s3.us-east-1.amazonaws.com/sjcdigitalarchives/original/45761a272e1fbd21e1d17503239473c7.mp3,Sound,"St. John's College Lecture Recordings—Santa Fe",1,0
