﻿"Item Id","Item URI","Dublin Core:Title","Dublin Core:Description","Dublin Core:Creator","Dublin Core:Publisher","Dublin Core:Coverage","Dublin Core:Date","Dublin Core:Rights","Dublin Core:Type","Dublin Core:Format","Dublin Core:Source","Dublin Core:Subject","Dublin Core:Contributor","Dublin Core:Relation","Dublin Core:Language","Dublin Core:Identifier","Item Type Metadata:Occupation","Item Type Metadata:Participants","Item Type Metadata:Death Date","Item Type Metadata:Birthplace","Item Type Metadata:Birth Date","Item Type Metadata:Interviewer","Item Type Metadata:Biographical Text","Item Type Metadata:Bibliography","Item Type Metadata:Page numeration","Item Type Metadata:Resolution","Item Type Metadata:Identifier","Item Type Metadata:Inventory","Item Type Metadata:URL","Item Type Metadata:Text","Item Type Metadata:Interviewee","Item Type Metadata:Location","Item Type Metadata:Transcription","Item Type Metadata:Local URL","Item Type Metadata:Original Format","Item Type Metadata:Physical Dimensions","Item Type Metadata:Duration","Item Type Metadata:Compression","Item Type Metadata:Producer","Item Type Metadata:Director","Item Type Metadata:Bit Rate/Frequency","Item Type Metadata:Email Body","Item Type Metadata:Event Type","Item Type Metadata:Lesson Plan Text","Item Type Metadata:Materials","Item Type Metadata:Objectives","Item Type Metadata:Standards","Item Type Metadata:Number of Attachments","Item Type Metadata:BCC","Item Type Metadata:CC","Item Type Metadata:To","Item Type Metadata:From","Item Type Metadata:Subject Line","Item Type Metadata:Time Summary","Item Type Metadata:Episode","Item Type Metadata:Season","Item Type Metadata:Episode Type","Item Type Metadata:Explicit","Item Type Metadata:Block","PDF Text:Text",tags,file,itemType,collection,public,featured
961,https://digitalarchives.sjc.edu/items/show/961,"William B. Pitt Seated at Exhibit Booth Exhibiting the St. John's College Laboratory Curriculum at a Science Fair","1 photographic print : b&w",Unknown,,"Annapolis, MD",1968,"St. John's College owns the rights to this photograph.","still image",jpeg,,"Pitt, William Bruce",,,,SJC-P-0556,,,,,,,,,,"600 dpi",,,,,,,,,photograph,"11.5 x 8.5 cm.",,,,,,,,,,,,,,,,,,,,,,,,,Tutors,https://s3.us-east-1.amazonaws.com/sjcdigitalarchives/original/6a01ec13ee4966721e64fdbfe77922b9.jpg,"Still Image","Photographic Archive—Annapolis",1,1
963,https://digitalarchives.sjc.edu/items/show/963,"William B. Pitt Demonstrating an Electromagnetic Sonometer to Children at an Exhibit Booth of the St. John's College Laboratory Curriculum at a Science Fair","1 photographic print : b&w",Unknown,,"Annapolis, MD",1968,"St. John's College owns the rights to this photograph.","still image",jpeg,,"Pitt, William Bruce",,,,SJC-P-0558,,,,,,,,,,"600 dpi",,,,,,,,,photograph,"11.5 x 8.5 cm.",,,,,,,,,,,,,,,,,,,,,,,,,Tutors,https://s3.us-east-1.amazonaws.com/sjcdigitalarchives/original/4153e92fae1a39a8042fe6cbc1ba6870.jpg,"Still Image","Photographic Archive—Annapolis",1,1
964,https://digitalarchives.sjc.edu/items/show/964,"William B. Pitt Demonstrating an Electromagnetic Sonometer to a Man and Woman at an Exhibit Booth of the St. John's College Laboratory Curriculum at a Science Fair","1 photographic print : b&w",Unknown,,"Annapolis, MD",1968,"St. John's College owns the rights to this photograph.","still image",jpeg,,"Pitt, William Bruce",,,,SJC-P-0559,,,,,,,,,,"600 dpi",,,,,,,,,photograph,"11.5 x 8.5 cm.",,,,,,,,,,,,,,,,,,,,,,,,,Tutors,https://s3.us-east-1.amazonaws.com/sjcdigitalarchives/original/22debd6cd09ce0f622a06ca2d2320c88.jpg,"Still Image","Photographic Archive—Annapolis",1,1
967,https://digitalarchives.sjc.edu/items/show/967,"All in C Major:  On the Very Beginning of Bach's Well-Tempered Clavier","Audio recording of a lecture delivered on September 2, 2016 by Elliott Zuckerman as part of the Formal Lecture Series.","Zuckerman, Elliott","St. John's College","Annapolis, MD",2016-09-02,"A signed permission form has been received stating, ""I hereby grant St. John's College permission make an audio recording of my lecture, and retain copies for circulation and archival preservation at the St. John's College Greenfield Library. Make an audio recording of my lecture available online. Make typescript copies of my lecture available for circulation and archival preservation at the St. John's College Greenfield Library. Make a copy of my typescript available online.""",sound,mp3,,,,,English,Zuckerman_Elliott_2016-09-02,,,,,,,,,,,,,,,,,,,wav,,37:47,,,,,,,,,,,,,,,,,,,,,,,,"Friday night lecture,Tutors",https://s3.us-east-1.amazonaws.com/sjcdigitalarchives/original/b3468567b7840f1aa072dc57a338215d.mp3,Sound,"St. John's College Formal Lecture Series—Annapolis",1,0
1017,https://digitalarchives.sjc.edu/items/show/1017,"Jacob Klein Seated at Dinner Table, St. John's College, Annapolis, Maryland","1 photographic print : b&w",Unknown,,"Annapolis, MD","1949-1958 [circa]","St. John's College owns the rights to this photograph.","still image",jpeg,,"St. John's College (Annapolis, Md.). -- Deans. ;  St. John's College (Annapolis, Md.). -- Faculty.; Klein, Jacob, 1899-1978.",,,,SJC-P-0062,,,,,,,,,,,,,,,,,,,photograph,"24 x 16.5 cm.",,,,,,,,,,,,,,,,,,,,,,,,,"Deans,Honorary Alumni,Tutors",https://s3.us-east-1.amazonaws.com/sjcdigitalarchives/original/4cd6ea95d8c893f13157b32171609bca.jpg,"Still Image","Photographic Archive—Annapolis",1,1
1018,https://digitalarchives.sjc.edu/items/show/1018,"Jacob Klein at Ford K. Brown's Formal Lecture ""Shakespeare and Chartres"" in the King William Room, St. John's College, Annapolis, Maryland","1 photographic print : b&w","Fox, Cecil H.",,"Annapolis, MD",1972-08-16,"St. John's College owns the rights to this photograph.","still image",jpeg,,"St. John's College (Annapolis, Md.). -- Friday night lecture series ;  August 16, 1972 ;  St. John's College (Annapolis, Md.). -- Deans. ;  St. John's College (Annapolis, Md.). -- Faculty. ;  Lectures and Lecturing; Klein, Jacob, 1899-1978.",,,,SJC-P-0064,,,,,,,,,,,,,,,,,,,photograph,"25.5 x 20.5 cm",,,,,,,,,,,,,,,,,,,,,,,,,"Deans,Honorary Alumni,Tutors",https://s3.us-east-1.amazonaws.com/sjcdigitalarchives/original/309c5ec5076185174f5b75d1245e0544.jpg,"Still Image","Photographic Archive—Annapolis",1,0
1020,https://digitalarchives.sjc.edu/items/show/1020,"Stringfellow Barr, Seated, with John S. Kieffer Standing behind him after  Stingfellow Barr's Lecture ""The Beginning of the St. John's Program"" in the King William Room, St. John's College, Annapolis, Maryland","1 photographic print : b&w","Fox, Cecil H.",,"Annapolis, MD",1972-07,"St. John's College owns the rights to this photograph.","still image",jpeg,,"St. John's College (Annapolis, Md.). -- Friday night lecture series ;  July 1972 ;  St. John's College (Annapolis, Md.). -- Presidents. ;  St. John's College (Annapolis, Md.). -- Faculty. ;  Lectures and Lecturing; Barr, Stringfellow, 1897- ;  Kieffer, John Spangler.",,,,SJC-P-0067,,,,,,,,,,,,,,,,,,,photograph,"24.5 x 19.5 cm.",,,,,,,,,,,,,,,,,,,,,,,,,"Deans,Honorary Alumni,Presidents,Tutors",https://s3.us-east-1.amazonaws.com/sjcdigitalarchives/original/733d925ca3b76951ff3245e6a1f00cee.jpg,"Still Image","Photographic Archive—Annapolis",1,1
1025,https://digitalarchives.sjc.edu/items/show/1025,"Samuel S. Kutler on Back Campus, St. John's College, Annapolis, Maryland","1 photographic print : b&w",Unknown,,"Annapolis, MD",1950,"St. John's College owns the rights to this photograph.","still image",jpeg,,"St. John's College (Annapolis, Md.). -- Deans. ;  St. John's College (Annapolis, Md.). -- Faculty.; Kutler, Samuel S.",,,,SJC-P-0072,,,,,,,,,,,,,,,,,,,photograph,"mount 7.5 x 7.5 cm. ;  7 x 7 cm.",,,,,,,,,,,,,,,,,,,,,,,,,"Alumni,Deans,Tutors",https://s3.us-east-1.amazonaws.com/sjcdigitalarchives/original/fd952ce8200193574cc0fcef17d690c4.jpg,"Still Image","Photographic Archive—Annapolis",1,1
1029,https://digitalarchives.sjc.edu/items/show/1029,"Franz and Olga L. Plunder Having a Meal with Jacob Klein in McDowell Hall, St. John's College, Annapolis, Maryland, circa 1940-1942","Franz and Olga L. Plunder Having a Meal with Jacob Klein in McDowell Hall, St. John's College, Annapolis, Maryland, circa 1940-1942",Unknown,,"Annapolis, MD","circa 1940-1942","St. John's College owns the rights to this photograph.","still image",jpeg,,"St. John's College (Annapolis, Md.). -- Staff. ;  St. John's College (Annapolis, Md.). -- Deans. ;  St. John's College (Annapolis, Md.). -- Faculty.; Klein, Jacob, 1899-1978. ;  Plunder, Franz ;  Plunder, Olga L. ;  Heinmuller, Ernest",,,,SJC-P-0082,,,,,,,,,,,,,,,,,,,photograph,"25.5 x 20.5 cm",,,,,,,,,,,,,,,,,,,,,,,,,"McDowell Hall,Tutors",https://s3.us-east-1.amazonaws.com/sjcdigitalarchives/original/7403b999a5e878a44ccfddf24381685a.jpg,"Still Image","Photographic Archive—Annapolis",1,1
1032,https://digitalarchives.sjc.edu/items/show/1032,"J. Winfree Smith Speaking at Commencement in the Francis Scott Key Auditorium, St. John's College, Annapolis, Maryland, 1973","1 photographic print : b&w",Unknown,,"Annapolis, MD",1973,"St. John's College owns the rights to this photograph.","still image",jpeg,,"Commencement (St. John's College, Annapolis, MD) 1973. ;  St. John's College (Annapolis, Md.). -- Faculty. ;  St. John's College (Annapolis, Md.). -- Assistant Deans.; Smith, J. Winfree.",,,,SJC-P-0089,,,,,,,,,,,,,,,,,,,photograph,"25.5 x 20.5 cm",,,,,,,,,,,,,,,,,,,,,,,,,"Commencement,Honorary Alumni,Tutors",https://s3.us-east-1.amazonaws.com/sjcdigitalarchives/original/888e50d1671d6e84f4202f87971be17d.jpg,"Still Image","Photographic Archive—Annapolis",1,1
1033,https://digitalarchives.sjc.edu/items/show/1033,"J. Winfree Smith Speaking at the ""Real Olympics"" on Back Campus, St. John's College, Annapolis, Maryland","1 photographic print : b&w","Williamson, Ray. A",,"Annapolis, MD",1972,"St. John's College owns the rights to this photograph.","still image",jpeg,,"Real Olympics (St. John's College, Annapolis, MD) ;  St. John's College (Annapolis, Md.). -- Faculty. ;  St. John's College (Annapolis, Md.). -- Assistant Deans.; Smith, J. Winfree",,,,SJC-P-0090,,,,,,,,,,,,,,,,,,,photograph,"25.5 x 20.5 cm",,,,,,,,,,,,,,,,,,,,,,,,,"Honorary Alumni,Tutors",https://s3.us-east-1.amazonaws.com/sjcdigitalarchives/original/ecea8885caed067c5b29125ffcf1b564.jpg,"Still Image","Photographic Archive—Annapolis",1,1
1067,https://digitalarchives.sjc.edu/items/show/1067,"William B. Pitt Demonstrating an Electromagnetic Sonometer to a Man and Woman at an Exhibit Booth of the St. John's College Laboratory Curriculum at a Science Fair","1 photographic print : b&w",Unknown,,"Annapolis, MD",1968,"St. John's College owns the rights to this photograph.","still image",jpeg,,"Science Exhibitions ;  St. John's College (Annapolis, Md.). -- Curricula. ;  St. John's College (Annapolis, Md.). -- Faculty.; Pitt, William Bruce",,,,SJC-P-0561,,,,,,,,,,,,,,,,,,,photograph,"11.5 x 8.5 cm.",,,,,,,,,,,,,,,,,,,,,,,,,Tutors,https://s3.us-east-1.amazonaws.com/sjcdigitalarchives/original/05899dd30797714ef6262ffef91c14b3.jpg,"Still Image","Photographic Archive—Annapolis",1,1
1071,https://digitalarchives.sjc.edu/items/show/1071,"David Reisman with J. Winfree Smith and Members of the St. John's College Peace Corps Faculty on Back Campus, St. John's College, Annapolis, Maryland","1 photographic print : b&w",Unknown,,"Annapolis, MD",1965-08-04,"St. John's College owns the rights to this photograph.","still image",jpeg,,"Peace Corps (U.S.) ;  St. John's College (Annapolis, Md.). -- Assistant Deans. ;  St. John's College (Annapolis, Md.). -- Faculty.; Reisman, David ;  Smith, J. Winfree.",,,,SJC-P-0565,,,,,,,,,,,,,,,,,,,photograph,"9 x 9 cm.",,,,,,,,,,,,,,,,,,,,,,,,,"Honorary Alumni,Tutors",https://s3.us-east-1.amazonaws.com/sjcdigitalarchives/original/2e3c30f6ad076f18e062d68f2ae584e5.jpg,"Still Image","Photographic Archive—Annapolis",1,1
1072,https://digitalarchives.sjc.edu/items/show/1072,"David Reisman with J. Winfree Smith and Members of the St. John's College Peace Corps Faculty on Back Campus, St. John's College, Annapolis, Maryland","1 photographic print : b&w",Unknown,,"Annapolis, MD",1965-08-04,"St. John's College owns the rights to this photograph.","still image",jpeg,,"Peace Corps (U.S.) ;  St. John's College (Annapolis, Md.). -- Assistant Deans. ;  St. John's College (Annapolis, Md.). -- Faculty.; Reisman, David ;  Smith, J. Winfree.",,,,SJC-P-0566,,,,,,,,,,,,,,,,,,,photograph,"9 x 9 cm.",,,,,,,,,,,,,,,,,,,,,,,,,"Honorary Alumni,Tutors",https://s3.us-east-1.amazonaws.com/sjcdigitalarchives/original/d838858c58ee33be87c4262b288c01a8.jpg,"Still Image","Photographic Archive—Annapolis",1,1
1073,https://digitalarchives.sjc.edu/items/show/1073,"David Reisman with J. Winfree Smith and Members of the St. John's College Peace Corps Faculty on Back Campus, St. John's College, Annapolis, Maryland","1 photographic print : b&w",Unknown,,"Annapolis, MD",1965-08-04,"St. John's College owns the rights to this photograph.","still image",jpeg,,"Peace Corps (U.S.) ;  St. John's College (Annapolis, Md.). -- Assistant Deans. ;  St. John's College (Annapolis, Md.). -- Faculty.; Reisman, David ;  Smith, J. Winfree.",,,,SJC-P-0567,,,,,,,,,,,,,,,,,,,photograph,"10 x 9 cm.",,,,,,,,,,,,,,,,,,,,,,,,,"Honorary Alumni,Tutors",https://s3.us-east-1.amazonaws.com/sjcdigitalarchives/original/dd9a59657c4c98f24909825305645a63.jpg,"Still Image","Photographic Archive—Annapolis",1,1
1074,https://digitalarchives.sjc.edu/items/show/1074,"David Reisman and Members of the St. John's College Peace Corps Faculty on Back Campus, St. John's College, Annapolis, Maryland","1 photographic print : b&w",Unknown,,"Annapolis, MD",1965-08-04,"St. John's College owns the rights to this photograph.","still image",jpeg,,"Peace Corps (U.S.) ;  St. John's College (Annapolis, Md.). -- Assistant Deans. ;  St. John's College (Annapolis, Md.). -- Faculty.; Reisman, David ;  Smith, J. Winfree.",,,,SJC-P-0568,,,,,,,,,,,,,,,,,,,photograph,"11 x 9 cm.",,,,,,,,,,,,,,,,,,,,,,,,,Tutors,https://s3.us-east-1.amazonaws.com/sjcdigitalarchives/original/61bbdcb2d0d30a492938def872402bfe.jpg,"Still Image","Photographic Archive—Annapolis",1,1
1075,https://digitalarchives.sjc.edu/items/show/1075,"David Reisman and Members of the St. John's College Peace Corps Faculty on Back Campus, St. John's College, Annapolis, Maryland","1 photographic print : b&w",Unknown,,"Annapolis, MD",1965-08-04,"St. John's College owns the rights to this photograph.","still image",jpeg,,"Peace Corps (U.S.) ;  St. John's College (Annapolis, Md.). -- Assistant Deans. ;  St. John's College (Annapolis, Md.). -- Faculty.; Reisman, David ;  Smith, J. Winfree.",,,,SJC-P-0569,,,,,,,,,,,,,,,,,,,photograph,"12 x 9 cm.",,,,,,,,,,,,,,,,,,,,,,,,,Tutors,https://s3.us-east-1.amazonaws.com/sjcdigitalarchives/original/c902cb46c93b7071bce1cc1623dccaae.jpg,"Still Image","Photographic Archive—Annapolis",1,1
1078,https://digitalarchives.sjc.edu/items/show/1078,"The Horses of Achilles","Audio recording of a lecture delivered on September 9, 2016 by Robert Charles Abbott, Jr. as part of the Formal Lecture Series.","Abbott, Robert Charles, Jr.","St. John's College","Annapolis, MD",2016-09-09,"A signed permission form has been received stating, ""I hereby grant St. John's College permission make an audio recording of my lecture, and retain copies for circulation and archival preservation at the St. John's College Greenfield Library. Make an audio recording of my lecture available online. Make typescript copies of my lecture available for circulation and archival preservation at the St. John's College Greenfield Library. Make a copy of my typescript available online.""",sound,mp3,,,,"<a title=""Typescript"" href=""http://digitalarchives.sjc.edu/items/show/1139"">Typescript</a>",English,Abbott_Robert_2016-09-09,,,,,,,,,,,,,,,,,,,wav,,00:50:20,,,,,,,,,,,,,,,,,,,,,,,,"Friday night lecture,Tutors",https://s3.us-east-1.amazonaws.com/sjcdigitalarchives/original/b633069f0d5f0635203c8ee6df3499e0.mp3,Sound,"St. John's College Formal Lecture Series—Annapolis",1,0
1079,https://digitalarchives.sjc.edu/items/show/1079,"Music and the idea of a world: on Plato and Schopenhauer","Typescript of a lecture delivered on November 06, 2015 by Peter Kalkavage as part of the Formal Lecture Series.","Kalkavage, Peter","St. John's College","Annapolis, MD",2015-11-06,"A signed permission form has been received stating, ""I hereby grant St. John's College permission to: Make an audio recording of my lecture, and retain copies for circulation and archival preservation in the St. John's College Greenfield Library. Make an audio recording of my lecture available online. Make a typescript copy of my lecture available for circulation and archival preservation in the St. John's College Greenfield Library. Make a copy of my typescript available online.""",text,pdf,,,,"<a title=""Audio recording"" href=""http://digitalarchives.sjc.edu/items/show/7"">Audio recording</a>",,,,,,,,,,,"26 pages",,,,,,,,,,paper,,,,,,,,,,,,,,,,,,,,,,,,,,"Friday night lecture,Tutors",https://s3.us-east-1.amazonaws.com/sjcdigitalarchives/original/d3d838bcb78889d23d0936809007c4c4.pdf,Text,"St. John's College Formal Lecture Series—Annapolis",1,0
1080,https://digitalarchives.sjc.edu/items/show/1080,"Towards ""a new birth of freedom"" - Tragedy and comedy, 1786 Schiller's Don Carlos and Mozart's The marriage of Figaro.","Audio recording of a lecture delivered on September 17, 2004 by Gisela Berns as part of the Formal Lecture Series.","Berns, Gisela N.","St. John's College","Annapolis, MD",2004-09-17,"St. John's College has been given permission to make this item available online.",sound,mp3,,"Schiller, Friedrich, 1759-1805. Don Carlos; Mozart, Wolfgang Amadeus, 1756-1791. Nozze di Figaro.
; Tragedy; Comedy",,"<a title=""Typescript"" href=""http://digitalarchives.sjc.edu/items/show/1081"">Typsecript</a>",English,"Bib # 74602",,,,,,,,,,,,,,,,,,,"cassette tape",,01:46:33,,,,,,,,,,,,,,,,,,,,,,,,"Friday night lecture,Tutors",https://s3.us-east-1.amazonaws.com/sjcdigitalarchives/original/e47061388ee04bdbd9ab6c5e47b069d4.mp3,Sound,"St. John's College Formal Lecture Series—Annapolis",1,0
