﻿"Item Id","Item URI","Dublin Core:Title","Dublin Core:Description","Dublin Core:Creator","Dublin Core:Publisher","Dublin Core:Coverage","Dublin Core:Date","Dublin Core:Rights","Dublin Core:Type","Dublin Core:Format","Dublin Core:Source","Dublin Core:Subject","Dublin Core:Contributor","Dublin Core:Relation","Dublin Core:Language","Dublin Core:Identifier","Item Type Metadata:Occupation","Item Type Metadata:Participants","Item Type Metadata:Death Date","Item Type Metadata:Birthplace","Item Type Metadata:Birth Date","Item Type Metadata:Interviewer","Item Type Metadata:Biographical Text","Item Type Metadata:Bibliography","Item Type Metadata:Page numeration","Item Type Metadata:Resolution","Item Type Metadata:Identifier","Item Type Metadata:Inventory","Item Type Metadata:URL","Item Type Metadata:Text","Item Type Metadata:Interviewee","Item Type Metadata:Location","Item Type Metadata:Transcription","Item Type Metadata:Local URL","Item Type Metadata:Original Format","Item Type Metadata:Physical Dimensions","Item Type Metadata:Duration","Item Type Metadata:Compression","Item Type Metadata:Producer","Item Type Metadata:Director","Item Type Metadata:Bit Rate/Frequency","Item Type Metadata:Email Body","Item Type Metadata:Event Type","Item Type Metadata:Lesson Plan Text","Item Type Metadata:Materials","Item Type Metadata:Objectives","Item Type Metadata:Standards","Item Type Metadata:Number of Attachments","Item Type Metadata:BCC","Item Type Metadata:CC","Item Type Metadata:To","Item Type Metadata:From","Item Type Metadata:Subject Line","Item Type Metadata:Time Summary","Item Type Metadata:Episode","Item Type Metadata:Season","Item Type Metadata:Episode Type","Item Type Metadata:Explicit","Item Type Metadata:Block","PDF Text:Text",tags,file,itemType,collection,public,featured
1201,https://digitalarchives.sjc.edu/items/show/1201,"Portrait of Lawrence Townsend","1 photographic print : b&w",Unknown,,"Annapolis, MD","1946-1949 [circa]","St. John's College owns the rights to this photograph.","still image",jpeg,,"St. John's College (Annapolis, MD) -- Faculty. ;  Portraits; Townsend, Lawrence",,,,SJC-P-0696,,,,,,,,,,,,,,,,,,,photograph,"12.5 x 17 cm.",,,,,,,,,,,,,,,,,,,,,,,,,Tutors,https://s3.us-east-1.amazonaws.com/sjcdigitalarchives/original/909bc36889683560f18dfc876295c037.jpg,"Still Image","Photographic Archive—Annapolis",1,0
1711,https://digitalarchives.sjc.edu/items/show/1711,"Raymond N. Wilburn in Archway outside McDowell Hall, Lower Level, St. John's College, Annapolis, Maryland","1 photographic print : b&w",Unknown,,"Annapolis, MD","1946-1951 [circa]","St. John's College owns the rights to this photograph.","still image",jpeg,,"St. John's College (Annapolis, Md.). -- Deans. ;  St. John's College (Annapolis, Md.). -- Faculty.; Wilburn, Raymond N.",,,,SJC-P-0154,,,,,,,,,,,,,,,,,,,photograph,"12.5 x 18 cm.",,,,,,,,,,,,,,,,,,,,,,,,,"Deans,Tutors",https://s3.us-east-1.amazonaws.com/sjcdigitalarchives/original/00495c5e8d57149e8b00331b758c1079.jpg,"Still Image","Photographic Archive—Annapolis",1,0
1714,https://digitalarchives.sjc.edu/items/show/1714,"Raymond N. Wilburn in Archway outside McDowell Hall, Lower Level, St. John's College, Annapolis, Maryland","1 photographic print : b&w",Unknown,,"Annapolis, MD","1946-1951 [circa]","St. John's College owns the rights to this photograph.","still image",jpeg,,"St. John's College (Annapolis, Md.). -- Deans. ;  St. John's College (Annapolis, Md.). -- Faculty.; Wilburn, Raymond N.",,,,SJC-P-0157,,,,,,,,,,,,,,,,,,,photograph,"12.5 x 18 cm.",,,,,,,,,,,,,,,,,,,,,,,,,"Deans,Tutors",https://s3.us-east-1.amazonaws.com/sjcdigitalarchives/original/155877c2eb8d55941ff3d945fbbeb923.jpg,"Still Image","Photographic Archive—Annapolis",1,0
1715,https://digitalarchives.sjc.edu/items/show/1715,"Raymond N. Wilburn in Archway outside McDowell Hall, Lower Level, St. John's College, Annapolis, Maryland","1 photographic print : b&w",Unknown,,"Annapolis, MD","1946-1951 [circa]","St. John's College owns the rights to this photograph.","still image",jpeg,,"St. John's College (Annapolis, Md.). -- Deans. ;  St. John's College (Annapolis, Md.). -- Faculty.; Wilburn, Raymond N.",,,,SJC-P-0158,,,,,,,,,,,,,,,,,,,photograph,"12.5 x 18 cm.",,,,,,,,,,,,,,,,,,,,,,,,,"Deans,Tutors",https://s3.us-east-1.amazonaws.com/sjcdigitalarchives/original/18c632df721c434e911eba8eea558b86.jpg,"Still Image","Photographic Archive—Annapolis",1,0
1748,https://digitalarchives.sjc.edu/items/show/1748,"Stringfellow Barr and Jacob Klein and Charles A. Nelson Seated at a Table in the King William Room during a Graduation Seminar, St. John's College, Annapolis, Maryland","1 printed image",Unknown,,"Annapolis, MD",1947,"St. John's College owns the rights to this photograph.","still image",jpeg,,"St. John's College (Annapolis, Md.). -- Presidents ;   St. John's College (Annapolis, Md.). --Deans. ;  St. John's College (Annapolis, Md.). --Faculty.; Barr, Stringfellow, 1897-1982;  Klein, Jacob, 1899-1978. ;  Nelson, Charles A.",,,,SJC-P-0200,,,,,,,,,,,,,,,,,,,,"13 x 8.75 cm.",,,,,,,,,,,,,,,,,,,,,,,,,"Alumni,Deans,Honorary Alumni,Presidents,Tutors",https://s3.us-east-1.amazonaws.com/sjcdigitalarchives/original/ad1161782f9a10627265c38403763a67.jpg,"Still Image","Photographic Archive—Annapolis",1,0
933,https://digitalarchives.sjc.edu/items/show/933,"Simon Kaplan Standing outside in front of an Open Door, St. John's College, Annapolis, Maryland","1 photographic print : b&w",Unknown,,"Annapolis, MD","1947 [circa]","St. John's College owns the rights to this photograph.","still image",jpeg,,"Kaplan, Simon. 1893-1979.",,,,SJC-P-0050,,,,,,,,,,"600 dpi",,,,,,,,,photograph,"12.5 x 18 cm.",,,,,,,,,,,,,,,,,,,,,,,,,Tutors,https://s3.us-east-1.amazonaws.com/sjcdigitalarchives/original/2dbc55d3a55a373690df6435ad7bbb86.jpg,"Still Image","Photographic Archive—Annapolis",1,1
940,https://digitalarchives.sjc.edu/items/show/940,"Jacob Klein and Stringfellow Barr Seated at Table, St. John's College, Annapolis, Maryland","1 photocopy of a page from the St. John's College Yearbook : b&w",Unknown,,"Annapolis, MD","1947 [circa]","St. John's College owns the rights to this photograph.","still image",jpeg,,"Barr, Stringfellow, 1897-1982 ;  Klein, Jacob, 1899-1978.",,,,SJC-P-0059,,,,,,,,,,"600 dpi",,,,,,,,,paper,"11.5 x 9 cm.",,,,,,,,,,,,,,,,,,,,,,,,,"Deans,Presidents,Tutors",https://s3.us-east-1.amazonaws.com/sjcdigitalarchives/original/21e19dc989aa37989dc96a69e65c2273.jpg,"Still Image","Photographic Archive—Annapolis",1,1
352,https://digitalarchives.sjc.edu/items/show/352,"Jacob Klein in Academic Robe Speaking at Commencement under the Liberty Tree, Annapolis, Maryland, 1947","1 photographic print : b&w",Unknown,,"Annapolis, MD",1947-06,"St. John's College owns the rights to this photograph.","still image",jpeg,,"Klein, Jacob, 1899-1978.",,"<a title=""Commencement Program"" href=""http://digitalarchives.sjc.edu/items/show/3196"">Commencement Program</a>",,SJC-P-0906,,,,,,,,,,"600 dpi",,,,,,,,,photograph,"25.5 x 20.5 cm.",,,,,,,,,,,,,,,,,,,,,,,,,"Commencement,Deans,Liberty tree,Tutors",https://s3.us-east-1.amazonaws.com/sjcdigitalarchives/original/5948a89dc297070ec5fe11e015106750.jpg,"Still Image","Photographic Archive—Annapolis",1,0
4620,https://digitalarchives.sjc.edu/items/show/4620,"Jacob Klein, in Academic Robe, Speaking at Podium during Commencement under the Liberty Tree, St. John's College, Annapolis, Maryland, June 9, 1947","1 photographic print : b&w",Unknown,,"Annapolis, MD",1947-06-09,"St. John's College owns the rights to this photograph.","Still Image",jpeg,,"Commencement (St. John's College, Annapolis, MD). ;  St. John's College (Annapolis, Md.). -- Deans ;  St. John's College (Annapolis, Md.). -- Faculty. ;  Baccalaureate addresses ;  Klein, Jacob, 1899-1978.",,,,SJC-P-0640,,,,,,,,,,,,,,,,,,,Photograph,"17.5 x 13 cm.",,,,,,,,,,,,,,,,,,,,,,,,,"Commencement,Deans,Honorary Alumni,Tutors",https://s3.us-east-1.amazonaws.com/sjcdigitalarchives/original/369ba867d34d24e45451bdde64ca1161.jpg,"Still Image","Photographic Archive—Annapolis",1,0
2641,https://digitalarchives.sjc.edu/items/show/2641,"Inauguration of John Spangler Kieffer - Procession with Faculty in Academic Robes on Front Campus, Annapolis, Maryland","1 photographic print : b&w","Hayman Studio",,"Annapolis, MD",1947-10-25,"St. John's College owns the rights to this photograph.","still image",jpeg,,"Kieffer, John Spangler.",,"<a title=""Inauguration Program"" href=""http://digitalarchives.sjc.edu/items/show/1324"">Inauguration Program</a>",,SJC-P-1066,,,,,,,,,,,,,,,,,,,photograph,"25.5 x 20.5 cm.",,,,,,,,,,,,,,,,,,,,,,,,,"Inauguration,Tutors",https://s3.us-east-1.amazonaws.com/sjcdigitalarchives/original/5890f4c277cb8610218a395dd5ffa354.jpg,"Still Image","Photographic Archive—Annapolis",1,1
2642,https://digitalarchives.sjc.edu/items/show/2642,"Inauguration of John Spangler Kieffer - Procession on Front Campus, Annapolis, Maryland","1 photographic print : b&w","Hayman Studio",,"Annapolis, MD",1947-10-25,"St. John's College owns the rights to this photograph.","still image",jpeg,,"Kieffer, John Spangler.",,"<a title=""Inauguration Program"" href=""http://digitalarchives.sjc.edu/items/show/1324"">Inauguration Program</a>",,SJC-P-1067,,,,,,,,,,,,,,,,,,,photograph,"25.5 x 20.5 cm.",,,,,,,,,,,,,,,,,,,,,,,,,"Inauguration,Tutors",https://s3.us-east-1.amazonaws.com/sjcdigitalarchives/original/62203e9f20ede086086590ab63a6371f.jpg,"Still Image","Photographic Archive—Annapolis",1,1
2643,https://digitalarchives.sjc.edu/items/show/2643,"Inauguration of John Spangler Kieffer - Procession with Faculty in Academic Robes on Front Campus, Annapolis, Maryland","1 photographic print : b&w","Hayman Studio",,"Annapolis, MD",1947-10-25,"St. John's College owns the rights to this photograph.","still image",jpeg,,"Kieffer, John Spangler.",,"<a title=""Inauguration Program"" href=""http://digitalarchives.sjc.edu/items/show/1324"">Inauguration Program</a>",,SJC-P-1068,,,,,,,,,,,,,,,,,,,photograph,"25.5 x 20.5 cm.",,,,,,,,,,,,,,,,,,,,,,,,,"Inauguration,Tutors",https://s3.us-east-1.amazonaws.com/sjcdigitalarchives/original/0f286f696f8a7459b8c675ef1b4f994a.jpg,"Still Image","Photographic Archive—Annapolis",1,1
2644,https://digitalarchives.sjc.edu/items/show/2644,"Inauguration of John Spangler Kieffer - Procession with Faculty in Academic Robes on Front Campus, Annapolis, Maryland","1 photographic print : b&w","Hayman Studio",,"Annapolis, MD",1947-10-25,"St. John's College owns the rights to this photograph.","still image",jpeg,,"Kieffer, John Spangler.",,"<a title=""Inauguration Program"" href=""http://digitalarchives.sjc.edu/items/show/1324"">Inauguration Program</a>",,SJC-P-1069,,,,,,,,,,,,,,,,,,,photograph,"25.5 x 20.5 cm.",,,,,,,,,,,,,,,,,,,,,,,,,"Inauguration,Tutors",https://s3.us-east-1.amazonaws.com/sjcdigitalarchives/original/7759d57d745ecd316d7cf4902ef10eb5.jpg,"Still Image","Photographic Archive—Annapolis",1,1
2647,https://digitalarchives.sjc.edu/items/show/2647,"Inauguration of John Spangler Kieffer - Procession with Faculty in Academic Robes and Naval Academy Officers in Uniform, Annapolis, Maryland","1 photographic print : b&w","Official U.S. Navy Photograph",,"Annapolis, MD",1947-10-25,,"still image",jpeg,,"Kieffer, John Spangler.",,"<a title=""Inauguration Program"" href=""http://digitalarchives.sjc.edu/items/show/1324"">Inauguration Program</a>",,SJC-P-1072,,,,,,,,,,,,,,,,,,,photograph,"25.5 x 20.5 cm.",,,,,,,,,,,,,,,,,,,,,,,,,"Inauguration,Tutors,U.S. Naval Academy",https://s3.us-east-1.amazonaws.com/sjcdigitalarchives/original/e17504c98b6cab193b3a9af466640f61.jpg,"Still Image","Photographic Archive—Annapolis",1,1
2648,https://digitalarchives.sjc.edu/items/show/2648,"Inauguration of John Spangler Kieffer - Procession with Faculty in Academic Robes and Naval Academy Officers in Uniform, Annapolis, Maryland","1 photographic print : b&w","Official U.S. Navy Photograph",,"Annapolis, MD",1947-10-25,,"still image",jpeg,,"Kieffer, John Spangler.",,"<a title=""Inauguration Program"" href=""http://digitalarchives.sjc.edu/items/show/1324"">Inauguration Program</a>",,SJC-P-1073,,,,,,,,,,,,,,,,,,,photograph,"25.5 x 20.5 cm.",,,,,,,,,,,,,,,,,,,,,,,,,"Inauguration,Tutors,U.S. Naval Academy",https://s3.us-east-1.amazonaws.com/sjcdigitalarchives/original/a95580419fe0741233cb1ec4026f3dc3.jpg,"Still Image","Photographic Archive—Annapolis",1,1
2652,https://digitalarchives.sjc.edu/items/show/2652,"Inauguration of John Spangler Kieffer - Faculty in Academic Robes Standing during Inauguration, Annapolis, Maryland","1 photographic print : b&w","Official U.S. Navy Photograph",,"Annapolis, MD",1947-10-25,,"still image",jpeg,,"VanDupeu, Henry P.; Kieffer, John Spangler.",,"<a title=""Inauguration Program"" href=""http://digitalarchives.sjc.edu/items/show/1324"">Inauguration Program</a>",,SJC-P-1077,,,,,,,,,,,,,,,,,,,photograph,"25.5 x 20.5 cm.",,,,,,,,,,,,,,,,,,,,,,,,,"Inauguration,Tutors",https://s3.us-east-1.amazonaws.com/sjcdigitalarchives/original/06f93a6d3ed4a3f8e902aa0006909e18.jpg,"Still Image","Photographic Archive—Annapolis",1,1
2653,https://digitalarchives.sjc.edu/items/show/2653,"Inauguration of John Spangler Kieffer - Inauguration Procession with Faculty in Academic Robes and Naval Academy Officers in Uniform, Annapolis, Maryland","1 photographic print : b&w","Official U.S. Navy Photograph",,"Annapolis, MD",1947-10-25,,"still image",jpeg,,"VanDupeu, Henry P.; Kieffer, John Spangler.",,"<a title=""Inauguration Program"" href=""http://digitalarchives.sjc.edu/items/show/1324"">Inauguration Program</a>",,SJC-P-1078,,,,,,,,,,,,,,,,,,,photograph,"25.5 x 20.5 cm.",,,,,,,,,,,,,,,,,,,,,,,,,"Inauguration,Tutors,U.S. Naval Academy",https://s3.us-east-1.amazonaws.com/sjcdigitalarchives/original/a2ef03287db776881c2a7144690f90c5.jpg,"Still Image","Photographic Archive—Annapolis",1,1
2654,https://digitalarchives.sjc.edu/items/show/2654,"Inauguration of John Spangler Kieffer -  Faculty and a Naval Academy Officer, Annapolis, Maryland","1 photographic print : b&w","Official U.S. Navy Photograph",,"Annapolis, MD",1947-10-25,,"still image",jpeg,,"VanDupeu, Henry P.; Kieffer, John Spangler.",,"<a title=""Inauguration Program"" href=""http://digitalarchives.sjc.edu/items/show/1324"">Inauguration Program</a>",,SJC-P-1079,,,,,,,,,,,,,,,,,,,photograph,"25.5 x 20.5 cm.",,,,,,,,,,,,,,,,,,,,,,,,,"Inauguration,Tutors,U.S. Naval Academy",https://s3.us-east-1.amazonaws.com/sjcdigitalarchives/original/827e731dc2fac6d50711da93393413a5.jpg,"Still Image","Photographic Archive—Annapolis",1,1
1710,https://digitalarchives.sjc.edu/items/show/1710,"Raymond N. Wilburn Seated at Desk, St. John's College, Annapolis, Maryland","1 photographic print : b&w",Unknown,,"Annapolis, MD","1947-1949 [circa]","St. John's College owns the rights to this photograph.","still image",jpeg,,"St. John's College (Annapolis, Md.). -- Deans. ;  St. John's College (Annapolis, Md.). -- Faculty.; Wilburn, Raymond N.",,,,SJC-P-0153,,,,,,,,,,,,,,,,,,,photograph,"17.5 x 13 cm.",,,,,,,,,,,,,,,,,,,,,,,,,"Deans,Tutors",https://s3.us-east-1.amazonaws.com/sjcdigitalarchives/original/482fd0c8cb8beb2020edf7898011912e.jpg,"Still Image","Photographic Archive—Annapolis",1,0
1713,https://digitalarchives.sjc.edu/items/show/1713,"Raymond N. Wilburn at His Desk, St. John's College, Annapolis, Maryland","1 photographic print : b&w",Unknown,,"Annapolis, MD","1947-1949 [circa]","St. John's College owns the rights to this photograph.","still image",jpeg,,"St. John's College (Annapolis, Md.). -- Deans. ;  St. John's College (Annapolis, Md.). -- Faculty.; Wilburn, Raymond N.",,,,SJC-P-0156,,,,,,,,,,,,,,,,,,,photograph,"15 x 10 cm.",,,,,,,,,,,,,,,,,,,,,,,,,"Deans,Tutors",https://s3.us-east-1.amazonaws.com/sjcdigitalarchives/original/5572ce3dade845d3cc0080466872129a.jpg,"Still Image","Photographic Archive—Annapolis",1,0
