﻿"Item Id","Item URI","Dublin Core:Title","Dublin Core:Description","Dublin Core:Creator","Dublin Core:Publisher","Dublin Core:Coverage","Dublin Core:Date","Dublin Core:Rights","Dublin Core:Type","Dublin Core:Format","Dublin Core:Source","Dublin Core:Subject","Dublin Core:Contributor","Dublin Core:Relation","Dublin Core:Language","Dublin Core:Identifier","Item Type Metadata:Occupation","Item Type Metadata:Participants","Item Type Metadata:Death Date","Item Type Metadata:Birthplace","Item Type Metadata:Birth Date","Item Type Metadata:Interviewer","Item Type Metadata:Biographical Text","Item Type Metadata:Bibliography","Item Type Metadata:Page numeration","Item Type Metadata:Resolution","Item Type Metadata:Identifier","Item Type Metadata:Inventory","Item Type Metadata:URL","Item Type Metadata:Text","Item Type Metadata:Interviewee","Item Type Metadata:Location","Item Type Metadata:Transcription","Item Type Metadata:Local URL","Item Type Metadata:Original Format","Item Type Metadata:Physical Dimensions","Item Type Metadata:Duration","Item Type Metadata:Compression","Item Type Metadata:Producer","Item Type Metadata:Director","Item Type Metadata:Bit Rate/Frequency","Item Type Metadata:Email Body","Item Type Metadata:Event Type","Item Type Metadata:Lesson Plan Text","Item Type Metadata:Materials","Item Type Metadata:Objectives","Item Type Metadata:Standards","Item Type Metadata:Number of Attachments","Item Type Metadata:BCC","Item Type Metadata:CC","Item Type Metadata:To","Item Type Metadata:From","Item Type Metadata:Subject Line","Item Type Metadata:Time Summary","Item Type Metadata:Episode","Item Type Metadata:Season","Item Type Metadata:Episode Type","Item Type Metadata:Explicit","Item Type Metadata:Block","PDF Text:Text",tags,file,itemType,collection,public,featured
130,https://digitalarchives.sjc.edu/items/show/130,"[Catalogue of St. John's College for the Academic Year 1890-91]","College catalog for the years 1890-1891","St. John's College",,"Annapolis, MD",1890-1891,"St. John's College owns the rights to this publication.",text,pdf,,,,,English,,,,,,,,,,"53 pages",,,,,,,,,,paper,,,,,,,,,,,,,,,,,,,,,,,,,,"Catalog,Catalogue",https://s3.us-east-1.amazonaws.com/sjcdigitalarchives/original/f8e6759794eca33612b42a8358cc12b0.pdf,Text,"College Catalogs and Statements of the Program",1,0
205,https://digitalarchives.sjc.edu/items/show/205,"[Statement of the St. John's Program 1981-82]","College catalog for the years 1981-1982","St. John's College","St. John's College","Annapolis, MD; Santa Fe, NM",1981-1982,"St. John's College owns the rights to this publication.",text,pdf,,,,,English,,,,,,,,,,"80 pages",,,,,,,,,,paper,,,,,,,,,,,,,,,,,,,,,,,,,,"Catalog,Catalogue",https://s3.us-east-1.amazonaws.com/sjcdigitalarchives/original/38359d7aaf8689df0bb49909c27660eb.pdf,Text,"College Catalogs and Statements of the Program",1,0
4137,https://digitalarchives.sjc.edu/items/show/4137,"A Unique Opportunity for Summer Graduate Study","GI college catalog for summer 1967.","St. John's College","St. John's College","Santa Fe, NM",1967,"St. John's College owns the rights to this publication.",text,pdf,,,,,English,"GI Catalog 1967",,,,,,,,,"12 pages",,,,,,,,,,paper,,,,,,,,,,,,,,,,,,,,,,,,,,"Catalog,Catalogue,Graduate Institute",https://s3.us-east-1.amazonaws.com/sjcdigitalarchives/original/65087a9712c19003ca7c6d880d2889ca.pdf,Text,"College Catalogs and Statements of the Program",1,0
4138,https://digitalarchives.sjc.edu/items/show/4138,"A Unique Opportunity for Summer Graduate Study","GI college catalog for summer 1968.","St. John's College","St. John's College","Santa Fe, NM",1968,"St. John's College owns the rights to this publication.",text,pdf,,,,,English,"GI Catalog 1968",,,,,,,,,"12 pages",,,,,,,,,,paper,,,,,,,,,,,,,,,,,,,,,,,,,,"Catalog,Catalogue,Graduate Institute",https://s3.us-east-1.amazonaws.com/sjcdigitalarchives/original/d1bcd1210ac77a902b166d011549e6d4.pdf,Text,"College Catalogs and Statements of the Program",1,0
118,https://digitalarchives.sjc.edu/items/show/118,"Annual Catalogue of St. John's College Annapolis, Maryland, for the Academic Year, 1877-78","College catalog for the years 1877-1878","St. John's College","South Aldine Press","Batlimore, MD",1878,"St. John's College owns the rights to this publication.",text,pdf,,,,,English,,,,,,,,,,"31 pages",,,,,,,,,,paper,,,,,,,,,,,,,,,,,,,,,,,,,,"Catalog,Catalogue",https://s3.us-east-1.amazonaws.com/sjcdigitalarchives/original/8c6d78504d5b02df2b36531ec7546722.pdf,Text,"College Catalogs and Statements of the Program",1,0
119,https://digitalarchives.sjc.edu/items/show/119,"Annual Catalogue of St. John's College Annapolis, MD, for the Academic Year, 1878-79","College catalog for the years 1878-1879","St. John's College","Anne Arundel Advertiser--Print","Annapolis, MD",1879,"St. John's College owns the rights to this publication.",text,pdf,,,,,English,,,,,,,,,,"31 pages",,,,,,,,,,paper,,,,,,,,,,,,,,,,,,,,,,,,,,"Catalog,Catalogue",https://s3.us-east-1.amazonaws.com/sjcdigitalarchives/original/363f7d568531b075ac48f38e5a60297e.pdf,Text,"College Catalogs and Statements of the Program",1,0
121,https://digitalarchives.sjc.edu/items/show/121,"Annual Catalogue of St. John's College Annapolis, MD. for the Academic Years 1880-81 & '82, and Prospectus for 1882-83.","College catalog for the years 1880-1982","St. John's College","William M. Abbott, Print.","Annapolis, MD",1882,"St. John's College owns the rights to this publication.",text,pdf,,,,,English,,,,,,,,,,"28 pages",,,,,,,,,,paper,,,,,,,,,,,,,,,,,,,,,,,,,,"Catalog,Catalogue",https://s3.us-east-1.amazonaws.com/sjcdigitalarchives/original/565ba8afe60832939d5b468be60dfdbd.pdf,Text,"College Catalogs and Statements of the Program",1,0
116,https://digitalarchives.sjc.edu/items/show/116,"Annual Catalogue of St. John's College, Annapolis, Maryland, for the Academic Year 1875-'76.","College catalog for the years 1875-1876","St. John's College","Turnball Brothers : Publishers, Importers, Booksellers, Stationers","Baltimore, MD",1876,"St. John's College owns the rights to this publication.",text,pdf,,,,,English,,,,,,,,,,"32 pages",,,,,,,,,,paper,,,,,,,,,,,,,,,,,,,,,,,,,,"Catalog,Catalogue",https://s3.us-east-1.amazonaws.com/sjcdigitalarchives/original/927719bb549afe5f02d2aa940210068f.pdf,Text,"College Catalogs and Statements of the Program",1,0
117,https://digitalarchives.sjc.edu/items/show/117,"Annual Catalogue of St. John's College, Annapolis, Maryland, for the Academic Year 1876-'77.","College catalog for the years 1876-1877","St. John's College","Charles Harvey & Co.","Baltimore, MD",1876-1877,"St. John's College owns the rights to this publication.",text,pdf,,,,,English,,,,,,,,,,"32 pages",,,,,,,,,,paper,,,,,,,,,,,,,,,,,,,,,,,,,,"Catalog,Catalogue",https://s3.us-east-1.amazonaws.com/sjcdigitalarchives/original/3ab118fefc24eda3207269a2b00a5f01.pdf,Text,"College Catalogs and Statements of the Program",1,0
120,https://digitalarchives.sjc.edu/items/show/120,"Annual Catalogue of St. John's College, Annapolis, MD.  For the Academic Year 1879-80.","College catalog for the years 1879-1880","St. John's College","Anne Arundel Advertiser--Print","Annapolis, MD",1880,"St. John's College owns the rights to this publication.",text,pdf,,,,,English,,,,,,,,,,"29 pages",,,,,,,,,,paper,,,,,,,,,,,,,,,,,,,,,,,,,,"Catalog,Catalogue",https://s3.us-east-1.amazonaws.com/sjcdigitalarchives/original/5c21a3501168d4a317666d00deede51f.pdf,Text,"College Catalogs and Statements of the Program",1,0
110,https://digitalarchives.sjc.edu/items/show/110,"Annual Catalogue of St. John's College, at Annapolis, Maryland, for the Academic Year 1868-9; and Prospectus of Studies for the Academic Year 1869-70.","College catalog for the years 1868-1869","St. John's College","William K. Boyle's Steam Press","Baltimore, MD",1869,"St. John's College owns the rights to this publication.",text,pdf,,,,,English,,,,,,,,,,"20 pages",,,,,,,,,,paper,,,,,,,,,,,,,,,,,,,,,,,,,,"Catalog,Catalogue",https://s3.us-east-1.amazonaws.com/sjcdigitalarchives/original/31788c7fddf57d5570bf3080b8d6e6c4.pdf,Text,"College Catalogs and Statements of the Program",1,0
113,https://digitalarchives.sjc.edu/items/show/113,"Annual Catalogue of St. John's College, at Annapolis, Maryland, for the Academic Year 187[2]-7[3].","College catalog for the years 1872-1873","St. John's College","Charles Harvey & Co., Printers","Batlimore, MD",1873,"St. John's College owns the rights to this publication.",text,pdf,,,,,English,,,,,,,,,,"25 pages",,,,,,,,,,paper,,,,,,,,,,,,,,,,,,,,,,,,,,"Catalog,Catalogue",https://s3.us-east-1.amazonaws.com/sjcdigitalarchives/original/e064f92c12002537de6c4156531f928a.pdf,Text,"College Catalogs and Statements of the Program",1,0
111,https://digitalarchives.sjc.edu/items/show/111,"Annual Catalogue of St. John's College, at Annapolis, Maryland, for the Academic Year 1870-71","College catalog for the years 1870-1871","St. John's College","Office of the Church Press Association","Baltimore, MD",1871,"St. John's College owns the rights to this publication.",text,pdf,,,,,English,,,,,,,,,,"24 pages",,,,,,,,,,paper,,,,,,,,,,,,,,,,,,,,,,,,,,"Catalog,Catalogue",https://s3.us-east-1.amazonaws.com/sjcdigitalarchives/original/a2c9ba021615b1131e8804a132ffcc0d.pdf,Text,"College Catalogs and Statements of the Program",1,0
112,https://digitalarchives.sjc.edu/items/show/112,"Annual Catalogue of St. John's College, at Annapolis, Maryland, for the Academic Year 1871-72.","College catalog for the years 1871-1872","St. John's College","Chas. Harvey & Co.","Batlimore, MD",1872,"St. John's College owns the rights to this publication.",text,pdf,,,,,English,,,,,,,,,,"27 pages",,,,,,,,,,paper,,,,,,,,,,,,,,,,,,,,,,,,,,"Catalog,Catalogue",https://s3.us-east-1.amazonaws.com/sjcdigitalarchives/original/879c54db8ac6aec6b6109472c893e464.pdf,Text,"College Catalogs and Statements of the Program",1,0
114,https://digitalarchives.sjc.edu/items/show/114,"Annual Catalogue of St. John's College, at Annapolis, Maryland, for the Academic Year 1873-74.","College catalog for the years 1873-1874","St. John's College","Charles Harvey & Co., Printers","Baltimore, MD",1874,"St. John's College owns the rights to this publication.",text,pdf,,,,,English,,,,,,,,,,"27 pages",,,,,,,,,,paper,,,,,,,,,,,,,,,,,,,,,,,,,,"Catalog,Catalogue",https://s3.us-east-1.amazonaws.com/sjcdigitalarchives/original/04d94bca09afc3cef7ff11fc7cb9c42d.pdf,Text,"College Catalogs and Statements of the Program",1,0
115,https://digitalarchives.sjc.edu/items/show/115,"Annual Catalogue of St. John's College, at Annapolis, Maryland, for the Academic Year 1874-75.","College catalog for the years 1874-1875","St. John's College","Charles Harvey & Co., Printers","Baltimore, MD",1875,"St. John's College owns the rights to this publication.",text,pdf,,,,,English,,,,,,,,,,"26 pages",,,,,,,,,,paper,,,,,,,,,,,,,,,,,,,,,,,,,,"Catalog,Catalogue",https://s3.us-east-1.amazonaws.com/sjcdigitalarchives/original/93dda26d68ec06f0ff3be0e85e7e4185.pdf,Text,"College Catalogs and Statements of the Program",1,0
109,https://digitalarchives.sjc.edu/items/show/109,"Annual Catalogue of St. John's College, at Annapolis, Maryland, for the Academic Years 1867-8; and Prospectus of Studies for the Academic Year 1868-9.","College catalog for the years 1867-1868","St. John's College","William K. Boyle's Steam Press","Baltimore, MD; Annapolis, MD",1868,"St. John's College owns the rights to this publication.",text,pdf,,,,,English,,,,,,,,,,"16 pages",,,,,,,,,,paper,,,,,,,,,,,,,,,,,,,,,,,,,,"Catalog,Catalogue",https://s3.us-east-1.amazonaws.com/sjcdigitalarchives/original/8f35de9ed2ef41eb618aa127247899b2.pdf,Text,"College Catalogs and Statements of the Program",1,0
194,https://digitalarchives.sjc.edu/items/show/194,"Bulletin of St. John's College in Annapolis and Santa Fe:  Official Statement of the St. John's Program, Catalogue 1966-1968","College catalog for the years 1966-1968","St. John's College","St. John's College","Annapolis, MD",1966-07,"St. John's College owns the rights to this publication.",text,pdf,"Bulletin of St. John's College:  Volume XVIII, No. 2",,,,English,,,,,,,,,,"108 pages",,,,,,,,,,paper,,,,,,,,,,,,,,,,,,,,,,,,,,"Bulletin,Catalog,Catalogue",https://s3.us-east-1.amazonaws.com/sjcdigitalarchives/original/be4e8ec2f43ad8d0dccaf07412801149.pdf,Text,"College Catalogs and Statements of the Program",1,0
192,https://digitalarchives.sjc.edu/items/show/192,"Bulletin of St. John's College in Annapolis and Santa Fe: Official Statement of the St. John's Program, Catalogue 1962-1964","College catalog for the years 1962-1964.  Also the first catalog to feature the newly opened Santa Fe, NM campus.","St. John's College","St. John's College","Annapolis, MD",1963-02,"St. John's College owns the rights to this publication.",text,pdf,"Bulletin of St. John's College:  Volume XV, No. 1",,,,English,,,,,,,,,,"100 pages",,,,,,,,,,paper,,,,,,,,,,,,,,,,,,,,,,,,,,"Bulletin,Catalog,Catalogue",https://s3.us-east-1.amazonaws.com/sjcdigitalarchives/original/284cd3fa6c6598381fcc9dea0f5682e2.pdf,Text,"College Catalogs and Statements of the Program",1,0
193,https://digitalarchives.sjc.edu/items/show/193,"Bulletin of St. John's College in Annapolis and Santa Fe: Official Statement of the St. John's Program, Catalogue 1964-1966","College catalog for the years 1964-1968","St. John's College","St. John's College","Annapolis, MD",1964-12,"St. John's College owns the rights to this publication.",text,pdf,"Bulletin of St. John's College:  Volume XVI, No. 4",,,,English,,,,,,,,,,"108 pages",,,,,,,,,,paper,,,,,,,,,,,,,,,,,,,,,,,,,,"Bulletin,Catalog,Catalogue",https://s3.us-east-1.amazonaws.com/sjcdigitalarchives/original/06661d088e2c0c890c68056ab4231c12.pdf,Text,"College Catalogs and Statements of the Program",1,0
