﻿"Item Id","Item URI","Dublin Core:Title","Dublin Core:Description","Dublin Core:Creator","Dublin Core:Publisher","Dublin Core:Coverage","Dublin Core:Date","Dublin Core:Rights","Dublin Core:Type","Dublin Core:Format","Dublin Core:Source","Dublin Core:Subject","Dublin Core:Contributor","Dublin Core:Relation","Dublin Core:Language","Dublin Core:Identifier","Item Type Metadata:Occupation","Item Type Metadata:Participants","Item Type Metadata:Death Date","Item Type Metadata:Birthplace","Item Type Metadata:Birth Date","Item Type Metadata:Interviewer","Item Type Metadata:Biographical Text","Item Type Metadata:Bibliography","Item Type Metadata:Page numeration","Item Type Metadata:Resolution","Item Type Metadata:Identifier","Item Type Metadata:Inventory","Item Type Metadata:URL","Item Type Metadata:Text","Item Type Metadata:Interviewee","Item Type Metadata:Location","Item Type Metadata:Transcription","Item Type Metadata:Local URL","Item Type Metadata:Original Format","Item Type Metadata:Physical Dimensions","Item Type Metadata:Duration","Item Type Metadata:Compression","Item Type Metadata:Producer","Item Type Metadata:Director","Item Type Metadata:Bit Rate/Frequency","Item Type Metadata:Email Body","Item Type Metadata:Event Type","Item Type Metadata:Lesson Plan Text","Item Type Metadata:Materials","Item Type Metadata:Objectives","Item Type Metadata:Standards","Item Type Metadata:Number of Attachments","Item Type Metadata:BCC","Item Type Metadata:CC","Item Type Metadata:To","Item Type Metadata:From","Item Type Metadata:Subject Line","Item Type Metadata:Time Summary","Item Type Metadata:Episode","Item Type Metadata:Season","Item Type Metadata:Episode Type","Item Type Metadata:Explicit","Item Type Metadata:Block","PDF Text:Text",tags,file,itemType,collection,public,featured
5649,https://digitalarchives.sjc.edu/items/show/5649," Men Surveying and Cutting Down Trees on Front Campus, Annapolis, Maryland; Contact sheet of Edwin J. Delattre and Mrs. Delattre at a Party in the Great Hall","1 sheet : 32 prints from 35mm film : b&w",Unknown,,"Annapolis, MD","1980-1989 [circa]","St. John's College owns the rights to this photograph.","Still Image",jpeg,,"Delattre, Edwin J.",,,,SJC-P-1714,,,,,,,,,,,,,,,,,,,Photograph,"20.5 x 25.5 cm.",,,,,,,,,,,,,,,,,,,,,,,,,Presidents,https://s3.us-east-1.amazonaws.com/sjcdigitalarchives/original/8bb198f43875726d4fc88d2bf6e95102.jpg,"Still Image","Photographic Archive—Annapolis",1,0
5648,https://digitalarchives.sjc.edu/items/show/5648," Side View of Mcdowell Hall with Students;  Students Playing Soccer on Back Campus, Annapolis, Maryland; Contact sheet of Richard D. Weigle and Faculty in front of Woodward Hall Library","1 sheet : 34 prints from 35mm film : b&w",Unknown,,"Annapolis, MD",,"St. John's College owns the rights to this photograph.","Still Image",jpeg,,"Weigle, Richard Daniel 1912-",,,,SJC-P-1713,,,,,,,,,,,,,,,,,,,Photograph,"20.5 x 25.5 cm.",,,,,,,,,,,,,,,,,,,,,,,,,"Honorary Alumni,Presidents",https://s3.us-east-1.amazonaws.com/sjcdigitalarchives/original/f15167e8db41ca7035afeaef3c338cf0.jpg,"Still Image","Photographic Archive—Annapolis",1,0
7891,https://digitalarchives.sjc.edu/items/show/7891,"<span>Dwight D. Eisenhower Speaking at a Podium at the Opening of the Francis Scott Key Auditorium and Mellon Hall, St. John's College, Annapolis, Maryland</span>","<span>Dwight D. Eisenhower speaking at a podium at the opening of the Francis Scott Key Auditorium and Mellon Hall, St. John's College, Annapolis, Maryland, May 22, 1959.</span><br /><br />Eisenhower's speech is reprinted in <a href=""https://babel.hathitrust.org/cgi/pt?id=miua.4728423.1959.001&amp;seq=462"">Dwight D. Eisenhower, 1959: containing the public messages, speeches, and statements of the president, January 1 to December 31, 1959. Washington: Office of the Federal Register, National Archives and Records Service, General Services Administration, pages 416-419</a>.<br /><br />A recording of Eisenhower's speech is available from the <a href=""https://catalog.archives.gov/id/329120284"">National Archives</a>.","Warren, Marion E.",,"Annapolis, MD",1959-05-22,"St. John's College owns the rights to this photograph.","Still Image",jpeg,,"Eisenhower, Dwight D. (Dwight David), 1890-1969.;  Weigle, Richard Daniel 1912-",,,,SJC-P-2469,,,,,,,,,,,,,,,,,,,Photograph,"20.5 x 25.5 cm
",,,,,,,,,,,,,,,,,,,,,,,,,"Honorary Alumni,Presidents",https://s3.us-east-1.amazonaws.com/sjcdigitalarchives/original/b4c8cf160d212f19ef6557c0ee686648.jpg,"Still Image","Photographic Archive—Annapolis",1,0
362,https://digitalarchives.sjc.edu/items/show/362,"A Female Graduate Recieves her Diploma from Christopher B. Nelson, Eva T. H. Brann speaking in Background in Academic Robes, Commencement, St. John's College, Annapolis, Maryland","1 photographic print : color ",Unknown,,"Annapolis, MD","1992-1997 (circa)","St. John's College owns the rights to this photograph.","still image",jpeg,,"Commencement (St. John's College, Annapolis, MD) ; Nelson, Christopher B., 1948-;  Brann, Eva T. H.",,,,SJC-P-2281,,,,,,,,,,"600 dpi",,,,,,,,,photograph," 7.5 x 10 cm.",,,,,,,,,,,,,,,,,,,,,,,,,"Commencement,Deans,Presidents,Tutors",https://s3.us-east-1.amazonaws.com/sjcdigitalarchives/original/8ce1adc5b4a01f24de9f5ff355812019.jpg,"Still Image","Photographic Archive—Annapolis",1,1
4675,https://digitalarchives.sjc.edu/items/show/4675,"A Group Portrait of  Edwin J. Delattre and [St. John's College Alumni] Seated at a Table before Breakfast","1 photographic print : b&w","Parran, Tom",,"Annapolis, MD","1980-1985 [circa]","St. John's College owns the rights to this photograph.","Still Image",jpeg,,"St. John's College (Annapolis, Md.). -- Presidents. ;  St. John's College (Santa Fe, N. M.). -- Presidents. ;  Group Portraits ;  Delattre, Edwin J.",,,,SJC-P-0743,,,,,,,,,,,,,,,,,,,Photograph,"18 x 12.5 cm.",,,,,,,,,,,,,,,,,,,,,,,,,"Alumni,Honorary Alumni,Presidents",https://s3.us-east-1.amazonaws.com/sjcdigitalarchives/original/edc816f9803778aea27187d29731ad09.jpg,"Still Image","Photographic Archive—Annapolis",1,0
6108,https://digitalarchives.sjc.edu/items/show/6108,"A Student Reading in McDowell Hall by a Portrait of Jacob Klein, St. John's College, Annapolis, Maryland","1 photographic print : b&w",Unknown,,"Annapolis, MD",,"St. John's College owns the rights to this photograph.","Still Image",jpeg,,,,,,SJC-P-2325,,,,,,,,,,,,,,,,,,,Photograph,"9 x 12.5 cm.",,,,,,,,,,,,,,,,,,,,,,,,,"McDowell Hall,Presidents",https://s3.us-east-1.amazonaws.com/sjcdigitalarchives/original/ee9a3d03ea632624084129157881f399.jpg,"Still Image","Photographic Archive—Annapolis",1,0
5509,https://digitalarchives.sjc.edu/items/show/5509,"A Woman Speaking with Richard D. Weigle at the Groundbreaking Ceremony for Mellon Hall, Annapolis, Maryland","1 photographic print : b&w","Digennaro, Francis",,"Annapolis, MD","1958 [circa]","St. John's College owns the rights to this photograph.","Still Image",jpeg,,"Weigle, Richard Daniel 1912-",,,,SJC-P-1482,,,,,,,,,,,,,,,,,,,Photograph,"25.5 x 20.5 cm.",,,,,,,,,,,,,,,,,,,,,,,,,"Honorary Alumni,Mellon Hall,Presidents",https://s3.us-east-1.amazonaws.com/sjcdigitalarchives/original/ebbe12d41f4d40f6440b30f4ff256a20.jpg,"Still Image","Photographic Archive—Annapolis",1,0
5617,https://digitalarchives.sjc.edu/items/show/5617,"Anne Nelson and Edwin J. Delattre Seated at Luncheon Table during the Inauguration Luncheon for Edwin J. Delattre, Annapolis, Maryland, Fall 1980","1 photographic print : b&w",Unknown,,"Annapolis, MD",1980-09,"St. John's College owns the rights to this photograph.","Still Image",jpeg,,"Nelson, Anne;  Delattre, Edwin J.",,,,SJC-P-1674,,,,,,,,,,,,,,,,,,,Photograph,"25.5 x 20.5 cm.",,,,,,,,,,,,,,,,,,,,,,,,,Presidents,https://s3.us-east-1.amazonaws.com/sjcdigitalarchives/original/89eb166bca732315df46161c05de91fc.jpg,"Still Image","Photographic Archive—Annapolis",1,0
5763,https://digitalarchives.sjc.edu/items/show/5763,"Barbara H. Leonard, Richard D. Weigle and Workers Inspecting the Old Wooden Flagpole near McDowell Hall, Annapolis, Maryland","1 photographic print : b&w",Unknown,,"Annapolis, MD",,"St. John's College owns the rights to this photograph.","Still Image",jpeg,,"Leonard, Barbara Hopkins ;  Weigle, Richard Daniel 1912-",,,,SJC-P-1844,,,,,,,,,,,,,,,,,,,Photograph,"25.5 x 20.5 cm.",,,,,,,,,,,,,,,,,,,,,,,,,"Honorary Alumni,Presidents",https://s3.us-east-1.amazonaws.com/sjcdigitalarchives/original/fdbb21ffb0189f3175eec3a62c1a4d73.jpg,"Still Image","Photographic Archive—Annapolis",1,0
7807,https://digitalarchives.sjc.edu/items/show/7807,"Biennial Report of St. John's College, Annapolis, MD., to the General Assembly of Maryland, 1876","Biennial Report of St. John's College, Annapolis, MD., to the General Assembly of Maryland, January Session 1876. By James M. Garnett, Principal.","St. John's College","John F. Wiley; State of Maryland","Annapolis, MD",1876,,text,pdf,,"St. John's College (Annapolis, Md.)",,,English,PresidentsReport_1876_January,,,,,,,,,"14 pages",,,,,,,,,,paper,,,,,,,,,,,,,,,,,,,,,,,,,,"President's Report,Presidents",https://s3.us-east-1.amazonaws.com/sjcdigitalarchives/original/ca0c0092830bbc067f90a9397fd21726.pdf,Text,"President's Reports",1,0
7798,https://digitalarchives.sjc.edu/items/show/7798,"Bulletin of St. John's College in Annapolis, August 1933","Volume III, No. 3 of the Bulletin of St. John's College in Annapolis, ""President's Report"". Published in August 1933.","St. John's College","St. John's College","Annapolis, MD",1933-08,"St. John's College owns the rights to this publication.",text,pdf,,"St. John's College (Annapolis, Md.)--Periodicals",,,English,Bulletin_volIII_no3_1933_August,,,,,,,,,"6 pages",,,,,,,,,,paper,,,,,,,,,,,,,,,,,,,,,,,,,,"President's Report,Presidents",https://s3.us-east-1.amazonaws.com/sjcdigitalarchives/original/d56472bee849689e65af0727ff6c23b2.pdf,Text,"The Bulletin",1,0
3745,https://digitalarchives.sjc.edu/items/show/3745,"Bulletin of St. John's College in Annapolis, December 1950","Volume II, No. 4 of the Bulletin of St. John's College in Annapolis, Inaugural Proceedings.  Published in  December 1950.","St. John's College","St. John's College","Annapolis, MD",1950-12,"St. John's College owns the rights to this publication.",text,pdf,,"Weigle, Richard Daniel, 1912- ",,,English,"Bulletin December 1950-Vol II #4a-Inaugural Procedings",,,,,,,,,"24 pages",,,,,,,,,,paper,,,,,,,,,,,,,,,,,,,,,,,,,,"Inauguration,Presidents",https://s3.us-east-1.amazonaws.com/sjcdigitalarchives/original/0c833bb48c07fc126271db888a5fd033.pdf,Text,"The Bulletin",1,0
7808,https://digitalarchives.sjc.edu/items/show/7808,"Bulletin of St. John's College in Annapolis, January 1959","Volume XI, No. 1 of the Bulletin of St. John's College in Annapolis, ""Report of the President."" Published in January 1959.","St. John's College","St. John's College","Annapolis, MD",1959-01,"St. John's College owns the rights to this publication.",text,pdf,,"St. John's College (Annapolis, Md.)--Periodicals",,,English,Bulletin_volXI_no1_1959_January,,,,,,,,,"18 pages",,,,,,,,,,paper,,,,,,,,,,,,,,,,,,,,,,,,,,"President's Report,Presidents",https://s3.us-east-1.amazonaws.com/sjcdigitalarchives/original/fdaa51820e2d39c3949bb17527c41237.pdf,Text,"The Bulletin",1,0
3753,https://digitalarchives.sjc.edu/items/show/3753,"Bulletin of St. John's College in Annapolis, July 1959","Volume XI, No. 3 of the Bulletin of St. John's College in Annapolis, Report of the President.  Published in July 1959.","St. John's College","St. John's College","Annapolis, MD",1959-07,"St. John's College owns the rights to this publication.",text,pdf,,"Weigle, Richard Daniel, 1912- ",,,English,"Bulletin July 1959-Vol XI No 3-Report of the President",,,,,,,,,"20 pages",,,,,,,,,,paper,,,,,,,,,,,,,,,,,,,,,,,,,,"President's Report,Presidents",https://s3.us-east-1.amazonaws.com/sjcdigitalarchives/original/c64db8f211881d577d58b0061de2f1b7.pdf,Text,"The Bulletin",1,0
3754,https://digitalarchives.sjc.edu/items/show/3754,"Bulletin of St. John's College in Annapolis, June 1950","Volume II, No. 2 of the Bulletin of St. John's College in Annapolis, Report of the President.  Published in June 1950.","St. John's College","St. John's College","Annapolis, MD",1950-06,"St. John's College owns the rights to this publication.",text,pdf,,"Weigle, Richard Daniel, 1912- ",,,English,Bulletin_vol2_no2_1950_June,,,,,,,,,"15 pages",,,,,,,,,,paper,,,,,,,,,,,,,,,,,,,,,,,,,,"President's Report,Presidents",https://s3.us-east-1.amazonaws.com/sjcdigitalarchives/original/eea6faf539d2414d2a34265033c35f03.pdf,Text,"The Bulletin",1,0
7811,https://digitalarchives.sjc.edu/items/show/7811,"Bulletin of St. John's College in Annapolis, November 1962","Volume XIV, No. 4 of the Bulletin of St. John's College in Annapolis, ""Report of the President."" Published in November 1962.","St. John's College","St. John's College","Annapolis, MD",1962-11,"St. John's College owns the rights to this publication.",text,pdf,,"St. John's College (Annapolis, Md.)--Periodicals",,,English,Bulletin_volXIV_no4_1962_November,,,,,,,,,"16 pages",,,,,,,,,,paper,,,,,,,,,,,,,,,,,,,,,,,,,,"President's Report,Presidents",https://s3.us-east-1.amazonaws.com/sjcdigitalarchives/original/301aa77c4fb15bac99a7e5dc54114c6f.pdf,Text,"The Bulletin",1,0
3762,https://digitalarchives.sjc.edu/items/show/3762,"Bulletin of St. John's College in Annapolis, October 1954","Volume VI, No. 4 of the Bulletin of St. John's College in Annapolis, Report of the President.  Published in October 1954.","St. John's College","St. John's College","Annapolis, MD",1954-10,"St. John's College owns the rights to this publication.",text,pdf,,"Weigle, Richard Daniel, 1912-",,,English,"Bulletin October 1954-Vol. VI No. 4-Report of the President",,,,,,,,,"20 pages",,,,,,,,,,paper,,,,,,,,,,,,,,,,,,,,,,,,,,"President's Report,Presidents",https://s3.us-east-1.amazonaws.com/sjcdigitalarchives/original/f30eeb9dc80b933a7be4b8ca00d9300d.pdf,Text,"The Bulletin",1,0
3763,https://digitalarchives.sjc.edu/items/show/3763,"Bulletin of St. John's College in Annapolis, October 1955","Volume VII, No. 4 of the Bulletin of St. John's College in Annapolis, Report of the President.  Published in October 1955.","St. John's College","St. John's College","Annapolis, MD",1955-10,"St. John's College owns the rights to this publication.",text,pdf,,"Weigle, Richard Daniel, 1912-",,,English,"Bulletin October 1955 Vol. VII No. 4-Report of the President",,,,,,,,,"24 pages",,,,,,,,,,paper,,,,,,,,,,,,,,,,,,,,,,,,,,"President's Report,Presidents",https://s3.us-east-1.amazonaws.com/sjcdigitalarchives/original/8fe8ac81c4eb9dee3581ccc14c93098b.pdf,Text,"The Bulletin",1,0
3764,https://digitalarchives.sjc.edu/items/show/3764,"Bulletin of St. John's College in Annapolis, October 1956","Volume VIII, No. 4 of the Bulletin of St. John's College in Annapolis, Report of the President.  Published in October 1956.","St. John's College","St. John's College","Annapolis, MD",1956-10,"St. John's College owns the rights to this publication.",text,pdf,,"Weigle, Richard Daniel, 1912-",,,English,"Bulletin October 1956-Vol VIII No 4-Report of the President",,,,,,,,,"20 pages",,,,,,,,,,paper,,,,,,,,,,,,,,,,,,,,,,,,,,"President's Report,Presidents",https://s3.us-east-1.amazonaws.com/sjcdigitalarchives/original/d84a8e36858978f325d23ff75fa38a02.pdf,Text,"The Bulletin",1,0
3765,https://digitalarchives.sjc.edu/items/show/3765,"Bulletin of St. John's College in Annapolis, October 1957.","Volume IX, No. 4 of the Bulletin of St. John's College in Annapolis, Report of the President.  Published in October 1957.","St. John's College","St. John's College","Annapolis, MD",1957-10,"St. John's College owns the rights to this publication.",text,pdf,,"Weigle, Richard Daniel, 1912-",,,English,"Bulletin October 1957-Vol IX No 4-Report of the President",,,,,,,,,"16 pages",,,,,,,,,,paper,,,,,,,,,,,,,,,,,,,,,,,,,,"President's Report,Presidents",https://s3.us-east-1.amazonaws.com/sjcdigitalarchives/original/380763d314e78616379f21056b15bc0c.pdf,Text,"The Bulletin",1,0
