﻿"Item Id","Item URI","Dublin Core:Title","Dublin Core:Description","Dublin Core:Creator","Dublin Core:Publisher","Dublin Core:Coverage","Dublin Core:Date","Dublin Core:Rights","Dublin Core:Type","Dublin Core:Format","Dublin Core:Source","Dublin Core:Subject","Dublin Core:Contributor","Dublin Core:Relation","Dublin Core:Language","Dublin Core:Identifier","Item Type Metadata:Occupation","Item Type Metadata:Participants","Item Type Metadata:Death Date","Item Type Metadata:Birthplace","Item Type Metadata:Birth Date","Item Type Metadata:Interviewer","Item Type Metadata:Biographical Text","Item Type Metadata:Bibliography","Item Type Metadata:Page numeration","Item Type Metadata:Resolution","Item Type Metadata:Identifier","Item Type Metadata:Inventory","Item Type Metadata:URL","Item Type Metadata:Text","Item Type Metadata:Interviewee","Item Type Metadata:Location","Item Type Metadata:Transcription","Item Type Metadata:Local URL","Item Type Metadata:Original Format","Item Type Metadata:Physical Dimensions","Item Type Metadata:Duration","Item Type Metadata:Compression","Item Type Metadata:Producer","Item Type Metadata:Director","Item Type Metadata:Bit Rate/Frequency","Item Type Metadata:Email Body","Item Type Metadata:Event Type","Item Type Metadata:Lesson Plan Text","Item Type Metadata:Materials","Item Type Metadata:Objectives","Item Type Metadata:Standards","Item Type Metadata:Number of Attachments","Item Type Metadata:BCC","Item Type Metadata:CC","Item Type Metadata:To","Item Type Metadata:From","Item Type Metadata:Subject Line","Item Type Metadata:Time Summary","Item Type Metadata:Episode","Item Type Metadata:Season","Item Type Metadata:Episode Type","Item Type Metadata:Explicit","Item Type Metadata:Block","PDF Text:Text",tags,file,itemType,collection,public,featured
6110,https://digitalarchives.sjc.edu/items/show/6110,"A Student Resting his Head on a Table in the Woodward Hall Library, St. John's College, Annapolis, Maryland","1 photographic print : b&w",Unknown,,"Annapolis, MD",1991,"St. John's College owns the rights to this photograph.","Still Image",jpeg,,,,,,SJC-P-2327,,,,,,,,,,,,,,,,,,,Photograph,"12.5 x 9 cm.",,,,,,,,,,,,,,,,,,,,,,,,,"Woodward Hall Library",https://s3.us-east-1.amazonaws.com/sjcdigitalarchives/original/cd39f65dbdd8dd614eb48da2584a346b.jpg,"Still Image","Photographic Archive—Annapolis",1,0
6086,https://digitalarchives.sjc.edu/items/show/6086,"A Student Seated at a Seminar Table with a Copy of ""Canterbury Tales"" by Chaucer in Mellon Hall, St. John's College, Annapolis, Maryland","1 photographic print : b&w",Unknown,,"Annapolis, MD ",,"St. John's College owns the rights to this photograph.","Still Image",jpeg,,,,,,SJC-P-2303,,,,,,,,,,,,,,,,,,,Photograph,"12.5 x 9 cm.",,,,,,,,,,,,,,,,,,,,,,,,,,https://s3.us-east-1.amazonaws.com/sjcdigitalarchives/original/c783572e760fd837bfbb565492023712.jpg,"Still Image","Photographic Archive—Annapolis",1,0
6104,https://digitalarchives.sjc.edu/items/show/6104,"A Student Seated in McDowell Hall with Roget's Thesaurus and other Books, St. John's College, Annapolis, Maryland","1 photographic print : b&w",Unknown,,"Annapolis, MD",,"St. John's College owns the rights to this photograph.","Still Image",jpeg,,,,,,SJC-P-2321,,,,,,,,,,,,,,,,,,,Photograph,"12.5 x 9 cm.",,,,,,,,,,,,,,,,,,,,,,,,,"McDowell Hall",https://s3.us-east-1.amazonaws.com/sjcdigitalarchives/original/d233373abc2b86559dd093a89c2ffa48.jpg,"Still Image","Photographic Archive—Annapolis",1,0
6111,https://digitalarchives.sjc.edu/items/show/6111,"A Student Seated on a Bench on the Quad by Randall Hall, St. John's College, Annapolis, Maryland","1 photographic print : b&w",Unknown,,"Annapolis, MD",,"St. John's College owns the rights to this photograph.","Still Image",jpeg,,,,,,SJC-P-2328,,,,,,,,,,,,,,,,,,,Photograph,"9 x 12.5 cm.",,,,,,,,,,,,,,,,,,,,,,,,,"Randall Hall",https://s3.us-east-1.amazonaws.com/sjcdigitalarchives/original/515032435746bf4bf1b2d7b2a1599628.jpg,"Still Image","Photographic Archive—Annapolis",1,0
6109,https://digitalarchives.sjc.edu/items/show/6109,"A Student Seated on the Quad with Pinkney Hall in the Background, St. John's College, Annapolis, Maryland","1 photographic print : b&w",Unknown,,"Annapolis, MD",,"St. John's College owns the rights to this photograph.","Still Image",jpeg,,,,,,SJC-P-2326,,,,,,,,,,,,,,,,,,,Photograph,"9 x 12.5 cm.",,,,,,,,,,,,,,,,,,,,,,,,,"Pinkney Hall",https://s3.us-east-1.amazonaws.com/sjcdigitalarchives/original/73f39ab04c4d352f26d1246dfeaf0a06.jpg,"Still Image","Photographic Archive—Annapolis",1,0
6094,https://digitalarchives.sjc.edu/items/show/6094,"A Student Standing on the McDowell Hall Balcony with the Railing Torn Down, St. John's College, Annapolis, Maryland","1 photographic print : b&w",Unknown,,"Annapolis, MD ",,"St. John's College owns the rights to this photograph.","Still Image",jpeg,,,,,,SJC-P-2311,,,,,,,,,,,,,,,,,,,Photograph,"9 x 12.5 cm.",,,,,,,,,,,,,,,,,,,,,,,,,,https://s3.us-east-1.amazonaws.com/sjcdigitalarchives/original/02c354367de68153366a44b5e9e4e884.jpg,"Still Image","Photographic Archive—Annapolis",1,0
4870,https://digitalarchives.sjc.edu/items/show/4870,"A Student Walking on a Path with the Maryland Hall of Records and Humphreys Hall (under Construction) In the Background","1 photographic print : b&w",Unknown,,"Annapolis, MD",,"St. John's College owns the rights to this photograph.","Still Image",jpeg,,"St. John's College (Annapolis, Md.) -- Students.",,,,SJC-P-0880,,,,,,,,,,,,,,,,,,,Photograph,"20.5 x 25.5 cm.",,,,,,,,,,,,,,,,,,,,,,,,,"Hall of Records,Humphreys Hall",https://s3.us-east-1.amazonaws.com/sjcdigitalarchives/original/55d0228d0ce15572de2f7369418902e3.jpg,"Still Image","Photographic Archive—Annapolis",1,0
5449,https://digitalarchives.sjc.edu/items/show/5449,"A Student Walking up Stairs in the Woodward Hall Library, St. John's College, Annapolis, Maryland","1 photographic print : b&w",Unknown,,"Annapolis, MD","1960-1968 [circa]","St. John's college owns the rights to this photograph.","Still Image",jpeg,,"St. John's College (Annapolis, Md.). -- Students.",,,,SJC-P-1417,,,,,,,,,,,,,,,,,,,Photograph,"20.5 x 25.5 cm.",,,,,,,,,,,,,,,,,,,,,,,,,"Woodward Hall Library",https://s3.us-east-1.amazonaws.com/sjcdigitalarchives/original/1c143594d00c7a6ea4cbcab57e50460c.jpg,"Still Image","Photographic Archive—Annapolis",1,0
5090,https://digitalarchives.sjc.edu/items/show/5090,"A Student with Pipe Dissecting a Frog","1 photographic print : b&w",Unknown,,"Annapolis, MD",,"St. John's College owns the rights to this photograph.","Still Image",jpeg,,,,,,SJC-P-1020,,,,,,,,,,,,,,,,,,,Photograph,"25.5 x 20.5 cm.",,,,,,,,,,,,,,,,,,,,,,,,,,https://s3.us-east-1.amazonaws.com/sjcdigitalarchives/original/7abfe455a5e42af323721448ecf7b250.jpg,"Still Image","Photographic Archive—Annapolis",1,0
6190,https://digitalarchives.sjc.edu/items/show/6190,"A Student with Pipe Studying in his Dormitory Room in Pinkney Hall, St. John's College, Annapolis, Maryland","1 photographic copy from the St. John's College yearbook : b&w",Unknown,,"Annapolis, MD",1926,"St. John's College owns the rights to this photograph.","Still Image",jpeg,,,,,,SJC-P-2421,,,,,,,,,,,,,,,,,,,Photograph,"25.5 x 20.5 cm.",,,,,,,,,,,,,,,,,,,,,,,,,"Pinkney Hall",https://s3.us-east-1.amazonaws.com/sjcdigitalarchives/original/c0444333d1fb4787c52ed34d7a3dfd41.jpg,"Still Image","Photographic Archive—Annapolis",1,0
6085,https://digitalarchives.sjc.edu/items/show/6085,"A Student Working on a Macintosh SE Personal Computer","1 photographic print : color",Unknown,,"Annapolis, MD ","1981-1990 [circa]","St. John's College owns the rights to this photograph.","Still Image",jpeg,,,,,,SJC-P-2302,,,,,,,,,,,,,,,,,,,Photograph,"12.5 x 9 cm.",,,,,,,,,,,,,,,,,,,,,,,,,,https://s3.us-east-1.amazonaws.com/sjcdigitalarchives/original/a301c298205ae5e262b2c15996a0b416.jpg,"Still Image","Photographic Archive—Annapolis",1,0
4504,https://digitalarchives.sjc.edu/items/show/4504,"A Student, Seated, Speaking in Seminar, St. John's College, Annapolis, Maryland","1 photographic print : b&w",Unknown,,"Annapolis, MD","1960-1969 [circa]","St. John's College owns the rights to this photograph.","Still Image",jpeg,,"Seminar (St. John's College, Annapolis, MD). ;  St. John's College (Annapolis, Md.) -- Students.",,,,SJC-P-0510,,,,,,,,,,,,,,,,,,,Photograph,"12 x 9.5 cm.",,,,,,,,,,,,,,,,,,,,,,,,,,https://s3.us-east-1.amazonaws.com/sjcdigitalarchives/original/de9db8cce255c37f0c2cf473b46d6615.jpg,"Still Image","Photographic Archive—Annapolis",1,0
4671,https://digitalarchives.sjc.edu/items/show/4671,"A Torchbearer Wearing a Toga and Laurel Wreath Parading in the Street at the Real Olympics, Annapolis, Maryland","1 photographic print : b&w",Unknown,,"Annapolis, MD","1980 [circa]","St. John's College owns the rights to this photograph.","Still Image",jpeg,,"Real Olympics (St. John's College, Annapolis, MD). ;  St. John's College (Annapolis, Md.) -- Students.",,,,SJC-P-0731,,,,,,,,,,,,,,,,,,,Photograph,"12.5 x 18 cm.",,,,,,,,,,,,,,,,,,,,,,,,,"Alumni,Real Olympics",https://s3.us-east-1.amazonaws.com/sjcdigitalarchives/original/5a889798d4054d3fde4566a33fbd53e2.jpg,"Still Image","Photographic Archive—Annapolis",1,0
5513,https://digitalarchives.sjc.edu/items/show/5513,"A Tractor Used during the Construction of Mellon Hall, Annapolis, Maryland","1 photographic print : b&w",Unknown,,"Annapolis, MD","1958 [circa]","St. John's College owns the rights to this photograph.","Still Image",jpeg,,"Mellon Hall (St. John's College, Annapolis, MD)",,,,SJC-P-1486,,,,,,,,,,,,,,,,,,,Photograph,"25.5 x 20.5 cm.",,,,,,,,,,,,,,,,,,,,,,,,,"Mellon Hall",https://s3.us-east-1.amazonaws.com/sjcdigitalarchives/original/b8bf4fceba3b38c67db40369deae3fa4.jpg,"Still Image","Photographic Archive—Annapolis",1,0
5989,https://digitalarchives.sjc.edu/items/show/5989,"A Tree and the Dock on College Creek, Annapolis, Maryland","1 photographic print : b&w",Unknown,,"Annapolis, MD",,"St. John's College owns the rights to this photograph.","Still Image",jpeg,,,,,,SJC-P-2240,,,,,,,,,,,,,,,,,,,Photograph,"20.5 x 25.5 cm.",,,,,,,,,,,,,,,,,,,,,,,,,,https://s3.us-east-1.amazonaws.com/sjcdigitalarchives/original/1c8d04e37d96e147aac174582801076d.jpg,"Still Image","Photographic Archive—Annapolis",1,0
4497,https://digitalarchives.sjc.edu/items/show/4497,"A View from Front Campus with Cannon and Phi Alpha Fraternity House on College Avenue, St. John's College, Annapolis, Maryland","1 photographic print : b&w",Unknown,,"Annapolis, MD",1937,"St. John's College owns the rights to this photograph.","Still Image",jpeg,,"Cannons (St. John's College, Annapolis, MD) 1937. ;  Phi Alpha Buildings (St. John's College, Annapolis, MD) 1937.",,,,SJC-P-0495,,,,,,,,,,,,,,,,,,,Photograph,"13 x 10 cm.",,,,,,,,,,,,,,,,,,,,,,,,,,https://s3.us-east-1.amazonaws.com/sjcdigitalarchives/original/b7d6875721a65867dff4c2d8e5c3849d.jpg,"Still Image","Photographic Archive—Annapolis",1,0
2639,https://digitalarchives.sjc.edu/items/show/2639,"A View from the Front Steps of McDowell Hall","1 photographic print : b&w","Pickering Studio",,"Annapolis, MD",,"St. John's College owns the rights to this photograph.","still image",jpeg,,,,,,SJC-P-1064,,,,,,,,,,,,,,,,,,,photograph,"20 x 24.5 cm.",,,,,,,,,,,,,,,,,,,,,,,,,"McDowell Hall",https://s3.us-east-1.amazonaws.com/sjcdigitalarchives/original/f425f5061dc8131dccf637e49c001a05.jpg,"Still Image","Photographic Archive—Annapolis",1,1
1762,https://digitalarchives.sjc.edu/items/show/1762,"A View from the Front Steps of Woodward Hall with Students, St. John's College, Annapolis, Maryland","1 photographic print : b&w",Unknown,,"Annapolis, MD","1940-1960 [circa]","St. John's College owns the rights to this photograph.","still image",pdf,,"Woodward Hall (St. John's College, Annapolis, MD). ;  St. John's College (Annapolis, Md.). -- Students.",,,,SJC-P-0321,,,,,,,,,,,,,,,,,,,photograph,"19.5 x 24.5 cm.",,,,,,,,,,,,,,,,,,,,,,,,,,https://s3.us-east-1.amazonaws.com/sjcdigitalarchives/original/a53a6ebb74e4ede230ce32a9f127fbae.jpg,"Still Image","Photographic Archive—Annapolis",1,0
5108,https://digitalarchives.sjc.edu/items/show/5108,"A View of the Garden near Chase-Stone House","1 photographic print : b&w",Unknown,,"Annapolis, MD","1920-1930 [circa]","St. John's College owns the rights to this photograph.","Still Image",jpeg,,"Chase-Stone House (St. John's College, Annapolis, MD)",,,,SJC-P-1086,,,,,,,,,,,,,,,,,,,Photograph,"25.5 x 20.5 cm.",,,,,,,,,,,,,,,,,,,,,,,,,"Chase-Stone House",https://s3.us-east-1.amazonaws.com/sjcdigitalarchives/original/ba09ca82524a90d94835d5c7ad3bb195.jpg,"Still Image","Photographic Archive—Annapolis",1,0
5109,https://digitalarchives.sjc.edu/items/show/5109,"A View of the Garden near Chase-Stone House","1 photographic print : b&w",Unknown,,"Annapolis, MD","1920-1930 [circa]","St. John's College owns the rights to this photograph.","Still Image",jpeg,,"Chase-Stone House (St. John's College, Annapolis, MD)",,,,SJC-P-1087,,,,,,,,,,,,,,,,,,,Photograph,"25.5 x 20.5 cm.",,,,,,,,,,,,,,,,,,,,,,,,,"Chase-Stone House",https://s3.us-east-1.amazonaws.com/sjcdigitalarchives/original/9442faba3bd5e58f47bdd92c14c8b7eb.jpg,"Still Image","Photographic Archive—Annapolis",1,0
