﻿"Item Id","Item URI","Dublin Core:Title","Dublin Core:Description","Dublin Core:Creator","Dublin Core:Publisher","Dublin Core:Coverage","Dublin Core:Date","Dublin Core:Rights","Dublin Core:Type","Dublin Core:Format","Dublin Core:Source","Dublin Core:Subject","Dublin Core:Contributor","Dublin Core:Relation","Dublin Core:Language","Dublin Core:Identifier","Item Type Metadata:Occupation","Item Type Metadata:Participants","Item Type Metadata:Death Date","Item Type Metadata:Birthplace","Item Type Metadata:Birth Date","Item Type Metadata:Interviewer","Item Type Metadata:Biographical Text","Item Type Metadata:Bibliography","Item Type Metadata:Page numeration","Item Type Metadata:Resolution","Item Type Metadata:Identifier","Item Type Metadata:Inventory","Item Type Metadata:URL","Item Type Metadata:Text","Item Type Metadata:Interviewee","Item Type Metadata:Location","Item Type Metadata:Transcription","Item Type Metadata:Local URL","Item Type Metadata:Original Format","Item Type Metadata:Physical Dimensions","Item Type Metadata:Duration","Item Type Metadata:Compression","Item Type Metadata:Producer","Item Type Metadata:Director","Item Type Metadata:Bit Rate/Frequency","Item Type Metadata:Email Body","Item Type Metadata:Event Type","Item Type Metadata:Lesson Plan Text","Item Type Metadata:Materials","Item Type Metadata:Objectives","Item Type Metadata:Standards","Item Type Metadata:Number of Attachments","Item Type Metadata:BCC","Item Type Metadata:CC","Item Type Metadata:To","Item Type Metadata:From","Item Type Metadata:Subject Line","Item Type Metadata:Time Summary","Item Type Metadata:Episode","Item Type Metadata:Season","Item Type Metadata:Episode Type","Item Type Metadata:Explicit","Item Type Metadata:Block","PDF Text:Text",tags,file,itemType,collection,public,featured
5692,https://digitalarchives.sjc.edu/items/show/5692,"Evan Gobstoob Canter with Camera","1 photographic print : b&w",Unknown,,"Annapolis, MD",1981,"St. John's College owns the rights to this photograph.","Still Image",jpeg,,"Canter, Evan Gobstoob",,,,SJC-P-1768,,,,,,,,,,,,,,,,,,,Photograph,"25.5 x 20.5 cm.",,,,,,,,,,,,,,,,,,,,,,,,,Alumni,https://s3.us-east-1.amazonaws.com/sjcdigitalarchives/original/11740026169ba787ca095008ffc95eea.jpg,"Still Image","Photographic Archive—Annapolis",1,0
5691,https://digitalarchives.sjc.edu/items/show/5691,"Edward G. Sparrow in Academic Robes with Wife and Nancy Scott Oustide of Mellon Hall after the Inauguration Ceremony for Edwin J. Delattre, Annapolis, Maryland, Fall 1980","1 photographic print : b&w",Unknown,,"Annapolis, MD",1980-09,"St. John's College owns the rights to this photograph.","Still Image",jpeg,,"Sparrow, Edward G.;  Scott, Nancy",,,,SJC-P-1767,,,,,,,,,,,,,,,,,,,Photograph,"25.5 x 20.5 cm.",,,,,,,,,,,,,,,,,,,,,,,,,,https://s3.us-east-1.amazonaws.com/sjcdigitalarchives/original/f495cccfa4458eb42fd465880878b195.jpg,"Still Image","Photographic Archive—Annapolis",1,0
5690,https://digitalarchives.sjc.edu/items/show/5690,"Edward G. Sparrow and Richard D. Weigle Seated at the Inauguration Luncheon for Edwin J. Delattre, Annapolis, Maryland, Fall 1980","1 photographic print : b&w",Unknown,,"Annapolis, MD",1980-09,"St. John's College owns the rights to this photograph.","Still Image",jpeg,,"Weigle, Richard Daniel 1912-;  Sparrow, Edward G.",,,,SJC-P-1766,,,,,,,,,,,,,,,,,,,Photograph,"25.5 x 20.5 cm.",,,,,,,,,,,,,,,,,,,,,,,,,"Honorary Alumni,Presidents",https://s3.us-east-1.amazonaws.com/sjcdigitalarchives/original/f05430e5698e0a00f5a98cc42389e1e9.jpg,"Still Image","Photographic Archive—Annapolis",1,0
5689,https://digitalarchives.sjc.edu/items/show/5689,"Phillip Bovender Pours a Glass of Wine for Governor Harry Hughes during the Inauguration Luncheon for Edwin J. Delattre, Annapolis, Maryland, Fall 1980","1 photographic print : b&w",Unknown,,"Annapolis, MD",1980-09,"St. John's College owns the rights to this photograph.","Still Image",jpeg,,"Hughes, Harry;  Bovender, Phillip",,,,SJC-P-1765,,,,,,,,,,,,,,,,,,,Photograph,"20.5 x 25.5 cm.",,,,,,,,,,,,,,,,,,,,,,,,,Alumni,https://s3.us-east-1.amazonaws.com/sjcdigitalarchives/original/08016c631c8cff04a27b14f6e9187fb1.jpg,"Still Image","Photographic Archive—Annapolis",1,0
5688,https://digitalarchives.sjc.edu/items/show/5688,"Edwin J. Delattre Delivers his Inaugural Speech in front of Woodward Hall Library, Annapolis, Maryland, Fall 1980","1 photographic print : b&w",Unknown,,"Annapolis, MD",1980-09,"St. John's College owns the rights to this photograph.","Still Image",jpeg,,,,,,SJC-P-1764,,,,,,,,,,,,,,,,,,,Photograph,"20.5 x 25.5 cm.",,,,,,,,,,,,,,,,,,,,,,,,,Presidents,https://s3.us-east-1.amazonaws.com/sjcdigitalarchives/original/880a1232316beff512ad06965182c6e9.jpg,"Still Image","Photographic Archive—Annapolis",1,0
5687,https://digitalarchives.sjc.edu/items/show/5687,"Edwin J. Delattre Delivers his Inaugural Speech in front of Woodward Hall Library, Annapolis, Maryland, Fall 1980","1 photographic print : b&w",Unknown,,"Annapolis, MD",1980-09,"St. John's College owns the rights to this photograph.","Still Image",jpeg,,"Delattre, Edwin J.",,,,SJC-P-1763,,,,,,,,,,,,,,,,,,,Photograph,"25.5 x 20.5 cm.",,,,,,,,,,,,,,,,,,,,,,,,,Presidents,https://s3.us-east-1.amazonaws.com/sjcdigitalarchives/original/e9989d58daf9f9447f5f2188bb119ec1.jpg,"Still Image","Photographic Archive—Annapolis",1,0
5686,https://digitalarchives.sjc.edu/items/show/5686,"John Silber and Edwin J. Delattre in Academic Robes before the Inauguration Ceremony for Edwin J. Delattre, Annapolis, Maryland, Fall 1980","1 photographic print : b&w",Unknown,,"Annapolis, MD",1980-09,"St. John's College owns the rights to this photograph.","Still Image",jpeg,,"Delattre, Edwin J.;  ",,,,SJC-P-1762,,,,,,,,,,,,,,,,,,,Photograph,"20.5 x 25.5 cm.",,,,,,,,,,,,,,,,,,,,,,,,,Presidents,https://s3.us-east-1.amazonaws.com/sjcdigitalarchives/original/351229c70ace9bda7502438f9e13d71e.jpg,"Still Image","Photographic Archive—Annapolis",1,0
5685,https://digitalarchives.sjc.edu/items/show/5685,"Edwin J. Delattre and Alice Delattre Seated at the Inauguration Luncheon for Edwin J. Delattre, Annapolis, Maryland, Fall 1980","1 photographic print : b&w",Unknown,,"Annapolis, MD",1980-09,"St. John's College owns the rights to this photograph.","Still Image",jpeg,,"Delattre, Edwin J.;  Delattre, Alice",,,,SJC-P-1761,,,,,,,,,,,,,,,,,,,Photograph,"25.5 x 20.5 cm.",,,,,,,,,,,,,,,,,,,,,,,,,Presidents,https://s3.us-east-1.amazonaws.com/sjcdigitalarchives/original/7efb97e9a58708163be56c74c139813c.jpg,"Still Image","Photographic Archive—Annapolis",1,0
5684,https://digitalarchives.sjc.edu/items/show/5684,"Jules Delattre Shakes Hands with his Son, Edwin J. Delattre as Charles A. Nelson Looks On after the Inauguration Ceremony for Edwin J. Delattre, Fall 1980","1 photographic print : b&w",Unknown,,"Annapolis, MD",1980-09,"St. John's College owns the rights to this photograph.","Still Image",jpeg,,"Delattre, Jules;  Delattre, Edwin J.;  Nelson, Charles A.",,,,SJC-P-1760,,,,,,,,,,,,,,,,,,,Photograph,"25.5 x 20.5 cm.",,,,,,,,,,,,,,,,,,,,,,,,,Presidents,https://s3.us-east-1.amazonaws.com/sjcdigitalarchives/original/bf88d8afb05928eefa0be4d008117d42.jpg,"Still Image","Photographic Archive—Annapolis",1,0
5683,https://digitalarchives.sjc.edu/items/show/5683,"Public Officials in Academic Robes Process down the Central Walk from McDowell Hall during the Inauguration Ceremony for Edwin J. Delattre, Annapolis, Maryland, Fall 1980","1 photographic print : b&w",Unknown,,"Annapolis, MD",1980-09,"St. John's College owns the rights to this photograph.","Still Image",jpeg,,,,,,SJC-P-1759,,,,,,,,,,,,,,,,,,,Photograph,"25.5 x 20.5 cm.",,,,,,,,,,,,,,,,,,,,,,,,,,https://s3.us-east-1.amazonaws.com/sjcdigitalarchives/original/392b76e997add4f8f7274074f0030e86.jpg,"Still Image","Photographic Archive—Annapolis",1,0
5682,https://digitalarchives.sjc.edu/items/show/5682,"Edwin J. Delattre Embraces Wife Alice Delattre, with the Reverend John Hiliary Hayden  in the Background,  after the Inauguration Ceremony for Edwin J. Delattre, Annapolis, Maryland, Fall 1980","1 photographic print : b&w",Unknown,,"Annapolis, MD",1980-09,"St. John's College owns the rights to this photograph.","Still Image",jpeg,,"Delattre, Edwin J.;  Hayden, John Hilary;  Delattre, Alice",,,,SJC-P-1758,,,,,,,,,,,,,,,,,,,Photograph,"25.5 x 20.5 cm.",,,,,,,,,,,,,,,,,,,,,,,,,Presidents,https://s3.us-east-1.amazonaws.com/sjcdigitalarchives/original/046b6e9740ec77de08dfd91e91142cc5.jpg,"Still Image","Photographic Archive—Annapolis",1,0
5681,https://digitalarchives.sjc.edu/items/show/5681,"Edwin J. Delattre Greets his Daughter Donna Delattre with Alice Delattre in the Background, outside of Mellon Hall after the Inauguration Ceremony for Edwin J. Delattre, Annapolis, Maryland, Fall 1980","1 photographic print : b&w",Unknown,,"Annapolis, MD",1980-09,"St. John's College owns the rights to this photograph.","Still Image",jpeg,,"Delattre, Edwin J.;  Delattre, Alice",,,,SJC-P-1757,,,,,,,,,,,,,,,,,,,Photograph,"25.5 x 20.5 cm.",,,,,,,,,,,,,,,,,,,,,,,,,Presidents,https://s3.us-east-1.amazonaws.com/sjcdigitalarchives/original/2900bc14af50ecb180680b1511830310.jpg,"Still Image","Photographic Archive—Annapolis",1,0
5680,https://digitalarchives.sjc.edu/items/show/5680,"Edwin J. Delattre Shakes Hands with a Faculty Member in Academic Robes outside of Mellon Hall after the Inauguration Ceremony for Edwin J. Delattre, Annapolis, Maryland, Fall 1980","1 photographic print : b&w",Unknown,,"Annapolis, MD",1980-09,"St. John's College owns the rights to this photograph.","Still Image",jpeg,,"Delattre, Edwin J.",,,,SJC-P-1756,,,,,,,,,,,,,,,,,,,Photograph,"25.5 x 20.5 cm.",,,,,,,,,,,,,,,,,,,,,,,,,Presidents,https://s3.us-east-1.amazonaws.com/sjcdigitalarchives/original/60e9e1a79678de39b7409010755cde76.jpg,"Still Image","Photographic Archive—Annapolis",1,0
5679,https://digitalarchives.sjc.edu/items/show/5679,"Edwin J. Delattre Shakes Hands with a Faculty Member in Academic Robes outside of Mellon Hall after the Inauguration Ceremony for Edwin J. Delattre, Annapolis, Maryland, Fall 1980","1 photographic print : b&w",Unknown,,"Annapolis, MD",1980-09,"St. John's College owns the rights to this photograph.","Still Image",jpeg,,"Delattre, Edwin J.",,,,SJC-P-1755,,,,,,,,,,,,,,,,,,,Photograph,"25.5 x 20.5 cm.",,,,,,,,,,,,,,,,,,,,,,,,,Presidents,https://s3.us-east-1.amazonaws.com/sjcdigitalarchives/original/1f8ddf3b30eb825ecd28b6ebaf48840c.jpg,"Still Image","Photographic Archive—Annapolis",1,0
5678,https://digitalarchives.sjc.edu/items/show/5678,"Edwin J. Delattre Introduces his Wife Alice Delattre to a Faculty Member in Academic Robes outside of Mellon Hall after the Inauguration Ceremony for Edwin J. Delattre, Annapolis, Maryland, Fall 1980","1 photographic print : b&w",Unknown,,"Annapolis, MD",1980-09,"St. John's College owns the rights to this photograph.","Still Image",jpeg,,"Delattre, Edwin J.;  Delattre, Alice",,,,SJC-P-1754,,,,,,,,,,,,,,,,,,,Photograph,"25.5 x 20.5 cm.",,,,,,,,,,,,,,,,,,,,,,,,,Presidents,https://s3.us-east-1.amazonaws.com/sjcdigitalarchives/original/c328ef5edd4edc9484fdb56296f9dec1.jpg,"Still Image","Photographic Archive—Annapolis",1,0
5677,https://digitalarchives.sjc.edu/items/show/5677,"Edwin J. Delattre Introduces his Wife Alice Delattre to a Colleague in Academic Robes outside of Mellon Hall after the Inauguration Ceremony for Edwin J. Delattre, Annapolis, Maryland, Fall 1980","1 photographic print : b&w",Unknown,,"Annapolis, MD",1980-09,"St. John's College owns the rights to this photograph.","Still Image",jpeg,,"Delattre, Edwin J.;  Delattre, Alice",,,,SJC-P-1753,,,,,,,,,,,,,,,,,,,Photograph,"25.5 x 20.5 cm.",,,,,,,,,,,,,,,,,,,,,,,,,Presidents,https://s3.us-east-1.amazonaws.com/sjcdigitalarchives/original/84cad047a2a6d409370d80304ca62319.jpg,"Still Image","Photographic Archive—Annapolis",1,0
5676,https://digitalarchives.sjc.edu/items/show/5676,"Edwin J. Delattre Introduces his Wife Alice Delattre to a Faculty Member in Academic Robes outside of Mellon Hall after the Inauguration Ceremony for Edwin J. Delattre, Annapolis, Maryland, Fall 1980","1 photographic print : b&w",Unknown,,"Annapolis, MD",1980-09,"St. John's College owns the rights to this photograph.","Still Image",jpeg,,"Delattre, Edwin J.;  Delattre, Alice",,,,SJC-P-1752,,,,,,,,,,,,,,,,,,,Photograph,"25.5 x 20.5 cm.",,,,,,,,,,,,,,,,,,,,,,,,,Presidents,https://s3.us-east-1.amazonaws.com/sjcdigitalarchives/original/774a9f7b99e91a4c525775817af0eb45.jpg,"Still Image","Photographic Archive—Annapolis",1,0
5675,https://digitalarchives.sjc.edu/items/show/5675,"Two Faculty Members in Academic Robes Talking in McDowell Hall before the Inauguration Ceremony for Edwin J. Delattre, Fall 1980","1 photographic print : b&w",Unknown,,"Annapolis, MD",1980-09,"St. John's College owns the rights to this photograph.","Still Image",jpeg,,,,,,SJC-P-1751,,,,,,,,,,,,,,,,,,,Photograph,"25.5 x 20.5 cm.",,,,,,,,,,,,,,,,,,,,,,,,,Tutors,https://s3.us-east-1.amazonaws.com/sjcdigitalarchives/original/a7fefc325ce0db85b6727f7037edd198.jpg,"Still Image","Photographic Archive—Annapolis",1,0
5674,https://digitalarchives.sjc.edu/items/show/5674,"A Faculty Member, in Academic Robe, Speaks with a Colleague at the Inauguration Ceremony for Edwin J. Delattre, Fall 1980","1 photographic print : b&w",Unknown,,"Annapolis, MD",1980-09,"St. John's College owns the rights to this photograph.","Still Image",jpeg,,,,,,SJC-P-1750,,,,,,,,,,,,,,,,,,,Photograph,"25.5 x 20.5 cm.",,,,,,,,,,,,,,,,,,,,,,,,,Tutors,https://s3.us-east-1.amazonaws.com/sjcdigitalarchives/original/d33bbfc8f814fd9647ee9283bf023c2f.jpg,"Still Image","Photographic Archive—Annapolis",1,0
5671,https://digitalarchives.sjc.edu/items/show/5671,"Portrait of Miriam Strange, Registrar, Seated at Desk","1 photographic print : b&w",Unknown,,"Annapolis, MD",,"St. John's College owns the rights to this photograph.","Still Image",jpeg,,"Strange, Miriam ;  St. John's College (Annapolis, Md.). -- Registrars.",,,,SJC-P-1744,,,,,,,,,,,,,,,,,,,Photograph,"20.5 x 25.5 cm.",,,,,,,,,,,,,,,,,,,,,,,,,Registrars,https://s3.us-east-1.amazonaws.com/sjcdigitalarchives/original/60a9df2662b1f8e94011bb2827482923.jpg,"Still Image","Photographic Archive—Annapolis",1,0
