﻿"Item Id","Item URI","Dublin Core:Title","Dublin Core:Description","Dublin Core:Creator","Dublin Core:Publisher","Dublin Core:Coverage","Dublin Core:Date","Dublin Core:Rights","Dublin Core:Type","Dublin Core:Format","Dublin Core:Source","Dublin Core:Subject","Dublin Core:Contributor","Dublin Core:Relation","Dublin Core:Language","Dublin Core:Identifier","Item Type Metadata:Occupation","Item Type Metadata:Participants","Item Type Metadata:Death Date","Item Type Metadata:Birthplace","Item Type Metadata:Birth Date","Item Type Metadata:Interviewer","Item Type Metadata:Biographical Text","Item Type Metadata:Bibliography","Item Type Metadata:Page numeration","Item Type Metadata:Resolution","Item Type Metadata:Identifier","Item Type Metadata:Inventory","Item Type Metadata:URL","Item Type Metadata:Text","Item Type Metadata:Interviewee","Item Type Metadata:Location","Item Type Metadata:Transcription","Item Type Metadata:Local URL","Item Type Metadata:Original Format","Item Type Metadata:Physical Dimensions","Item Type Metadata:Duration","Item Type Metadata:Compression","Item Type Metadata:Producer","Item Type Metadata:Director","Item Type Metadata:Bit Rate/Frequency","Item Type Metadata:Email Body","Item Type Metadata:Event Type","Item Type Metadata:Lesson Plan Text","Item Type Metadata:Materials","Item Type Metadata:Objectives","Item Type Metadata:Standards","Item Type Metadata:Number of Attachments","Item Type Metadata:BCC","Item Type Metadata:CC","Item Type Metadata:To","Item Type Metadata:From","Item Type Metadata:Subject Line","Item Type Metadata:Time Summary","Item Type Metadata:Episode","Item Type Metadata:Season","Item Type Metadata:Episode Type","Item Type Metadata:Explicit","Item Type Metadata:Block","PDF Text:Text",tags,file,itemType,collection,public,featured
377,https://digitalarchives.sjc.edu/items/show/377,"Portrait of a Charles E. Vayne Walking, [St. John's College, Annapolis, Maryland]","1 photographic print : b&w ",Unknown,,"Annapolis, MD","1941-1942 [circa]","St. John's College owns the rights to this photograph.","still image",jpeg,,"St. John's College (Annapolis, Md.). -- Faculty. ;  Portraits ;  Vayne, Charles Edwin",,,,SJC-P-0605,,,,,,,,,,"600 dpi",,,,,,,,,photograph,"9 x 11 cm.",,,,,,,,,,,,,,,,,,,,,,,,,Tutors,https://s3.us-east-1.amazonaws.com/sjcdigitalarchives/original/c04919304c70d5867b85f6e1079a354a.jpg,"Still Image","Photographic Archive—Annapolis",1,0
952,https://digitalarchives.sjc.edu/items/show/952,"Kent Campbell Standing outside on Campus, St. John's College, Annapolis, Maryland","1 photographic print : b&w",Unknown,,"Annapolis, MD","1941-1946 (circa)","St. John's College owns the rights to this photograph.","still image",jpeg,,"Campbell, Kent.",,,,SJC-P-0037,,,,,,,,,,"600 dpi",,,,,,,,,photograph,"12.5 x 18 cm.",,,,,,,,,,,,,,,,,,,,,,,,,Tutors,https://s3.us-east-1.amazonaws.com/sjcdigitalarchives/original/ab644460fabbec768b232bc5007f46b6.jpg,"Still Image","Photographic Archive—Annapolis",1,1
4193,https://digitalarchives.sjc.edu/items/show/4193,"Portrait of W. Boswell Childs","1 photographic print : b&w",Unknown,,"Annapolis, MD",1942,"St. John's College owns the rights to this photograph.","still image",pdf,,"St. John's College (Annapolis, Md.). -- Alumni and alumnae. ;  Portraits ;  Childs, W. Boswell",,,,SJC-P-0221,,,,,,,,,,,,,,,,,,,photograph,"7.5 x 10 cm.",,,,,,,,,,,,,,,,,,,,,,,,,Alumni,https://s3.us-east-1.amazonaws.com/sjcdigitalarchives/original/3b7a20355066c2882a76971c60d05eac.jpg,"Still Image","Photographic Archive—Annapolis",1,0
4194,https://digitalarchives.sjc.edu/items/show/4194,"Portrait of Lee M. Mace","1 photographic print : b&w",Unknown,,"Annapolis, MD",1942,"St. John's College owns the rights to this photograph.","still image",pdf,,"St. John's College (Annapolis, Md.). -- Alumni and alumnae. ;  Portraits ;  Mace, Lee M.",,,,SJC-P-0222,,,,,,,,,,,,,,,,,,,photograph,"7.5 x 10 cm.",,,,,,,,,,,,,,,,,,,,,,,,,Alumni,https://s3.us-east-1.amazonaws.com/sjcdigitalarchives/original/b185c85ecbadc3290fcad32a79414d61.jpg,"Still Image","Photographic Archive—Annapolis",1,0
4195,https://digitalarchives.sjc.edu/items/show/4195,"Portrait of Ernest J. Heinmuller","1 photographic print : b&w",Unknown,,"Annapolis, MD",1942,"St. John's College owns the rights to this photograph.","still image",pdf,,"St. John's College (Annapolis, Md.). -- Alumni and alumnae. ;  Portraits ;  Heinmuller, Ernest J.",,,,SJC-P-0223,,,,,,,,,,,,,,,,,,,photograph,"7.5 x 10 cm.",,,,,,,,,,,,,,,,,,,,,,,,,Alumni,https://s3.us-east-1.amazonaws.com/sjcdigitalarchives/original/0aebca49f18f317066e63c6002999519.jpg,"Still Image","Photographic Archive—Annapolis",1,0
4196,https://digitalarchives.sjc.edu/items/show/4196,"Portrait of C. Robert Sutton","1 photographic print : b&w",Unknown,,"Annapolis, MD",1942,"St. John's College owns the rights to this photograph.","still image",pdf,,"St. John's College (Annapolis, Md.). -- Alumni and alumnae. ;  Portraits ;  Sutton, C. Robert",,,,SJC-P-0224,,,,,,,,,,,,,,,,,,,photograph,"7.5 x 10 cm.",,,,,,,,,,,,,,,,,,,,,,,,,Alumni,https://s3.us-east-1.amazonaws.com/sjcdigitalarchives/original/cb92fd85a99b6f30b834279d0cff6d90.jpg,"Still Image","Photographic Archive—Annapolis",1,0
4197,https://digitalarchives.sjc.edu/items/show/4197,"Portrait of Paul T. Beisser, Jr.","1 photographic print : b&w",Unknown,,"Annapolis, MD",1942,"St. John's College owns the rights to this photograph.","still image",pdf,,"St. John's College (Annapolis, Md.). -- Alumni and alumnae. ;  Portraits ;  Beisser, Paul T., Jr.",,,,SJC-P-0225,,,,,,,,,,,,,,,,,,,photograph,"7.5 x 10 cm.",,,,,,,,,,,,,,,,,,,,,,,,,Alumni,https://s3.us-east-1.amazonaws.com/sjcdigitalarchives/original/99389a288c881638d6d12bc7f404bf8b.jpg,"Still Image","Photographic Archive—Annapolis",1,0
4198,https://digitalarchives.sjc.edu/items/show/4198,"Portrait of Warren Bomhardt","1 photographic print : b&w",Unknown,,"Annapolis, MD",1942,"St. John's College owns the rights to this photograph.","still image",pdf,,"St. John's College (Annapolis, Md.). -- Alumni and alumnae. ;  Portraits ;  Bomhardt, Warren",,,,SJC-P-0226,,,,,,,,,,,,,,,,,,,photograph,"7.5 x 10 cm.",,,,,,,,,,,,,,,,,,,,,,,,,Alumni,https://s3.us-east-1.amazonaws.com/sjcdigitalarchives/original/d86e7383e5f04876ba6b71db9b745d0f.jpg,"Still Image","Photographic Archive—Annapolis",1,0
4199,https://digitalarchives.sjc.edu/items/show/4199,"Portrait of William A. Barr","1 photographic print : b&w",Unknown,,"Annapolis, MD",1942,"St. John's College owns the rights to this photograph.","still image",pdf,,"St. John's College (Annapolis, Md.). -- Alumni and alumnae. ;  Portraits ;  Barr, William A. ",,,,SJC-P-0227,,,,,,,,,,,,,,,,,,,photograph,"7.5 x 10 cm.",,,,,,,,,,,,,,,,,,,,,,,,,Alumni,https://s3.us-east-1.amazonaws.com/sjcdigitalarchives/original/3bf7210e3ec7b9d85e01b6b58bc4211d.jpg,"Still Image","Photographic Archive—Annapolis",1,0
4200,https://digitalarchives.sjc.edu/items/show/4200,"Portrait of John E. Ainsworth, Jr.","1 photographic print : b&w",Unknown,,"Annapolis, MD",1942,"St. John's College owns the rights to this photograph.","still image",pdf,,"St. John's College (Annapolis, Md.). -- Alumni and alumnae. ;  Portraits ;  Ainsworth, John E., Jr.",,,,SJC-P-0228,,,,,,,,,,,,,,,,,,,photograph,"7.5 x 10 cm.",,,,,,,,,,,,,,,,,,,,,,,,,Alumni,https://s3.us-east-1.amazonaws.com/sjcdigitalarchives/original/cb0fdd22e1166ecd93605f2af7da0bab.jpg,"Still Image","Photographic Archive—Annapolis",1,0
4201,https://digitalarchives.sjc.edu/items/show/4201,"Portrait of Walter E. Hutson, Jr.","1 photographic print : b&w",Unknown,,"Annapolis, MD",1942,"St. John's College owns the rights to this photograph.","still image",pdf,,"St. John's College (Annapolis, Md.). -- Alumni and alumnae. ;  Portraits ;  Hutson, Walter E., Jr.",,,,SJC-P-0229,,,,,,,,,,,,,,,,,,,photograph,"7.5 x 10 cm.",,,,,,,,,,,,,,,,,,,,,,,,,Alumni,https://s3.us-east-1.amazonaws.com/sjcdigitalarchives/original/ea0b34204a383538bc842be3c7cd20ff.jpg,"Still Image","Photographic Archive—Annapolis",1,0
4202,https://digitalarchives.sjc.edu/items/show/4202,"Portrait of Thomas Parran Jr.","1 photographic print : b&w",Unknown,,"Annapolis, MD",1942,"St. John's College owns the rights to this photograph.","still image",pdf,,"St. John's College (Annapolis, Md.). -- Alumni and alumnae. ;  Portraits ;  Parran, Thomas, Jr.",,,,SJC-P-0230,,,,,,,,,,,,,,,,,,,photograph,"7.5 x 10 cm.",,,,,,,,,,,,,,,,,,,,,,,,,Alumni,https://s3.us-east-1.amazonaws.com/sjcdigitalarchives/original/7dce88b570afa8de2668c05aa3f52577.jpg,"Still Image","Photographic Archive—Annapolis",1,0
4203,https://digitalarchives.sjc.edu/items/show/4203,"Portrait of Bryce Du Val Jacobsen","1 photographic print : b&w",Unknown,,"Annapolis, MD",1942,"St. John's College owns the rights to this photograph.","still image",pdf,,"St. John's College (Annapolis, Md.). -- Alumni and alumnae. ;  Portraits ;  Jacobsen, Bryce D.",,,,SJC-P-0231,,,,,,,,,,,,,,,,,,,photograph,"7.5 x 10 cm.",,,,,,,,,,,,,,,,,,,,,,,,,"Alumni,Tutors",https://s3.us-east-1.amazonaws.com/sjcdigitalarchives/original/0f130e32210e0103e4bf23a4023cf38a.jpg,"Still Image","Photographic Archive—Annapolis",1,0
4204,https://digitalarchives.sjc.edu/items/show/4204,"Portrait of Journet Kahn","1 photographic print : b&w",Unknown,,"Annapolis, MD",1942,"St. John's College owns the rights to this photograph.","still image",pdf,,"St. John's College (Annapolis, Md.). -- Alumni and alumnae. ;  Portraits ;  Kahn, Journet",,,,SJC-P-0232,,,,,,,,,,,,,,,,,,,photograph,"7.5 x 10 cm.",,,,,,,,,,,,,,,,,,,,,,,,,Alumni,https://s3.us-east-1.amazonaws.com/sjcdigitalarchives/original/0e386afcc4440aca1981774b8bac5dbc.jpg,"Still Image","Photographic Archive—Annapolis",1,0
4205,https://digitalarchives.sjc.edu/items/show/4205,"Portrait of Joseph C. Hofmann, Jr.","1 photographic print : b&w",Unknown,,"Annapolis, MD",1942,"St. John's College owns the rights to this photograph.","still image",pdf,,"St. John's College (Annapolis, Md.). -- Alumni and alumnae. ;  Portraits ;  Hoffman, Joseph C., Jr.",,,,SJC-P-0233,,,,,,,,,,,,,,,,,,,photograph,"7.5 x 10 cm.",,,,,,,,,,,,,,,,,,,,,,,,,Alumni,https://s3.us-east-1.amazonaws.com/sjcdigitalarchives/original/9422b59215d9019ff3245902aa459a58.jpg,"Still Image","Photographic Archive—Annapolis",1,0
4206,https://digitalarchives.sjc.edu/items/show/4206,"Portrait of Albert A. Poppiti","1 photographic print : b&w",Unknown,,"Annapolis, MD",1942,"St. John's College owns the rights to this photograph.","still image",pdf,,"St. John's College (Annapolis, Md.). -- Alumni and alumnae. ;  Portraits ;  Poppiti, Albert A.",,,,SJC-P-0234,,,,,,,,,,,,,,,,,,,photograph,"7.5 x 10 cm.",,,,,,,,,,,,,,,,,,,,,,,,,Alumni,https://s3.us-east-1.amazonaws.com/sjcdigitalarchives/original/de3851aa4bc2976c7d96f5996568fa42.jpg,"Still Image","Photographic Archive—Annapolis",1,0
81,https://digitalarchives.sjc.edu/items/show/81,"Students Eating in the Randall Hall Dining Hall with Bow-Tie Waiters","1 photographic print : b&w ",Unknown,,"Annapolis, MD","1942 [circa]","St. John's College owns the rights to this photograph.","still image",jpeg,,,,,,SJC-P-0898,,,,,,,,,,"600 dpi",,,,,,,,,photograph,"25.5 x 20.5 cm.",,,,,,,,,,,,,,,,,,,,,,,,,"Dining Hall,Randall Hall",https://s3.us-east-1.amazonaws.com/sjcdigitalarchives/original/a056ba1707a7584f51c21172d3ad02eb.jpg,"Still Image","Photographic Archive—Annapolis",1,1
1187,https://digitalarchives.sjc.edu/items/show/1187,"Upperclassmen Paddling Freshman during the ""Running the Gauntlet"", St. John's College, Annapolis, Maryland","1 photographic print : b&w",Unknown,,"Annapolis, MD","1942 [circa]","St. John's College owns the rights to this photograph.","still image",jpeg,,"St. John's College (Annapolis, MD) -- Students. ;  Hazing",,,,SJC-P-0681,,,,,,,,,,,,,,,,,,,photograph,"12.5 x 16 cm.",,,,,,,,,,,,,,,,,,,,,,,,,,https://s3.us-east-1.amazonaws.com/sjcdigitalarchives/original/1dea3c3971b4fa46c746ae89de4138c5.jpg,"Still Image","Photographic Archive—Annapolis",1,0
4480,https://digitalarchives.sjc.edu/items/show/4480,"Carpenters Rebuilding a Staircase in Pinkney Hall, St. John's College, Annapolis, Maryland","1 photographic print : b&w",Unknown,,"Annapolis, MD","1942 [circa]","St. John's College owns the rights to this photograph.","Still Image",jpeg,,"Pinkney Hall (St. John's College, Annapolis, MD) 1940-1950.",,,,SJC-P-0473,,,,,,,,,,,,,,,,,,,Photograph,"25.5 x 20.5 cm.",,,,,,,,,,,,,,,,,,,,,,,,,"Pinkney Hall",https://s3.us-east-1.amazonaws.com/sjcdigitalarchives/original/2a21be450eacf0ff5389e23457fa035e.jpg,"Still Image","Photographic Archive—Annapolis",1,0
4481,https://digitalarchives.sjc.edu/items/show/4481,"Side View of Pinkney Hall with Scaffolding, St. John's College, Annapolis, Maryland","1 photographic print : b&w",Unknown,,"Annapolis, MD","1942 [circa]","St. John's College owns the rights to this photograph.","Still Image",jpeg,,"Pinkney Hall (St. John's College, Annapolis, MD) 1940-1950.",,,,SJC-P-0474,,,,,,,,,,,,,,,,,,,Photograph,"25.5 x 20.5 cm.",,,,,,,,,,,,,,,,,,,,,,,,,"Pinkney Hall",https://s3.us-east-1.amazonaws.com/sjcdigitalarchives/original/78dbc10ec478a436eab1540cccbc7ee5.jpg,"Still Image","Photographic Archive—Annapolis",1,0
