﻿"Item Id","Item URI","Dublin Core:Title","Dublin Core:Description","Dublin Core:Creator","Dublin Core:Publisher","Dublin Core:Coverage","Dublin Core:Date","Dublin Core:Rights","Dublin Core:Type","Dublin Core:Format","Dublin Core:Source","Dublin Core:Subject","Dublin Core:Contributor","Dublin Core:Relation","Dublin Core:Language","Dublin Core:Identifier","Item Type Metadata:Occupation","Item Type Metadata:Participants","Item Type Metadata:Death Date","Item Type Metadata:Birthplace","Item Type Metadata:Birth Date","Item Type Metadata:Interviewer","Item Type Metadata:Biographical Text","Item Type Metadata:Bibliography","Item Type Metadata:Page numeration","Item Type Metadata:Resolution","Item Type Metadata:Identifier","Item Type Metadata:Inventory","Item Type Metadata:URL","Item Type Metadata:Text","Item Type Metadata:Interviewee","Item Type Metadata:Location","Item Type Metadata:Transcription","Item Type Metadata:Local URL","Item Type Metadata:Original Format","Item Type Metadata:Physical Dimensions","Item Type Metadata:Duration","Item Type Metadata:Compression","Item Type Metadata:Producer","Item Type Metadata:Director","Item Type Metadata:Bit Rate/Frequency","Item Type Metadata:Email Body","Item Type Metadata:Event Type","Item Type Metadata:Lesson Plan Text","Item Type Metadata:Materials","Item Type Metadata:Objectives","Item Type Metadata:Standards","Item Type Metadata:Number of Attachments","Item Type Metadata:BCC","Item Type Metadata:CC","Item Type Metadata:To","Item Type Metadata:From","Item Type Metadata:Subject Line","Item Type Metadata:Time Summary","Item Type Metadata:Episode","Item Type Metadata:Season","Item Type Metadata:Episode Type","Item Type Metadata:Explicit","Item Type Metadata:Block","PDF Text:Text",tags,file,itemType,collection,public,featured
4699,https://digitalarchives.sjc.edu/items/show/4699,"Portrait of John S. Kieffer Seated and Working at Desk","1 photographic print : b&w",Unknown,,"Annapolis, MD","1940-1950 [circa]","St. John's College owns the rights to this photograph.","Still Image",jpeg,,"St. John's College (Annapolis, Md.). -- Presidents. ;  St. John's College (Annapolis, Md.). -- Deans. ;  St. John's College (Annapolis, Md.). -- Faculty. ;  Portraits ;  Kieffer, John Spangler.",,,,SJC-P-0776,,,,,,,,,,,,,,,,,,,Photograph,"12.5 x 18 cm.",,,,,,,,,,,,,,,,,,,,,,,,,"Deans,Honorary Alumni,Presidents,Tutors",https://s3.us-east-1.amazonaws.com/sjcdigitalarchives/original/571603333bcec68ecff32958cc09e18e.jpg,"Still Image","Photographic Archive—Annapolis",1,0
4812,https://digitalarchives.sjc.edu/items/show/4812,"Students Seated at Work in Freshman Laboratory Class, St. John's College, Annapolis, Maryland","1 photographic print : b&w",Unknown,,"Annapolis, MD","1940-1950 [circa]","St. John's College owns the rights to this photograph.","Still Image",jpeg,,"St. John's College (Annapolis, Md.). -- Students. ;  St. John's College (Annapolis, Md.). -- Laboratory.",,,,SJC-P-0829,,,,,,,,,,,,,,,,,,,Photograph,"25.5 x 20.5 cm.",,,,,,,,,,,,,,,,,,,,,,,,,"Annapolis Freshman Lab",https://s3.us-east-1.amazonaws.com/sjcdigitalarchives/original/d030c1449f6eed8ba1cca9e73276adef.jpg,"Still Image","Photographic Archive—Annapolis",1,0
4838,https://digitalarchives.sjc.edu/items/show/4838,"Students Seated with Microscopes in Laboratory Class, St. John's College, Annapolis, Maryland","1 photographic print : b&w",Unknown,,"Annapolis, MD","1940-1950 [circa]","St. John's College owns the rights to this photograph.","Still Image",jpeg,,"St. John's College (Annapolis, Md.) -- Students. ;  St. John's College (Annapolis, Md.). -- Laboratory.",,,,SJC-P-0858,,,,,,,,,,,,,,,,,,,Photograph,"25.5 x 20.5 cm.",,,,,,,,,,,,,,,,,,,,,,,,,,https://s3.us-east-1.amazonaws.com/sjcdigitalarchives/original/b56245164e0857cffa0df56723487d74.jpg,"Still Image","Photographic Archive—Annapolis",1,0
5910,https://digitalarchives.sjc.edu/items/show/5910,"Portrait of Scott M. Buchanan","1 photographic print : b&w",Unknown,,"Annapolis, MD","1940-1950 [circa]","St. John's College owns the rights to this photograph.","Still image",jpeg,,"St. John's College (Annapolis, Md.). -- Deans;   St. John's College (Annapolis, Md.) ;  Buchanan, Scott Milross, 1895-1968",,,,SJC-P-2121,,,,,,,,,,,,,,,,,,,Photograph,"13 x 17.5 cm.",,,,,,,,,,,,,,,,,,,,,,,,,"Alumni,Deans",https://s3.us-east-1.amazonaws.com/sjcdigitalarchives/original/dc869f9b58a2c42fbd5f9577a891003c.jpg,"Still Image","Photographic Archive—Annapolis",1,0
95,https://digitalarchives.sjc.edu/items/show/95,"Carroll-Barrister House, St. John's College, Annapolis, Maryland","1 photographic print : b&w ","Warren, M. E.",,"Annapolis, MD","1940-1960 [circa]","St. John's College owns the rights to this photograph.","still image",jpeg,,,,,,SJC-P-2224,,,,,,,,,,"600 dpi",,,,,,,,,photograph,"25.5 x 20.5 cm.",,,,,,,,,,,,,,,,,,,,,,,,,"Carroll Barrister House",https://s3.us-east-1.amazonaws.com/sjcdigitalarchives/original/54c4e17a88bc39e73df7beb0aa19a12f.jpg,"Still Image","Photographic Archive—Annapolis",1,1
383,https://digitalarchives.sjc.edu/items/show/383,"Portrait of a [Student]","1 photographic print : b&w ",Unknown,,"Annapolis, MD","1940-1960 [circa]","St. John's College owns the rights to this photograph.","still image",jpeg,,"St. John's College (Annapolis, Md.). -- Students. ;  Portraits",,,,SJC-P-0611,,,,,,,,,,"600 dpi",,,,,,,,,photograph,"9.5 x 11.5 cm.",,,,,,,,,,,,,,,,,,,,,,,,,,https://s3.us-east-1.amazonaws.com/sjcdigitalarchives/original/85d3d89b878ef6c942b8446be70368a2.jpg,"Still Image","Photographic Archive—Annapolis",1,0
384,https://digitalarchives.sjc.edu/items/show/384,"Group Portrait of St. John's College Students on Front Campus, St. John's College, Annapolis, Maryland","1 photographic print : b&w ",Unknown,,"Annapolis, MD","1940-1960 [circa]","St. John's College owns the rights to this photograph.","still image",jpeg,,"St. John's College (Annapolis, Md.). -- Students.",,,,SJC-P-0612,,,,,,,,,,"600 dpi",,,,,,,,,photograph," 9 x 12.5 cm.",,,,,,,,,,,,,,,,,,,,,,,,,Alumni,https://s3.us-east-1.amazonaws.com/sjcdigitalarchives/original/2932ef5ee734076a3075779b49396f29.jpg,"Still Image","Photographic Archive—Annapolis",1,1
1762,https://digitalarchives.sjc.edu/items/show/1762,"A View from the Front Steps of Woodward Hall with Students, St. John's College, Annapolis, Maryland","1 photographic print : b&w",Unknown,,"Annapolis, MD","1940-1960 [circa]","St. John's College owns the rights to this photograph.","still image",pdf,,"Woodward Hall (St. John's College, Annapolis, MD). ;  St. John's College (Annapolis, Md.). -- Students.",,,,SJC-P-0321,,,,,,,,,,,,,,,,,,,photograph,"19.5 x 24.5 cm.",,,,,,,,,,,,,,,,,,,,,,,,,,https://s3.us-east-1.amazonaws.com/sjcdigitalarchives/original/a53a6ebb74e4ede230ce32a9f127fbae.jpg,"Still Image","Photographic Archive—Annapolis",1,0
1769,https://digitalarchives.sjc.edu/items/show/1769,"Student Seated at Desk Reading a Book in a Dormitory Room, St. John's College, Annapolis, Maryland","1 photographic print : b&w",Unknown,,"Annapolis, MD","1940-1960 [circa]","St. John's College owns the rights to this photograph.","still image",pdf,,"St. John's College (Annapolis, Md.). -- Students.",,,,SJC-P-0329,,,,,,,,,,,,,,,,,,,photograph,"13.5 x 9.5 cm.",,,,,,,,,,,,,,,,,,,,,,,,,,https://s3.us-east-1.amazonaws.com/sjcdigitalarchives/original/1848febce675fcc874b221e808d32304.jpg,"Still Image","Photographic Archive—Annapolis",1,0
1770,https://digitalarchives.sjc.edu/items/show/1770,"Student Seated at Desk Writing a Note, St. John's College, Annapolis, Maryland","1 photographic print : b&w",Unknown,,"Annapolis, MD","1940-1960 [circa]","St. John's College owns the rights to this photograph.","still image",pdf,,"St. John's College (Annapolis, Md.). -- Students.",,,,SJC-P-0330,,,,,,,,,,,,,,,,,,,photograph,"13.5 x 9.5 cm.",,,,,,,,,,,,,,,,,,,,,,,,,,https://s3.us-east-1.amazonaws.com/sjcdigitalarchives/original/b372f918f2cbe3145efde2ed8857ee5f.jpg,"Still Image","Photographic Archive—Annapolis",1,0
1771,https://digitalarchives.sjc.edu/items/show/1771,"Portrait of a Student Seated with Bookshelf in the Background, St. John's College, Annapolis, Maryland","1 photographic print : b&w",Unknown,,"Annapolis, MD","1940-1960 [circa]","St. John's College owns the rights to this photograph.","still image",pdf,,"St. John's College (Annapolis, Md.). -- Students.",,,,SJC-P-0331,,,,,,,,,,,,,,,,,,,photograph,"12.5 x 8.5 cm.",,,,,,,,,,,,,,,,,,,,,,,,,,https://s3.us-east-1.amazonaws.com/sjcdigitalarchives/original/9b89b50c10e33ac9d2e671fde8ffb50a.jpg,"Still Image","Photographic Archive—Annapolis",1,0
4418,https://digitalarchives.sjc.edu/items/show/4418,"Side View of McDowell Hall in Snow with Cars, St. John's College, Annapolis, Maryland","1 photographic print : b&w",Unknown,,"Annapolis,MD","1940-1960 [circa]","St. John's College owns the rights to this photograph.","still image",jpeg,,"McDowell Hall (St. John's College, Annapolis, MD) 1940-1960.",,,,SJC-P-0392,,,,,,,,,,,,,,,,,,,photograph,"25 x 20 cm.",,,,,,,,,,,,,,,,,,,,,,,,,"McDowell Hall",https://s3.us-east-1.amazonaws.com/sjcdigitalarchives/original/1906fffce6e58481ca8d8b61f85a2028.jpg,"Still Image","Photographic Archive—Annapolis",1,0
4625,https://digitalarchives.sjc.edu/items/show/4625,"Students Seated with Microscopes in Laboratory Class, St. John's College, Annapolis, Maryland","1 photographic print : b&w",Unknown,,"Annapolis, MD","1940-1960 [circa]","St. John's College owns the rights to this photograph.","Still Image",jpeg,,"St. John's College (Annapolis, Md.) -- Students. ;  St. John's College (Annapolis, Md.). -- Laboratory.",,,,SJC-P-0700,,,,,,,,,,,,,,,,,,,Photograph,"17.5 x 12.5 cm.",,,,,,,,,,,,,,,,,,,,,,,,,,https://s3.us-east-1.amazonaws.com/sjcdigitalarchives/original/0874833254133cd638fb4351689119a1.jpg,"Still Image","Photographic Archive—Annapolis",1,0
79,https://digitalarchives.sjc.edu/items/show/79,"Mrs. Lathrop in the Bookstore in the Basement of McDowell Hall, St. John's College, Annapolis, Maryland","1 photographic print : b&w ",Unknown,,"Annapolis, MD",1941,"St. John's College owns the rights to this photograph.","still image",jpeg,,,,,,SJC-P-0871,,,,,,,,,,"600 dpi",,,,,,,,,photograph,"25.5 x 20.5 cm.",,,,,,,,,,,,,,,,,,,,,,,,,"McDowell Hall",https://s3.us-east-1.amazonaws.com/sjcdigitalarchives/original/0f473ad925083e5afc9263705f06ad67.jpg,"Still Image","Photographic Archive—Annapolis",1,1
1189,https://digitalarchives.sjc.edu/items/show/1189,"Paul R. Comegys, Sr. and Francis S. Mason, Jr. on Stage during a Variety Club Production of ""That's Your Problem"", St. John's College, Annapolis, Maryland","1 photographic print : b&w",Unknown,,"Annapolis, MD",1941,"St. John's College owns the rights to this photograph.","still image",jpeg,,"Variety Club (St. John's College, Annapolis, MD).; Comegys, Paul R., Sr. ;  Mason, Francis S., Jr.",,,,SJC-P-0683,,,,,,,,,,,,,,,,,,,photograph,"17.5 x 13 cm.",,,,,,,,,,,,,,,,,,,,,,,,,Alumni,https://s3.us-east-1.amazonaws.com/sjcdigitalarchives/original/1fd33af554d4a244cf98646300c03dba.jpg,"Still Image","Photographic Archive—Annapolis",1,0
4176,https://digitalarchives.sjc.edu/items/show/4176,"Portrait of James H. Clark","1 photographic print : b&w",Unknown,,"Annapolis, MD",1941,"St. John's College owns the rights to this photograph.","still image",jpeg,,"St. John's College (Annapolis, Md.). -- Alumni and alumnae. ;  Portraits ;  Clark, James H.",,,,SJC-P-0204,,,,,,,,,,,,,,,,,,,photograph,"7 x 8 cm.",,,,,,,,,,,,,,,,,,,,,,,,,Alumni,https://s3.us-east-1.amazonaws.com/sjcdigitalarchives/original/4148d6d62529960af860d7a8d4fbeefd.jpg,"Still Image","Photographic Archive—Annapolis",1,0
4177,https://digitalarchives.sjc.edu/items/show/4177,"Portrait of Paul R. Comegys","1 photographic print : b&w",Unknown,,"Annapolis, MD",1941,"St. John's College owns the rights to this photograph.","still image",jpeg,,"St. John's College (Annapolis, Md.). -- Alumni and alumnae. ;  Portraits ;  Comegys, Paul R.",,,,SJC-P-0205,,,,,,,,,,,,,,,,,,,photograph,"7 x 8 cm.",,,,,,,,,,,,,,,,,,,,,,,,,Alumni,https://s3.us-east-1.amazonaws.com/sjcdigitalarchives/original/b968e20645fb4fafc87100b497c5d898.jpg,"Still Image","Photographic Archive—Annapolis",1,0
4178,https://digitalarchives.sjc.edu/items/show/4178,"Portrait of Henry D. Cubbage","1 photographic print : b&w",Unknown,,"Annapolis, MD",1941,"St. John's College owns the rights to this photograph.","still image",jpeg,,"St. John's College (Annapolis, Md.). -- Alumni and alumnae. ;  Portraits ;  Cubbage, Henry D.",,,,SJC-P-0206,,,,,,,,,,,,,,,,,,,photograph,"7 x 8 cm.",,,,,,,,,,,,,,,,,,,,,,,,,Alumni,https://s3.us-east-1.amazonaws.com/sjcdigitalarchives/original/89fb5a22309c603a5311598cb08962b9.jpg,"Still Image","Photographic Archive—Annapolis",1,0
4179,https://digitalarchives.sjc.edu/items/show/4179,"Portrait of Atwood N. Garis","1 photographic print : b&w",Unknown,,"Annapolis, MD",1941,"St. John's College owns the rights to this photograph.","still image",jpeg,,"St. John's College (Annapolis, Md.). -- Alumni and alumnae. ;  Portraits ;  Garis, Atwood N.",,,,SJC-P-0207,,,,,,,,,,,,,,,,,,,photograph,"7 x 8 cm.",,,,,,,,,,,,,,,,,,,,,,,,,Alumni,https://s3.us-east-1.amazonaws.com/sjcdigitalarchives/original/6cc0f1a73affdf79db600f78304f8262.jpg,"Still Image","Photographic Archive—Annapolis",1,0
4180,https://digitalarchives.sjc.edu/items/show/4180,"Portrait of William H. Hatfield","1 photographic print : b&w",Unknown,,"Annapolis, MD",1941,"St. John's College owns the rights to this photograph.","still image",jpeg,,"St. John's College (Annapolis, Md.). -- Alumni and alumnae. ;  Portraits ;  Hatfield, William H.",,,,SJC-P-0208,,,,,,,,,,,,,,,,,,,photograph,"7 x 8 cm.",,,,,,,,,,,,,,,,,,,,,,,,,Alumni,https://s3.us-east-1.amazonaws.com/sjcdigitalarchives/original/24afe4f4cd83b31b127d55e35bf30143.jpg,"Still Image","Photographic Archive—Annapolis",1,0
