﻿"Item Id","Item URI","Dublin Core:Title","Dublin Core:Description","Dublin Core:Creator","Dublin Core:Publisher","Dublin Core:Coverage","Dublin Core:Date","Dublin Core:Rights","Dublin Core:Type","Dublin Core:Format","Dublin Core:Source","Dublin Core:Subject","Dublin Core:Contributor","Dublin Core:Relation","Dublin Core:Language","Dublin Core:Identifier","Item Type Metadata:Occupation","Item Type Metadata:Participants","Item Type Metadata:Death Date","Item Type Metadata:Birthplace","Item Type Metadata:Birth Date","Item Type Metadata:Interviewer","Item Type Metadata:Biographical Text","Item Type Metadata:Bibliography","Item Type Metadata:Page numeration","Item Type Metadata:Resolution","Item Type Metadata:Identifier","Item Type Metadata:Inventory","Item Type Metadata:URL","Item Type Metadata:Text","Item Type Metadata:Interviewee","Item Type Metadata:Location","Item Type Metadata:Transcription","Item Type Metadata:Local URL","Item Type Metadata:Original Format","Item Type Metadata:Physical Dimensions","Item Type Metadata:Duration","Item Type Metadata:Compression","Item Type Metadata:Producer","Item Type Metadata:Director","Item Type Metadata:Bit Rate/Frequency","Item Type Metadata:Email Body","Item Type Metadata:Event Type","Item Type Metadata:Lesson Plan Text","Item Type Metadata:Materials","Item Type Metadata:Objectives","Item Type Metadata:Standards","Item Type Metadata:Number of Attachments","Item Type Metadata:BCC","Item Type Metadata:CC","Item Type Metadata:To","Item Type Metadata:From","Item Type Metadata:Subject Line","Item Type Metadata:Time Summary","Item Type Metadata:Episode","Item Type Metadata:Season","Item Type Metadata:Episode Type","Item Type Metadata:Explicit","Item Type Metadata:Block","PDF Text:Text",tags,file,itemType,collection,public,featured
186,https://digitalarchives.sjc.edu/items/show/186,"Catalogue Issue:  Bulletin of St. John's College in Annapolis; Official Statement of the St. John's Program, Catalogue 1953","College catalog for the year 1953","St. John's College","St. John's College","Annapolis, MD",1953-03,"St. John's College owns the rights to this publication.",text,pdf,"Bulletin of St. John's College:  Volume V, No. 1",,,,English,,,,,,,,,,"82 pages",,,,,,,,,,paper,,,,,,,,,,,,,,,,,,,,,,,,,,"Catalog,Catalogue",https://s3.us-east-1.amazonaws.com/sjcdigitalarchives/original/5e8fd279c5e8b0b1ba6a1b00aa0bc1b1.pdf,Text,"College Catalogs and Statements of the Program",1,0
183,https://digitalarchives.sjc.edu/items/show/183,"Catalogue Issue: Bulletin of St. John's College in Annapolis; Official Statement of the St. John's Program, Catalogue 1950","College catalog for the year 1950","St. John's College","St. John's College","Annapolis, MD",1950-03,"St. John's College owns the rights to this publication.",text,pdf,"Bulletin of St. John's College:  Volume II, Number 1",,,,English,,,,,,,,,,"94 pages",,,,,,,,,,paper,,,,,,,,,,,,,,,,,,,,,,,,,,"Bulletin,Catalog,Catalogue",https://s3.us-east-1.amazonaws.com/sjcdigitalarchives/original/cf5051e0e9a15f4f7c8772a7d6693ad8.pdf,Text,"College Catalogs and Statements of the Program",1,0
184,https://digitalarchives.sjc.edu/items/show/184,"Catalogue Issue: Bulletin of St. John's College in Annapolis; Official Statement of the St. John's Program, Catalogue 1951","College catalog for the year 1951, with first mention of women being admitted to the college.","St. John's College","St. John's College","Annapolis, MD",1951-03,"St. John's College owns the rights to this publication.",text,pdf,"Bulletin of St. John's College:  Volume III, Number 1",,,,English,,,,,,,,,,"94 pages",,,,,,,,,,paper,,,,,,,,,,,,,,,,,,,,,,,,,,"Bulletin,Catalog,Catalogue",https://s3.us-east-1.amazonaws.com/sjcdigitalarchives/original/9116022aa20a4049bd2b7f92db23c4c8.pdf,Text,"College Catalogs and Statements of the Program",1,0
155,https://digitalarchives.sjc.edu/items/show/155,"Catalogue of St. John's College 1924-1925","College catalog for the years 1924-1925","St. John's College","Capital Gazette Press","Annapolis, MD",1924-1925,"St. John's College owns the rights to this publication.",text,pdf,,,,,English,,,,,,,,,,,,,,,,,,,,paper,,,,,,,,,,,,,,,,,,,,,,,,,,"Catalog,Catalogue",https://s3.us-east-1.amazonaws.com/sjcdigitalarchives/original/08d72fa8ec79de02078d3faaa1f60f52.pdf,Text,"College Catalogs and Statements of the Program",1,0
156,https://digitalarchives.sjc.edu/items/show/156,"Catalogue of St. John's College 1925-1926","College catalog for the years 1925-1926","St. John's College","Capital-Gazette Press, Inc.","Annapolis, MD",1925-1926,"St. John's College owns the rights to this publication.",text,pdf,,,,,English,,,,,,,,,,"61 pages",,,,,,,,,,paper,,,,,,,,,,,,,,,,,,,,,,,,,,"Catalog,Catalogue",https://s3.us-east-1.amazonaws.com/sjcdigitalarchives/original/7f8d488e0f77cb227f87d3b7e5e7146d.pdf,Text,"College Catalogs and Statements of the Program",1,0
157,https://digitalarchives.sjc.edu/items/show/157,"Catalogue of St. John's College 1926-1927","College catalog for the years 1926-1927","St. John's College","Capital Gazette Press","Annapolis, MD",1926-1927,"St. John's College owns the rights to this publication.",text,pdf,,,,,English,,,,,,,,,,"62 pages",,,,,,,,,,paper,,,,,,,,,,,,,,,,,,,,,,,,,,"Catalog,Catalogue",https://s3.us-east-1.amazonaws.com/sjcdigitalarchives/original/50616da6ada78efb8740ba0a47d61d66.pdf,Text,"College Catalogs and Statements of the Program",1,0
196,https://digitalarchives.sjc.edu/items/show/196,"Catalogue of St. John's College 1970-1972:  Official Statement of the St. John's Program","College catalog for the years 1970-1972","St. John's College",,"Annapolis, MD; Santa Fe, NM",1970-1972,"St. John's College owns the rights to this publication.",text,pdf,,,,,English,,,,,,,,,,"100 pages",,,,,,,,,,paper,,,,,,,,,,,,,,,,,,,,,,,,,,"Catalog,Catalogue",https://s3.us-east-1.amazonaws.com/sjcdigitalarchives/original/223cfac6fb9294cfc7401be3057d70e9.pdf,Text,"College Catalogs and Statements of the Program",1,0
141,https://digitalarchives.sjc.edu/items/show/141,"Catalogue of St. John's College Annapolis, Maryland for the Academic Year 1908-1909 and Prospectus 1909-1910","College catalog for the years 1908-1909","St. John's College","Advertiser-Republican Print","Annapolis, MD",1909,"St. John's College owns the rights to this publication.",text,pdf,,,,,English,,,,,,,,,,"94 pages",,,,,,,,,,paper,,,,,,,,,,,,,,,,,,,,,,,,,,"Catalog,Catalogue,University of Maryland",https://s3.us-east-1.amazonaws.com/sjcdigitalarchives/original/e74af1cfe74b75000a6691f32bdb53e8.pdf,Text,"College Catalogs and Statements of the Program",1,0
142,https://digitalarchives.sjc.edu/items/show/142,"Catalogue of St. John's College Annapolis, Maryland for the Academic Year, 1909-1910 and Prospectus 1910-1911","College catalog for the years 1909-1910","St. John's College",Advertiser-Republican,"Annapolis, MD",1909-1910,"St. John's College owns the rights to this publication.",text,pdf,,,,,English,,,,,,,,,,"93 pages",,,,,,,,,,paper,,,,,,,,,,,,,,,,,,,,,,,,,,"Catalog,Catalogue,University of Maryland",https://s3.us-east-1.amazonaws.com/sjcdigitalarchives/original/5463644e0f47b05ac31f020eded3bc10.pdf,Text,"College Catalogs and Statements of the Program",1,0
143,https://digitalarchives.sjc.edu/items/show/143,"Catalogue of St. John's College Annapolis, Maryland for the Academic Year, 1910-1911 and Prospectus 1911-1912 ","College catalog for the years 1910-1911","St. John's College",Advertiser-Republican,"Annapolis, MD",1910-1911,"St. John's College owns the rights to this publication.",text,pdf,,,,,English,,,,,,,,,,"93 pages",,,,,,,,,,paper,,,,,,,,,,,,,,,,,,,,,,,,,,"Catalog,Catalogue,University of Maryland",https://s3.us-east-1.amazonaws.com/sjcdigitalarchives/original/d9bf763fa8fce219634d0b557c63cfd2.pdf,Text,"College Catalogs and Statements of the Program",1,0
144,https://digitalarchives.sjc.edu/items/show/144,"Catalogue of St. John's College Annapolis, Maryland for the Academic Year, 1911-1912 and Prospectus 1912-1913","College catalog for the years 1911-1912","St. John's College",Advertiser-Republican,"Annapolis, MD",1911-1912,"St. John's College owns the rights to this publication.",text,pdf,,,,,English,,,,,,,,,,"101 pages",,,,,,,,,,paper,,,,,,,,,,,,,,,,,,,,,,,,,,"Catalog,Catalogue,University of Maryland",https://s3.us-east-1.amazonaws.com/sjcdigitalarchives/original/3163fe4bcbc655c44e1d45714e6a759c.pdf,Text,"College Catalogs and Statements of the Program",1,0
147,https://digitalarchives.sjc.edu/items/show/147,"Catalogue of St. John's College Annapolis, Maryland for the Academic Year, 1914-1915 And Prospectus, 1915-1916","College catalog for the years 1914-1915","St. John's College","Press of the Advertiser-Republican","Annapolis, MD",1914-1915,"St. John's College owns the rights to this publication.",text,pdf,,,,,English,,,,,,,,,,"98 pages",,,,,,,,,,paper,,,,,,,,,,,,,,,,,,,,,,,,,,"Catalog,Catalogue,University of Maryland",https://s3.us-east-1.amazonaws.com/sjcdigitalarchives/original/ed037f4d479ce86761fdce65978cb28c.pdf,Text,"College Catalogs and Statements of the Program",1,0
148,https://digitalarchives.sjc.edu/items/show/148,"Catalogue of St. John's College Annapolis, Maryland for the Academic Year, 1915-1916 And Prospectus, 1916-1917","College catalog for the years 1915-1916","St. John's College","Press of the Advertiser-Republican","Annapolis, MD",1915-1916,"St. John's College owns the rights to this publication.",text,pdf,,,,,English,,,,,,,,,,"102 pages",,,,,,,,,,paper,,,,,,,,,,,,,,,,,,,,,,,,,,"Catalog,Catalogue,University of Maryland",https://s3.us-east-1.amazonaws.com/sjcdigitalarchives/original/8e226e5cb7eb2840a0265565cc77b01d.pdf,Text,"College Catalogs and Statements of the Program",1,0
149,https://digitalarchives.sjc.edu/items/show/149,"Catalogue of St. John's College Annapolis, Maryland for the Academic Year, 1916-1917 And Prospectus, 1917-1918","College catalog for the years 1916-1917","St. John's College","Press of the Advertiser-Republican","Annapolis, MD",1916-1917,"St. John's College owns the rights to this publication.",text,pdf,,,,,English,,,,,,,,,,"103 pages",,,,,,,,,,paper,,,,,,,,,,,,,,,,,,,,,,,,,,"Catalog,Catalogue,University of Maryland",https://s3.us-east-1.amazonaws.com/sjcdigitalarchives/original/87d03170c511eb4ea96f6bceb6c90351.pdf,Text,"College Catalogs and Statements of the Program",1,0
150,https://digitalarchives.sjc.edu/items/show/150,"Catalogue of St. John's College Annapolis, Maryland for the Academic Year, 1917-1918 And Prospectus, 1918-1919","College catalog for the years 1917-1918","St. John's College","Annapolis Publishing Company","Annapolis, MD",1917-1918,"St. John's College owns the rights to this publication.",text,pdf,,,,,English,,,,,,,,,,"120 pages",,,,,,,,,,paper,,,,,,,,,,,,,,,,,,,,,,,,,,"Catalog,Catalogue,University of Maryland",https://s3.us-east-1.amazonaws.com/sjcdigitalarchives/original/bce9cc72488d7a91868159738c92bce6.pdf,Text,"College Catalogs and Statements of the Program",1,0
151,https://digitalarchives.sjc.edu/items/show/151,"Catalogue of St. John's College Annapolis, Maryland for the Academic Year, 1918-1919 And Prospectus, 1919-1920","College catalog for the years 1918-1919","St. John's College","Annapolis Publishing Company","Annapolis, MD",1918-1919,"St. John's College owns the rights to this publication.",text,pdf,,,,,English,,,,,,,,,,"133 pages",,,,,,,,,,paper,,,,,,,,,,,,,,,,,,,,,,,,,,"Catalog,Catalogue,University of Maryland",https://s3.us-east-1.amazonaws.com/sjcdigitalarchives/original/2ee8173f881d7b8b69ae37a7bebc5019.pdf,Text,"College Catalogs and Statements of the Program",1,0
122,https://digitalarchives.sjc.edu/items/show/122,"Catalogue of St. John's College Annapolis, MD. for the Academic Year 1882-1883 and Prospectus for 1883-1884.","College catalog for the years 1882-1883","St. John's College","William M. Abbott, Printer.","Annapolis, MD",1883,"St. John's College owns the rights to this publication.",text,pdf,,,,,English,,,,,,,,,,"26 pages",,,,,,,,,,paper,,,,,,,,,,,,,,,,,,,,,,,,,,"Catalog,Catalogue",https://s3.us-east-1.amazonaws.com/sjcdigitalarchives/original/93175c0cdf181ae122f617f60dfc40f2.pdf,Text,"College Catalogs and Statements of the Program",1,0
126,https://digitalarchives.sjc.edu/items/show/126,"Catalogue of St. John's College Annapolis, Md. for the Academic Year 1886-1887.  And Prospectus for 1887-1888.","College catalog for the years 1886-1887","St. John's College","Daily and Weekly Republic Steam Press","Annapolis, MD",1887,"St. John's College owns the rights to this publication.",text,pdf,,,,,English,,,,,,,,,,"43 pages",,,,,,,,,,paper,,,,,,,,,,,,,,,,,,,,,,,,,,"Catalog,Catalogue",https://s3.us-east-1.amazonaws.com/sjcdigitalarchives/original/ffcda773da0ce0906bb6ab9d9ac3a86b.pdf,Text,"College Catalogs and Statements of the Program",1,0
127,https://digitalarchives.sjc.edu/items/show/127,"Catalogue of St. John's College Annapolis, Md. for the Academic Year 1887--1888. And Prospectus for 1888-89. ","College catalog for the years 1887-1888","St. John's College","Maryland Republican Steam Press","Annapolis, MD",1888,"St. John's College owns the rights to this publication.",text,pdf,,,,,English,,,,,,,,,,"48 pages",,,,,,,,,,paper,,,,,,,,,,,,,,,,,,,,,,,,,,"Catalog,Catalogue",https://s3.us-east-1.amazonaws.com/sjcdigitalarchives/original/55b33659773afbdc89a40ebe9a715d2c.pdf,Text,"College Catalogs and Statements of the Program",1,0
128,https://digitalarchives.sjc.edu/items/show/128,"Catalogue of St. John's College Annapolis, Md. for the Academic Year 1888--1889. And Prospectus for 1889-90. ","College catalog for the years 1888-1889","St. John's College","Maryland Republican Steam Press","Annapolis, MD",1888-1889,"St. John's College owns the rights to this publication.",text,pdf,,,,,English,,,,,,,,,,"48 pages",,,,,,,,,,paper,,,,,,,,,,,,,,,,,,,,,,,,,,"Catalog,Catalogue",https://s3.us-east-1.amazonaws.com/sjcdigitalarchives/original/2d4f59c42c391bdb55b4967e18b1abe6.pdf,Text,"College Catalogs and Statements of the Program",1,0
