﻿"Item Id","Item URI","Dublin Core:Title","Dublin Core:Description","Dublin Core:Creator","Dublin Core:Publisher","Dublin Core:Coverage","Dublin Core:Date","Dublin Core:Rights","Dublin Core:Type","Dublin Core:Format","Dublin Core:Source","Dublin Core:Subject","Dublin Core:Contributor","Dublin Core:Relation","Dublin Core:Language","Dublin Core:Identifier","Item Type Metadata:Occupation","Item Type Metadata:Participants","Item Type Metadata:Death Date","Item Type Metadata:Birthplace","Item Type Metadata:Birth Date","Item Type Metadata:Interviewer","Item Type Metadata:Biographical Text","Item Type Metadata:Bibliography","Item Type Metadata:Page numeration","Item Type Metadata:Resolution","Item Type Metadata:Identifier","Item Type Metadata:Inventory","Item Type Metadata:URL","Item Type Metadata:Text","Item Type Metadata:Interviewee","Item Type Metadata:Location","Item Type Metadata:Transcription","Item Type Metadata:Local URL","Item Type Metadata:Original Format","Item Type Metadata:Physical Dimensions","Item Type Metadata:Duration","Item Type Metadata:Compression","Item Type Metadata:Producer","Item Type Metadata:Director","Item Type Metadata:Bit Rate/Frequency","Item Type Metadata:Email Body","Item Type Metadata:Event Type","Item Type Metadata:Lesson Plan Text","Item Type Metadata:Materials","Item Type Metadata:Objectives","Item Type Metadata:Standards","Item Type Metadata:Number of Attachments","Item Type Metadata:BCC","Item Type Metadata:CC","Item Type Metadata:To","Item Type Metadata:From","Item Type Metadata:Subject Line","Item Type Metadata:Time Summary","Item Type Metadata:Episode","Item Type Metadata:Season","Item Type Metadata:Episode Type","Item Type Metadata:Explicit","Item Type Metadata:Block","PDF Text:Text",tags,file,itemType,collection,public,featured
207,https://digitalarchives.sjc.edu/items/show/207,"Statement of the St. John's Program 1983-84","College catalog for the years 1983-1984","St. John's College","St. John's College","Annapolis, MD; Santa Fe, NM",1983-1984,"St. John's College owns the rights to this publication.",text,pdf,,,,,English,,,,,,,,,,"80 pages",,,,,,,,,,paper,,,,,,,,,,,,,,,,,,,,,,,,,,"Catalog,Catalogue",https://s3.us-east-1.amazonaws.com/sjcdigitalarchives/original/0c65dc4608586380c9fc41a75a77b225.pdf,Text,"College Catalogs and Statements of the Program",1,0
4149,https://digitalarchives.sjc.edu/items/show/4149,"Graduate Institute in Liberal Education, St. John's College","GI college catalog for summer 1983.","St. John's College","St. John's College","Annapolis, MD; Santa Fe, NM",1983,"St. John's College owns the rights to this publication.",text,pdf,,,,,English,"GI Catalog 1983",,,,,,,,,"ii, 18 pages",,,,,,,,,,paper,,,,,,,,,,,,,,,,,,,,,,,,,,"Catalog,Catalogue,Graduate Institute",https://s3.us-east-1.amazonaws.com/sjcdigitalarchives/original/b542762124e85ddb297b8414f6f17dcd.pdf,Text,"College Catalogs and Statements of the Program",1,0
206,https://digitalarchives.sjc.edu/items/show/206,"Statement of the St. John's Program 1982-83","College catalog for the years 1982-1983","St. John's College","St. John's College","Annapolis, MD; Santa Fe, NM",1982-1983,"St. John's College owns the rights to this publication.",text,pdf,,,,,English,,,,,,,,,,"80 pages",,,,,,,,,,paper,,,,,,,,,,,,,,,,,,,,,,,,,,"Catalog,Catalogue",https://s3.us-east-1.amazonaws.com/sjcdigitalarchives/original/f01363abf36513199408fa4460ff40db.pdf,Text,"College Catalogs and Statements of the Program",1,0
4148,https://digitalarchives.sjc.edu/items/show/4148,"Graduate Institute in Liberal Education, St. John's College","GI college catalog for summer 1982.","St. John's College","St. John's College","Annapolis, MD; Santa Fe, NM",1982,"St. John's College owns the rights to this publication.",text,pdf,,,,,English,"GI Catalog 1982",,,,,,,,,"ii, 18 pages",,,,,,,,,,paper,,,,,,,,,,,,,,,,,,,,,,,,,,"Catalog,Catalogue,Graduate Institute",https://s3.us-east-1.amazonaws.com/sjcdigitalarchives/original/73afa0678e0f093b83984c9374152d8a.pdf,Text,"College Catalogs and Statements of the Program",1,0
205,https://digitalarchives.sjc.edu/items/show/205,"[Statement of the St. John's Program 1981-82]","College catalog for the years 1981-1982","St. John's College","St. John's College","Annapolis, MD; Santa Fe, NM",1981-1982,"St. John's College owns the rights to this publication.",text,pdf,,,,,English,,,,,,,,,,"80 pages",,,,,,,,,,paper,,,,,,,,,,,,,,,,,,,,,,,,,,"Catalog,Catalogue",https://s3.us-east-1.amazonaws.com/sjcdigitalarchives/original/38359d7aaf8689df0bb49909c27660eb.pdf,Text,"College Catalogs and Statements of the Program",1,0
204,https://digitalarchives.sjc.edu/items/show/204,"Statement of the St. John's Program 1979-81","College catalog for the years 1979-1981","St. John's College","St. John's College","Annapolis, MD; Santa Fe, NM",1979-1981,"St. John's College owns the rights to this publication.",text,pdf,,,,,English,,,,,,,,,,"80 pages",,,,,,,,,,paper,,,,,,,,,,,,,,,,,,,,,,,,,,"Catalog,Catalogue",https://s3.us-east-1.amazonaws.com/sjcdigitalarchives/original/b6cc90f34e8c4118f29c4286d4f36775.pdf,Text,"College Catalogs and Statements of the Program",1,0
203,https://digitalarchives.sjc.edu/items/show/203,"Statement of the St. John's Program 1978-79","College catalog for the years 1978-1979","St. John's College","St. John's College","Annapolis, MD; Santa Fe, NM",1978-1979,"St. John's College owns the rights to this publication.",text,pdf,,,,,English,,,,,,,,,,"80 pages",,,,,,,,,,paper,,,,,,,,,,,,,,,,,,,,,,,,,,"Catalog,Catalogue",https://s3.us-east-1.amazonaws.com/sjcdigitalarchives/original/2a687757ba8cdec7384ebf70834c902f.pdf,Text,"College Catalogs and Statements of the Program",1,0
4147,https://digitalarchives.sjc.edu/items/show/4147,"Graduate Institute in Liberal Education, St. John's College Santa Fe, New Mexico and Annapolis, Maryland 1978","GI college catalog for summer 1978.","St. John's College","St. John's College","Annapolis, MD; Santa Fe, NM",1978,"St. John's College owns the rights to this publication.",text,pdf,,,,,English,"GI Catalog 1978",,,,,,,,,"12 pages",,,,,,,,,,paper,,,,,,,,,,,,,,,,,,,,,,,,,,"Catalog,Catalogue,Graduate Institute",https://s3.us-east-1.amazonaws.com/sjcdigitalarchives/original/7c86d0b396b002cc444b0c9eca156944.pdf,Text,"College Catalogs and Statements of the Program",1,0
202,https://digitalarchives.sjc.edu/items/show/202,"Statement of the St. John's Program 1977-78","College catalog for the years 1977-1978","St. John's College","St. John's College","Annapolis, MD; Santa Fe, NM",1977-1978,"St. John's College owns the rights to this publication.",text,pdf,,,,,English,,,,,,,,,,"80 pages",,,,,,,,,,paper,,,,,,,,,,,,,,,,,,,,,,,,,,"Catalog,Catalogue",https://s3.us-east-1.amazonaws.com/sjcdigitalarchives/original/36000593254b95f086d0cf1ab5490348.pdf,Text,"College Catalogs and Statements of the Program",1,0
201,https://digitalarchives.sjc.edu/items/show/201,"Statement of the St. John's Program 1976-77","College catalog for the years 1976-1977","St. John's College","St. John's College","Annapolis, MD; Santa Fe, NM",1976-1977,"St. John's College owns the rights to this publication.",text,pdf,,,,,English,,,,,,,,,,"80 pages",,,,,,,,,,paper,,,,,,,,,,,,,,,,,,,,,,,,,,"Catalog,Catalogue",https://s3.us-east-1.amazonaws.com/sjcdigitalarchives/original/0cded15d7619cfcad8945bae33fcfc12.pdf,Text,"College Catalogs and Statements of the Program",1,0
4146,https://digitalarchives.sjc.edu/items/show/4146,"Graduate Institute in Liberal Education, St. John's College Santa Fe, New Mexico 1976","GI college catalog for summer 1976.","St. John's College","St. John's College","Santa Fe, NM",1976,"St. John's College owns the rights to this publication.",text,pdf,,,,,English,"GI Catalog 1976",,,,,,,,,"18 pages",,,,,,,,,,paper,,,,,,,,,,,,,,,,,,,,,,,,,,"Catalog,Catalogue,Graduate Institute",https://s3.us-east-1.amazonaws.com/sjcdigitalarchives/original/7b3c5c46bb2327faaddcc4b96935edef.pdf,Text,"College Catalogs and Statements of the Program",1,0
200,https://digitalarchives.sjc.edu/items/show/200,"Statement of the St. John's Program 1975-76","College catalog for the years 1975-1976","St. John's College","St. John's College","Annapolis, MD",1975-1976,"St. John's College owns the rights to this publication.",text,pdf,,,,,English,,,,,,,,,,"70 pages",,,,,,,,,,paper,,,,,,,,,,,,,,,,,,,,,,,,,,"Catalog,Catalogue",https://s3.us-east-1.amazonaws.com/sjcdigitalarchives/original/dea9b759757b4d872752156ef74a8585.pdf,Text,"College Catalogs and Statements of the Program",1,0
4145,https://digitalarchives.sjc.edu/items/show/4145,"Graduate Institute in Liberal Education, St. John's College, Santa Fe, New Mexico 1975","GI college catalog for summer 1975.","St. John's College","St. John's College","Santa Fe, NM",1975,"St. John's College owns the rights to this publication.",text,pdf,,,,,English,"GI Catalog 1975",,,,,,,,,"20 pages",,,,,,,,,,paper,,,,,,,,,,,,,,,,,,,,,,,,,,"Catalog,Catalogue,Graduate Institute",https://s3.us-east-1.amazonaws.com/sjcdigitalarchives/original/c98f8901cfda66cdf6693f39fb4e55e3.pdf,Text,"College Catalogs and Statements of the Program",1,0
199,https://digitalarchives.sjc.edu/items/show/199,"Statement of the St. John's Program 1974-75","College catalog for the years 1974-1975","St. John's College","St. John's College","Annapolis, MD; Santa Fe, NM",1974-1975,"St. John's College owns the rights to this publication.",text,pdf,,,,,English,,,,,,,,,,"70 pages",,,,,,,,,,paper,,,,,,,,,,,,,,,,,,,,,,,,,,"Catalog,Catalogue",https://s3.us-east-1.amazonaws.com/sjcdigitalarchives/original/0c17c549a3395782efeaf776ecd774e8.pdf,Text,"College Catalogs and Statements of the Program",1,0
4144,https://digitalarchives.sjc.edu/items/show/4144,"Graduate Institute in Liberal Education, St. John's College, Santa Fe, New Mexico 1974","GI college catalog for summer 1974.","St. John's College","St. John's College","Santa Fe, NM",1974,"St. John's College owns the rights to this publication.",text,pdf,,,,,English,"GI Catalog 1974",,,,,,,,,"18 pages",,,,,,,,,,paper,,,,,,,,,,,,,,,,,,,,,,,,,,"Catalog,Catalogue,Graduate Institute",https://s3.us-east-1.amazonaws.com/sjcdigitalarchives/original/f0801b20030ac14ce704ae16e91be19d.pdf,Text,"College Catalogs and Statements of the Program",1,0
198,https://digitalarchives.sjc.edu/items/show/198,"Statement of the St. John's Program 1973-74","College catalog for the years 1973-1974","St. John's College","St. John's College","Annapolis, MD; Santa Fe, NM",1973-1974,"St. John's College owns the rights to this publication.",text,pdf,,,,,English,,,,,,,,,,"69 pages",,,,,,,,,,paper,,,,,,,,,,,,,,,,,,,,,,,,,,"Catalog,Catalogue",https://s3.us-east-1.amazonaws.com/sjcdigitalarchives/original/c0d52062eac0524a1afd15be13fc74c1.pdf,Text,"College Catalogs and Statements of the Program",1,0
4143,https://digitalarchives.sjc.edu/items/show/4143,"Graduate Institute in Liberal Education, St. John's College in Santa Fe 1973","GI college catalog for summer 1973.","St. John's College","St. John's College","Santa Fe, NM",1973,"St. John's College owns the rights to this publication.",text,pdf,,,,,English,"GI Catalog 1973",,,,,,,,,"13 pages",,,,,,,,,,paper,,,,,,,,,,,,,,,,,,,,,,,,,,"Catalog,Catalogue,Graduate Institute",https://s3.us-east-1.amazonaws.com/sjcdigitalarchives/original/79e14c85b1ce74645cc7794afbe3d551.pdf,Text,"College Catalogs and Statements of the Program",1,0
197,https://digitalarchives.sjc.edu/items/show/197,"Statement of the St. John's Program [1972-1973]","College catalog for the years 1972-1973","St. John's College","St. John's College","Annapolis, MD; Santa Fe, NM",1972-1973,"St. John's College owns the rights to this publication.",text,pdf,,,,,English,,,,,,,,,,"72 pages",,,,,,,,,,paper,,,,,,,,,,,,,,,,,,,,,,,,,,"Catalog,Catalogue",https://s3.us-east-1.amazonaws.com/sjcdigitalarchives/original/6b291f71d459da57fad235b4756810aa.pdf,Text,"College Catalogs and Statements of the Program",1,0
4142,https://digitalarchives.sjc.edu/items/show/4142,"Graduate Institute in Liberal Education, St. John's College Santa Fe, New Mexico 1972","GI college catalog for summer 1972.","St. John's College","St. John's College","Santa Fe, NM",1972,"St. John's College owns the rights to this publication.",text,pdf,,,,,English,"GI Catalog 1972",,,,,,,,,"13 pages",,,,,,,,,,paper,,,,,,,,,,,,,,,,,,,,,,,,,,"Catalog,Catalogue,Graduate Institute",https://s3.us-east-1.amazonaws.com/sjcdigitalarchives/original/8848b5744855ecbadd062439cd22ab91.pdf,Text,"College Catalogs and Statements of the Program",1,0
4141,https://digitalarchives.sjc.edu/items/show/4141,"Graduate Institute in Liberal Education, St. John's College in Santa Fe 1971","GI college catalog for summer 1971.","St. John's College","St. John's College","Santa Fe, NM",1971,"St. John's College owns the rights to this publication.",text,pdf,,,,,English,"GI Catalog 1971",,,,,,,,,"16 pages",,,,,,,,,,paper,,,,,,,,,,,,,,,,,,,,,,,,,,"Catalog,Catalogue,Graduate Institute",https://s3.us-east-1.amazonaws.com/sjcdigitalarchives/original/e53587d486a1a6db45145bd8acef35e0.pdf,Text,"College Catalogs and Statements of the Program",1,0
