﻿"Item Id","Item URI","Dublin Core:Title","Dublin Core:Description","Dublin Core:Creator","Dublin Core:Publisher","Dublin Core:Coverage","Dublin Core:Date","Dublin Core:Rights","Dublin Core:Type","Dublin Core:Format","Dublin Core:Source","Dublin Core:Subject","Dublin Core:Contributor","Dublin Core:Relation","Dublin Core:Language","Dublin Core:Identifier","Item Type Metadata:Occupation","Item Type Metadata:Participants","Item Type Metadata:Death Date","Item Type Metadata:Birthplace","Item Type Metadata:Birth Date","Item Type Metadata:Interviewer","Item Type Metadata:Biographical Text","Item Type Metadata:Bibliography","Item Type Metadata:Page numeration","Item Type Metadata:Resolution","Item Type Metadata:Identifier","Item Type Metadata:Inventory","Item Type Metadata:URL","Item Type Metadata:Text","Item Type Metadata:Interviewee","Item Type Metadata:Location","Item Type Metadata:Transcription","Item Type Metadata:Local URL","Item Type Metadata:Original Format","Item Type Metadata:Physical Dimensions","Item Type Metadata:Duration","Item Type Metadata:Compression","Item Type Metadata:Producer","Item Type Metadata:Director","Item Type Metadata:Bit Rate/Frequency","Item Type Metadata:Email Body","Item Type Metadata:Event Type","Item Type Metadata:Lesson Plan Text","Item Type Metadata:Materials","Item Type Metadata:Objectives","Item Type Metadata:Standards","Item Type Metadata:Number of Attachments","Item Type Metadata:BCC","Item Type Metadata:CC","Item Type Metadata:To","Item Type Metadata:From","Item Type Metadata:Subject Line","Item Type Metadata:Time Summary","Item Type Metadata:Episode","Item Type Metadata:Season","Item Type Metadata:Episode Type","Item Type Metadata:Explicit","Item Type Metadata:Block","PDF Text:Text",tags,file,itemType,collection,public,featured
4624,https://digitalarchives.sjc.edu/items/show/4624,"Jacob Klein, in Academic Robe, Speaking at Podium during Commencement under the Liberty Tree, St. John's College, Annapolis, Maryland, June 9, 1947","1 photographic print : b&w",Unknown,,"Annapolis, MD",1974-06-09,"St. John's College owns the rights to this photograph.","Still Image",jpeg,,"Commencement (St. John's College, Annapolis, MD). ;  St. John's College (Annapolis, Md.). -- Deans ;  St. John's College (Annapolis, Md.). -- Faculty. ;  Baccalaureate addresses ;  Klein, Jacob, 1899-1978.",,,,SJC-P-0645,,,,,,,,,,,,,,,,,,,Photograph,"17.5 x 13 cm.",,,,,,,,,,,,,,,,,,,,,,,,,"Commencement,Deans,Honorary Alumni,Tutors",https://s3.us-east-1.amazonaws.com/sjcdigitalarchives/original/25d71db3b3bd4c9f7027f760e21075f2.jpg,"Still Image","Photographic Archive—Annapolis",1,0
4620,https://digitalarchives.sjc.edu/items/show/4620,"Jacob Klein, in Academic Robe, Speaking at Podium during Commencement under the Liberty Tree, St. John's College, Annapolis, Maryland, June 9, 1947","1 photographic print : b&w",Unknown,,"Annapolis, MD",1947-06-09,"St. John's College owns the rights to this photograph.","Still Image",jpeg,,"Commencement (St. John's College, Annapolis, MD). ;  St. John's College (Annapolis, Md.). -- Deans ;  St. John's College (Annapolis, Md.). -- Faculty. ;  Baccalaureate addresses ;  Klein, Jacob, 1899-1978.",,,,SJC-P-0640,,,,,,,,,,,,,,,,,,,Photograph,"17.5 x 13 cm.",,,,,,,,,,,,,,,,,,,,,,,,,"Commencement,Deans,Honorary Alumni,Tutors",https://s3.us-east-1.amazonaws.com/sjcdigitalarchives/original/369ba867d34d24e45451bdde64ca1161.jpg,"Still Image","Photographic Archive—Annapolis",1,0
1707,https://digitalarchives.sjc.edu/items/show/1707,"Richard D. Weigle Giving Commencement Address at Colorado College Commencement, Colorado Springs, Colorado, June 3, 1969","1 photographic print : b&w",Knutson-Bowers,,"Colorado Springs, CO",1969-06-03,"St. John's College owns the rights to this photograph.","still image",jpeg,,"Commencement (Colorado College, Colorado Springs, CO) ;  St. John's College (Annapolis, Md.). -- Presidents. ;  St. John's College (Santa Fe, N. M.). -- Presidents. ;  Baccalaureate addresses; Weigle, Richard Daniel 1912-",,,,SJC-P-0150,,,,,,,,,,,,,,,,,,,photograph,"13 x 18 cm.",,,,,,,,,,,,,,,,,,,,,,,,,"Honorary Alumni,Presidents",https://s3.us-east-1.amazonaws.com/sjcdigitalarchives/original/54cfd09a26b86bb9246f6b2fc4381048.jpg,"Still Image","Photographic Archive—Annapolis",1,0
1706,https://digitalarchives.sjc.edu/items/show/1706,"Richard D. Weigle Giving Commencement Address at Colorado College Commencement, Colorado Springs, Colorado, June 3, 1969","1 photographic print : b&w",Knutson-Bowers,,"Colorado Springs, CO",1969-06-03,"St. John's College owns the rights to this photograph.","still image",jpeg,,"Commencement (Colorado College, Colorado Springs, CO) ;  St. John's College (Annapolis, Md.). -- Presidents. ;  St. John's College (Santa Fe, N. M.). -- Presidents. ;  Baccalaureate addresses; Weigle, Richard Daniel 1912-",,,,SJC-P-0149,,,,,,,,,,,,,,,,,,,photograph,"18 x 13 cm.",,,,,,,,,,,,,,,,,,,,,,,,,"Honorary Alumni,Presidents",https://s3.us-east-1.amazonaws.com/sjcdigitalarchives/original/99b0cc882429083f8afbfa496b701695.jpg,"Still Image","Photographic Archive—Annapolis",1,0
1693,https://digitalarchives.sjc.edu/items/show/1693,"Richard D. Weigle, in Academic Robe, at Podium Speaking","1 photographic print : b&w",Unknown,,"Annapolis, MD","1950-1960 [circa]","St. John's College owns the rights to this photograph.","still image",jpeg,,"St. John's College (Annapolis, Md.). -- Presidents. ;  St. John's College (Santa Fe, N. M.). -- Presidents. ;  Baccalaureate addresses; Weigle, Richard Daniel 1912-",,,,SJC-P-0135,,,,,,,,,,,,,,,,,,,photograph,"11.5 x 17 cm.",,,,,,,,,,,,,,,,,,,,,,,,,"Honorary Alumni,Presidents",https://s3.us-east-1.amazonaws.com/sjcdigitalarchives/original/b2125bf2893230b7f10902212ef0d39e.jpg,"Still Image","Photographic Archive—Annapolis",1,0
1037,https://digitalarchives.sjc.edu/items/show/1037,"Richard D. Weigle and Speaker at the Fund for the 1980's Kick Off Dinner","1 photographic print : b&w","Wagner International Photos Inc.",,"Annapolis, MD","1977 [circa]","St. John's College owns the rights to this photograph.","still image",jpeg,,"St. John's College (Annapolis, Md.). -- Presidents. ;  St. John's College (Santa Fe, N. M.). -- Presidents. ;  Baccalaureate addresses; Weigle, Richard Daniel, 1912-",,,,SJC-P-0102,,,,,,,,,,,,,,,,,,,photograph,"23.5 x 16 cm",,,,,,,,,,,,,,,,,,,,,,,,,"Honorary Alumni,Presidents",https://s3.us-east-1.amazonaws.com/sjcdigitalarchives/original/a5b0036f0e7cf9197092689906b255ae.jpg,"Still Image","Photographic Archive—Annapolis",1,1
358,https://digitalarchives.sjc.edu/items/show/358,"Curtis A. Wilson, in Academic Robe, Speaking at Podium during Commencement, St. John's College, Annapolis, Maryland","1 photographic print : b&w ",Unknown,,"Annapolis, MD",1977-05,"St. John's College owns the rights to this photograph.","still image",jpeg,,"Commencement (St. John's College, Annapolis, MD) ;  St. John's College (Annapolis, Md.). -- Deans. ;  St. John's College (Annapolis, Md.). -- Faculty. ;  Baccalaureate addresses ;  Wilson, Curtis.",,,,SJC-P-0720,,,,,,,,,,"600 dpi",,,,,,,,,photograph," 18 x 12.5 cm.",,,,,,,,,,,,,,,,,,,,,,,,,"Commencement,Deans,Tutors",https://s3.us-east-1.amazonaws.com/sjcdigitalarchives/original/e30624aa7118b5a9f0c5a3268bceb6f9.jpg,"Still Image","Photographic Archive—Annapolis",1,1
354,https://digitalarchives.sjc.edu/items/show/354,"Burt Thoms Speaking at Commencement under the Liberty Tree, St. John's College, Annapolis, Maryland","1 photographic print : b&w ",Unknown,,"Annapolis, MD","1949-1958 [circa]","St. John's College owns the rights to this photograph.","still image",jpeg,,"Commencement (St. John's College, Annapolis, MD) ;  Baccalaureate addresses ;  Thoms, Burt ;  Klein, Jacob, 1899-1978 ;  Cleveland, Richard F.",,,,SJC-P-0092,,,,,,,,,,"600 dpi",,,,,,,,,photograph," 25.5 x 20.5 cm",,,,,,,,,,,,,,,,,,,,,,,,,"Commencement,Liberty tree",https://s3.us-east-1.amazonaws.com/sjcdigitalarchives/original/de70041b425026adf3cf8581e7f67f62.jpg,"Still Image","Photographic Archive—Annapolis",1,1
69,https://digitalarchives.sjc.edu/items/show/69,"Ceremony and Speech Given in front of the French Monument with Naval Officers and Men in Revolutionary War Military Uniforms, St. John's College, Annapolis, Maryland","1 photographic print : b&w ",Unknown,,"Annapolis, MD","1931 [circa]","St. John's College owns the rights to this photograph.","still image",jpeg,,"French Monument (St. John's College, Annapolis, MD) 1931. ;  St. John's College (Annapolis, Md.). ;  United States. Navy Officers. ;  Baccalaureate addresses",,,,SJC-P-0436,,,,,,,,,,"600 dpi",,,,,,,,,photograph,"12.5 x 20.5 cm.",,,,,,,,,,,,,,,,,,,,,,,,,,https://s3.us-east-1.amazonaws.com/sjcdigitalarchives/original/6d5e15e3a43d784405653d01880b6da6.jpg,"Still Image","Photographic Archive—Annapolis",1,1
