﻿"Item Id","Item URI","Dublin Core:Title","Dublin Core:Description","Dublin Core:Creator","Dublin Core:Publisher","Dublin Core:Coverage","Dublin Core:Date","Dublin Core:Rights","Dublin Core:Type","Dublin Core:Format","Dublin Core:Source","Dublin Core:Subject","Dublin Core:Contributor","Dublin Core:Relation","Dublin Core:Language","Dublin Core:Identifier","Item Type Metadata:Occupation","Item Type Metadata:Participants","Item Type Metadata:Death Date","Item Type Metadata:Birthplace","Item Type Metadata:Birth Date","Item Type Metadata:Interviewer","Item Type Metadata:Biographical Text","Item Type Metadata:Bibliography","Item Type Metadata:Page numeration","Item Type Metadata:Resolution","Item Type Metadata:Identifier","Item Type Metadata:Inventory","Item Type Metadata:URL","Item Type Metadata:Text","Item Type Metadata:Interviewee","Item Type Metadata:Location","Item Type Metadata:Transcription","Item Type Metadata:Local URL","Item Type Metadata:Original Format","Item Type Metadata:Physical Dimensions","Item Type Metadata:Duration","Item Type Metadata:Compression","Item Type Metadata:Producer","Item Type Metadata:Director","Item Type Metadata:Bit Rate/Frequency","Item Type Metadata:Email Body","Item Type Metadata:Event Type","Item Type Metadata:Lesson Plan Text","Item Type Metadata:Materials","Item Type Metadata:Objectives","Item Type Metadata:Standards","Item Type Metadata:Number of Attachments","Item Type Metadata:BCC","Item Type Metadata:CC","Item Type Metadata:To","Item Type Metadata:From","Item Type Metadata:Subject Line","Item Type Metadata:Time Summary","Item Type Metadata:Episode","Item Type Metadata:Season","Item Type Metadata:Episode Type","Item Type Metadata:Explicit","Item Type Metadata:Block","PDF Text:Text",tags,file,itemType,collection,public,featured
5755,https://digitalarchives.sjc.edu/items/show/5755,"Stringfellow Barr Seated at his Home in Hilltop, New Jersey","1 photocopy sheet : 12 proof prints from 50mm film : b&w",Unknown,,"Annapolis, MD",1969,"St. John's College owns the rights to this photograph.","Still Image",jpeg,,"Barr, Stringfellow, 1897-",,,,SJC-P-1832,,,,,,,,,,,,,,,,,,,Photograph,"21.5 x 27 cm.",,,,,,,,,,,,,,,,,,,,,,,,,"Honorary Alumni,Presidents",https://s3.us-east-1.amazonaws.com/sjcdigitalarchives/original/9c0448a6fc427fc3b68f549aff04e3b7.jpg,"Still Image","Photographic Archive—Annapolis",1,0
5754,https://digitalarchives.sjc.edu/items/show/5754,"Portraits of Stringfellow Barr","1 photocopy print : b&w",Unknown,,"Annapolis, MD",,"St. John's College owns the rights to this photograph.","Still Image",jpeg,,"Barr, Stringfellow, 1897-",,,,SJC-P-1831,,,,,,,,,,,,,,,,,,,Photograph,"21.5 x 27 cm.",,,,,,,,,,,,,,,,,,,,,,,,,"Honorary Alumni,Presidents",https://s3.us-east-1.amazonaws.com/sjcdigitalarchives/original/bf943229da8d75b99f3d6f1f334d7976.jpg,"Still Image","Photographic Archive—Annapolis",1,0
5753,https://digitalarchives.sjc.edu/items/show/5753,"Portrait of Stringfellow Barr","1 photocopy print : b&w",Unknown,,"Annapolis, MD","1920 [circa]","St. John's College owns the rights to this photograph.","Still Image",jpeg,,"Barr, Stringfellow, 1897-",,,,SJC-P-1830,,,,,,,,,,,,,,,,,,,Photograph,"21.5 x 27 cm.",,,,,,,,,,,,,,,,,,,,,,,,,"Honorary Alumni,Presidents",https://s3.us-east-1.amazonaws.com/sjcdigitalarchives/original/8343075d4d2a1b43f65c220cd5f77944.jpg,"Still Image","Photographic Archive—Annapolis",1,0
5752,https://digitalarchives.sjc.edu/items/show/5752,"Portraits of Stringfellow Barr","1 photocopy  print : b&w",Unknown,,"Annapolis, MD","1960 [circa]","St. John's College owns the rights to this photograph.","Still Image",jpeg,,"Barr, Stringfellow, 1897-",,,,SJC-P-1829,,,,,,,,,,,,,,,,,,,Photograph,"27 x 21.5 cm.",,,,,,,,,,,,,,,,,,,,,,,,,"Honorary Alumni,Presidents",https://s3.us-east-1.amazonaws.com/sjcdigitalarchives/original/04ff1ac78e6c630cb267cd31395d18f1.jpg,"Still Image","Photographic Archive—Annapolis",1,0
5751,https://digitalarchives.sjc.edu/items/show/5751,"Stringfellow Barr Seated as a Lecturer at the University of Virginia, Charlottesville, Virginia","1 photocopy print : b&w",Unknown,,"Annapolis, MD","1920 [circa]","St. John's College owns the rights to this photograph.","Still Image",jpeg,,"Barr, Stringfellow, 1897-",,,,SJC-P-1828,,,,,,,,,,,,,,,,,,,Photograph,"13.5 x 21.5 cm.",,,,,,,,,,,,,,,,,,,,,,,,,"Honorary Alumni,Presidents",https://s3.us-east-1.amazonaws.com/sjcdigitalarchives/original/587ebafaf9654c4f167d181ac061f828.jpg,"Still Image","Photographic Archive—Annapolis",1,0
5750,https://digitalarchives.sjc.edu/items/show/5750,"Stringfellow Barr Cutting Cake on his 80th Birthday at Woodrow Wilson's Former Home in Princeton, New Jersey","1 photographic print : b&w",Unknown,,"Annapolis, MD","1977 [circa]","St. John's College owns the rights to this photograph.","Still Image",jpeg,,"Barr, Stringfellow, 1897-",,,,SJC-P-1827,,,,,,,,,,,,,,,,,,,Photograph,"17.5 x 13 cm.",,,,,,,,,,,,,,,,,,,,,,,,,"Honorary Alumni,Presidents",https://s3.us-east-1.amazonaws.com/sjcdigitalarchives/original/119b200d122a106df62ed3a7cfe09f91.jpg,"Still Image","Photographic Archive—Annapolis",1,0
5749,https://digitalarchives.sjc.edu/items/show/5749,"Stringfellow Barr and Francis Mason at Woodrow Wilson's Former Home in Princeton, New Jersey","1 photographic print : b&w",Unknown,,"Annapolis, MD",,"St. John's College owns the rights to this photograph.","Still Image",jpeg,,"Barr, Stringfellow, 1897-;  Mason, Francis",,,,SJC-P-1826,,,,,,,,,,,,,,,,,,,Photograph,"17.5 x 13 cm.",,,,,,,,,,,,,,,,,,,,,,,,,"Honorary Alumni,Presidents",https://s3.us-east-1.amazonaws.com/sjcdigitalarchives/original/32618b6f288b68b7e606cd74d2d084bb.jpg,"Still Image","Photographic Archive—Annapolis",1,0
5748,https://digitalarchives.sjc.edu/items/show/5748,"Portrait of Stringfellow Barr at the 1974 Reunion for the Class of 1949, Annapolis, Maryland","1 photographic print : color",Unknown,,"Annapolis, MD",1974,"St. John's College owns the rights to this photograph.","Still Image",jpeg,,"Barr, Stringfellow, 1897- ;  St. John's College (Annapolis, Md.). -- Presidents. ;  Portraits.",,,,SJC-P-1825,,,,,,,,,,,,,,,,,,,Photograph,"13 x 17.5 cm.",,,,,,,,,,,,,,,,,,,,,,,,,"Honorary Alumni,Presidents",https://s3.us-east-1.amazonaws.com/sjcdigitalarchives/original/1129db6faa2aeddc9e29c44ecd58f8e0.jpg,"Still Image","Photographic Archive—Annapolis",1,0
5745,https://digitalarchives.sjc.edu/items/show/5745,"Painted Portrait of Stringfellow Barr with Blue Striped Tie","1 Polaroid print : color",Unknown,,"Annapolis, MD",,"St. John's College owns the rights to this photograph.","Still Image",jpeg,,"Barr, Stringfellow, 1897- ;  St. John's College (Annapolis, Md.). -- Presidents. ;  Portraits.",,,,SJC-P-1822,,,,,,,,,,,,,,,,,,,Photograph,"9 x 10.5 cm.",,,,,,,,,,,,,,,,,,,,,,,,,"Honorary Alumni,Presidents",https://s3.us-east-1.amazonaws.com/sjcdigitalarchives/original/ab529dd2ad81ed0345c64c81a68c4664.jpg,"Still Image","Photographic Archive—Annapolis",1,0
5744,https://digitalarchives.sjc.edu/items/show/5744,"Painted Portrait of Stringfellow Barr with Red Tie","1 Polaroid print : color",Unknown,,"Annapolis, MD",,"St. John's College owns the rights to this photograph.","Still Image",jpeg,,"Barr, Stringfellow, 1897- ;  St. John's College (Annapolis, Md.). -- Presidents. ;  Portraits.",,,,SJC-P-1821,,,,,,,,,,,,,,,,,,,Photograph,"9 x 10.5 cm.",,,,,,,,,,,,,,,,,,,,,,,,,"Honorary Alumni,Presidents",https://s3.us-east-1.amazonaws.com/sjcdigitalarchives/original/3066a868b5db566625b2448ad0055e9b.jpg,"Still Image","Photographic Archive—Annapolis",1,0
5747,https://digitalarchives.sjc.edu/items/show/5747,"Stringfellow Barr Seated in his Living Room in in Hilltop, Kingston, New Jersey","1 photographic print : color","Hoffman, Allan",,"Annapolis, MD","1974 [circa]","St. John's College owns the rights to this photograph.","Still Image",jpeg,,"Barr, Stringfellow, 1897-",,,,SJC-P-1824,,,,,,,,,,,,,,,,,,,Photograph,"17.5 x 13 cm.",,,,,,,,,,,,,,,,,,,,,,,,,"Honorary Alumni,Presidents",https://s3.us-east-1.amazonaws.com/sjcdigitalarchives/original/713c5dafcd848059a3fe376ac1906c86.jpg,"Still Image","Photographic Archive—Annapolis",1,0
5737,https://digitalarchives.sjc.edu/items/show/5737,"Stringfellow Barr Seated in the Goodwin House, Alexandria, VA","1 photographic print : color","Hoffman, Allan",,"Annapolis, MD","1974 [circa]","St. John's College owns the rights to this photograph.","Still Image",jpeg,,"Barr, Stringfellow, 1897- ;  St. John's College (Annapolis, Md.). -- Presidents. ;  Portraits.",,,,SJC-P-1814,,,,,,,,,,,,,,,,,,,Photograph,"9 x 10.5 cm.",,,,,,,,,,,,,,,,,,,,,,,,,"Honorary Alumni,Presidents",https://s3.us-east-1.amazonaws.com/sjcdigitalarchives/original/5c99746541863fbac92ae538e0d2b90a.jpg,"Still Image","Photographic Archive—Annapolis",1,0
5736,https://digitalarchives.sjc.edu/items/show/5736,"Stringfellow Barr Seated in the Goodwin House, Alexandria, VA","1 photographic print : color","Hoffman, Allan",,"Annapolis, MD","1974 [circa]","St. John's College owns the rights to this photograph.","Still Image",jpeg,,"Barr, Stringfellow, 1897- ;  St. John's College (Annapolis, Md.). -- Presidents. ;  Portraits.",,,,SJC-P-1813,,,,,,,,,,,,,,,,,,,Photograph,"9 x 10.5 cm.",,,,,,,,,,,,,,,,,,,,,,,,,"Honorary Alumni,Presidents",https://s3.us-east-1.amazonaws.com/sjcdigitalarchives/original/bae79aa6d28650b2b8a772a7c1f25b7a.jpg,"Still Image","Photographic Archive—Annapolis",1,0
5735,https://digitalarchives.sjc.edu/items/show/5735,"Stringfellow Barr Seated in Lawn Chair","1 photographic print : color","Hoffman, Allan",,"Annapolis, MD","1974 [circa]","St. John's College owns the rights to this photograph.","Still Image",jpeg,,"Barr, Stringfellow, 1897- ;  St. John's College (Annapolis, Md.). -- Presidents. ;  Portraits.",,,,SJC-P-1812,,,,,,,,,,,,,,,,,,,Photograph,"8.5 x 10.5 cm.",,,,,,,,,,,,,,,,,,,,,,,,,"Honorary Alumni,Presidents",https://s3.us-east-1.amazonaws.com/sjcdigitalarchives/original/6df06015352a24a37f25d440c5deaa2d.jpg,"Still Image","Photographic Archive—Annapolis",1,0
5248,https://digitalarchives.sjc.edu/items/show/5248,"Stringfellow Barr, Seated, with John Kieffer Standing Behind him after  Barr's Lecture ""The Beginning of the St. John's Program"" in the King William Room, Annapolis, Maryland","1 photographic print : b&w","Fox, Cecil H.",,"Annapolis, MD",1972-07,"St. John's College owns the rights to this photograph.","Still Image",jpeg,,"Barr, Stringfellow, 1897-",,,,SJC-P-1239,,,,,,,,,,,,,,,,,,,Photograph,"25.5 x 20.5 cm.",,,,,,,,,,,,,,,,,,,,,,,,,"Honorary Alumni,Presidents",https://s3.us-east-1.amazonaws.com/sjcdigitalarchives/original/8efd996e44acf2148277ca6d69880cbc.jpg,"Still Image","Photographic Archive—Annapolis",1,0
5247,https://digitalarchives.sjc.edu/items/show/5247,"Robert S. Zelenka Talking with Stringfellow Barr after Stringfellow Barr's Lecture ""The Beginning of the St. John's Program"" in the King William Room, St. John's College, Annapolis, Maryland","1 photographic print : b&w","Fox, Cecil H.",,"Annapolis, MD",1972-07,"St. John's College owns the rights to this photograph.","Still Image",jpeg,,"Barr, Stringfellow, 1897-;  Zelenka, Robert S.",,,,SJC-P-1236,,,,,,,,,,,,,,,,,,,Photograph,"25.5 x 20.5 cm.",,,,,,,,,,,,,,,,,,,,,,,,,,https://s3.us-east-1.amazonaws.com/sjcdigitalarchives/original/843bbff2fa289e991a4f70d9aa33227e.jpg,"Still Image","Photographic Archive—Annapolis",1,0
5246,https://digitalarchives.sjc.edu/items/show/5246,"Robert S. Zelenka Talking with Stringfellow Barr after Stringfellow Barr's Lecture ""The Beginning of the St. John's Program"" in the King William Room, Annapolis, Maryland","1 photographic print : b&w","Fox, Cecil H.",,"Annapolis, MD",1972-07,"St. John's College owns the rights to this photograph.","Still Image",jpeg,,"Barr, Stringfellow, 1897-;  Zelenka, Robert S.",,,,SJC-P-1235,,,,,,,,,,,,,,,,,,,Photograph,"25.5 x 20.5 cm.",,,,,,,,,,,,,,,,,,,,,,,,,,https://s3.us-east-1.amazonaws.com/sjcdigitalarchives/original/a6fd362c834dd8780859f61d19118927.jpg,"Still Image","Photographic Archive—Annapolis",1,0
5245,https://digitalarchives.sjc.edu/items/show/5245,"Robert S. Zelenka Talking with Stringfellow Barr after Stringfellow Barr's Lecture ""The Beginning of the St. John's Program"" in the King William Room, Annapolis, Maryland","1 photographic print : b&w","Fox, Cecil H.",,"Annapolis, MD",1972-07,"St. John's College owns the rights to this photograph.","Still Image",jpeg,,"Barr, Stringfellow, 1897-;  Zelenka, Robert S.",,,,SJC-P-1234,,,,,,,,,,,,,,,,,,,Photograph,"20.5 x 25.5 cm.",,,,,,,,,,,,,,,,,,,,,,,,,,https://s3.us-east-1.amazonaws.com/sjcdigitalarchives/original/a7c788941bdc6010e9b7e39527e8390a.jpg,"Still Image","Photographic Archive—Annapolis",1,0
5244,https://digitalarchives.sjc.edu/items/show/5244,"Stringfellow Barr Speaking during His Lecture ""The Beginning of the St. John's Program"" in the King William Room, Annapolis, Maryland","1 photographic print : b&w","Fox, Cecil H.",,"Annapolis, MD",1972-07,"St. John's College owns the rights to this photograph.","Still Image",jpeg,,"Barr, Stringfellow, 1897-",,,,SJC-P-1233,,,,,,,,,,,,,,,,,,,Photograph,"25.5 x 20.5 cm.",,,,,,,,,,,,,,,,,,,,,,,,,"Honorary Alumni,Presidents",https://s3.us-east-1.amazonaws.com/sjcdigitalarchives/original/47b1b38839b62955a9b3121d5d5ea737.jpg,"Still Image","Photographic Archive—Annapolis",1,0
5243,https://digitalarchives.sjc.edu/items/show/5243,"Stringfellow Barr Speaking during His Lecture ""The Beginning of the St. John's Program"" in the King William Room, Annapolis, Maryland",,"Fox, Cecil H.",,"Annapolis, MD",1972-07,"St. John's College owns the rights to this photograph.","Still Image",jpeg,,"Barr, Stringfellow, 1897-",,,,SJC-P-1232,,,,,,,,,,,,,,,,,,,Photograph,"25.5 x 20.5 cm.",,,,,,,,,,,,,,,,,,,,,,,,,"Honorary Alumni,Presidents",https://s3.us-east-1.amazonaws.com/sjcdigitalarchives/original/ccd1b0fdd78e616cabd7d58c68f8de82.jpg,"Still Image","Photographic Archive—Annapolis",1,0
