﻿"Item Id","Item URI","Dublin Core:Title","Dublin Core:Description","Dublin Core:Creator","Dublin Core:Publisher","Dublin Core:Coverage","Dublin Core:Date","Dublin Core:Rights","Dublin Core:Type","Dublin Core:Format","Dublin Core:Source","Dublin Core:Subject","Dublin Core:Contributor","Dublin Core:Relation","Dublin Core:Language","Dublin Core:Identifier","Item Type Metadata:Occupation","Item Type Metadata:Participants","Item Type Metadata:Death Date","Item Type Metadata:Birthplace","Item Type Metadata:Birth Date","Item Type Metadata:Interviewer","Item Type Metadata:Biographical Text","Item Type Metadata:Bibliography","Item Type Metadata:Page numeration","Item Type Metadata:Resolution","Item Type Metadata:Identifier","Item Type Metadata:Inventory","Item Type Metadata:URL","Item Type Metadata:Text","Item Type Metadata:Interviewee","Item Type Metadata:Location","Item Type Metadata:Transcription","Item Type Metadata:Local URL","Item Type Metadata:Original Format","Item Type Metadata:Physical Dimensions","Item Type Metadata:Duration","Item Type Metadata:Compression","Item Type Metadata:Producer","Item Type Metadata:Director","Item Type Metadata:Bit Rate/Frequency","Item Type Metadata:Email Body","Item Type Metadata:Event Type","Item Type Metadata:Lesson Plan Text","Item Type Metadata:Materials","Item Type Metadata:Objectives","Item Type Metadata:Standards","Item Type Metadata:Number of Attachments","Item Type Metadata:BCC","Item Type Metadata:CC","Item Type Metadata:To","Item Type Metadata:From","Item Type Metadata:Subject Line","Item Type Metadata:Time Summary","Item Type Metadata:Episode","Item Type Metadata:Season","Item Type Metadata:Episode Type","Item Type Metadata:Explicit","Item Type Metadata:Block","PDF Text:Text",tags,file,itemType,collection,public,featured
148,https://digitalarchives.sjc.edu/items/show/148,"Catalogue of St. John's College Annapolis, Maryland for the Academic Year, 1915-1916 And Prospectus, 1916-1917","College catalog for the years 1915-1916","St. John's College","Press of the Advertiser-Republican","Annapolis, MD",1915-1916,"St. John's College owns the rights to this publication.",text,pdf,,,,,English,,,,,,,,,,"102 pages",,,,,,,,,,paper,,,,,,,,,,,,,,,,,,,,,,,,,,"Catalog,Catalogue,University of Maryland",https://s3.us-east-1.amazonaws.com/sjcdigitalarchives/original/8e226e5cb7eb2840a0265565cc77b01d.pdf,Text,"College Catalogs and Statements of the Program",1,0
149,https://digitalarchives.sjc.edu/items/show/149,"Catalogue of St. John's College Annapolis, Maryland for the Academic Year, 1916-1917 And Prospectus, 1917-1918","College catalog for the years 1916-1917","St. John's College","Press of the Advertiser-Republican","Annapolis, MD",1916-1917,"St. John's College owns the rights to this publication.",text,pdf,,,,,English,,,,,,,,,,"103 pages",,,,,,,,,,paper,,,,,,,,,,,,,,,,,,,,,,,,,,"Catalog,Catalogue,University of Maryland",https://s3.us-east-1.amazonaws.com/sjcdigitalarchives/original/87d03170c511eb4ea96f6bceb6c90351.pdf,Text,"College Catalogs and Statements of the Program",1,0
150,https://digitalarchives.sjc.edu/items/show/150,"Catalogue of St. John's College Annapolis, Maryland for the Academic Year, 1917-1918 And Prospectus, 1918-1919","College catalog for the years 1917-1918","St. John's College","Annapolis Publishing Company","Annapolis, MD",1917-1918,"St. John's College owns the rights to this publication.",text,pdf,,,,,English,,,,,,,,,,"120 pages",,,,,,,,,,paper,,,,,,,,,,,,,,,,,,,,,,,,,,"Catalog,Catalogue,University of Maryland",https://s3.us-east-1.amazonaws.com/sjcdigitalarchives/original/bce9cc72488d7a91868159738c92bce6.pdf,Text,"College Catalogs and Statements of the Program",1,0
151,https://digitalarchives.sjc.edu/items/show/151,"Catalogue of St. John's College Annapolis, Maryland for the Academic Year, 1918-1919 And Prospectus, 1919-1920","College catalog for the years 1918-1919","St. John's College","Annapolis Publishing Company","Annapolis, MD",1918-1919,"St. John's College owns the rights to this publication.",text,pdf,,,,,English,,,,,,,,,,"133 pages",,,,,,,,,,paper,,,,,,,,,,,,,,,,,,,,,,,,,,"Catalog,Catalogue,University of Maryland",https://s3.us-east-1.amazonaws.com/sjcdigitalarchives/original/2ee8173f881d7b8b69ae37a7bebc5019.pdf,Text,"College Catalogs and Statements of the Program",1,0
152,https://digitalarchives.sjc.edu/items/show/152,"The Catalogue of St. John's College for the Academic Year, 1920-1921 and Prospectus, 1921-1922","College catalog for the years 1920-1921","St. John's College","The Advertiser","Annapolis, MD",1920-1921,"St. John's College owns the rights to this publication.",text,pdf,,,,,English,,,,,,,,,,"128 pages",,,,,,,,,,paper,,,,,,,,,,,,,,,,,,,,,,,,,,"Catalog,Catalogue",https://s3.us-east-1.amazonaws.com/sjcdigitalarchives/original/de831b175848a8481cbe939151b7ccb0.pdf,Text,"College Catalogs and Statements of the Program",1,0
153,https://digitalarchives.sjc.edu/items/show/153,"The Catalogue of St. John's College for the Academic Year, 1922-1923 and Prospectus, 1923-1924","College catalog for the years 1922-1923","St. John's College","Capital Gazette Press","Annapolis, MD",1922-1923,"St. John's College owns the rights to this publication.",text,pdf,,,,,English,,,,,,,,,,"113 pages",,,,,,,,,,paper,,,,,,,,,,,,,,,,,,,,,,,,,,"Catalog,Catalogue",https://s3.us-east-1.amazonaws.com/sjcdigitalarchives/original/5a48f60978434594ec39938f8ea98bfc.pdf,Text,"College Catalogs and Statements of the Program",1,0
154,https://digitalarchives.sjc.edu/items/show/154,"Catalogue of St. John's College for the Academic Year 1923-1924","College catalog for the years 1923-1924","St. John's College","Capital Gazette Press","Annapolis, MD",1923-1924,"St. John's College owns the rights to this publication.",text,pdf,,,,,English,,,,,,,,,,"59 pages",,,,,,,,,,paper,,,,,,,,,,,,,,,,,,,,,,,,,,"Catalog,Catalogue",https://s3.us-east-1.amazonaws.com/sjcdigitalarchives/original/15c943944f13c0a3fc5d30db7afd712a.pdf,Text,"College Catalogs and Statements of the Program",1,0
155,https://digitalarchives.sjc.edu/items/show/155,"Catalogue of St. John's College 1924-1925","College catalog for the years 1924-1925","St. John's College","Capital Gazette Press","Annapolis, MD",1924-1925,"St. John's College owns the rights to this publication.",text,pdf,,,,,English,,,,,,,,,,,,,,,,,,,,paper,,,,,,,,,,,,,,,,,,,,,,,,,,"Catalog,Catalogue",https://s3.us-east-1.amazonaws.com/sjcdigitalarchives/original/08d72fa8ec79de02078d3faaa1f60f52.pdf,Text,"College Catalogs and Statements of the Program",1,0
156,https://digitalarchives.sjc.edu/items/show/156,"Catalogue of St. John's College 1925-1926","College catalog for the years 1925-1926","St. John's College","Capital-Gazette Press, Inc.","Annapolis, MD",1925-1926,"St. John's College owns the rights to this publication.",text,pdf,,,,,English,,,,,,,,,,"61 pages",,,,,,,,,,paper,,,,,,,,,,,,,,,,,,,,,,,,,,"Catalog,Catalogue",https://s3.us-east-1.amazonaws.com/sjcdigitalarchives/original/7f8d488e0f77cb227f87d3b7e5e7146d.pdf,Text,"College Catalogs and Statements of the Program",1,0
157,https://digitalarchives.sjc.edu/items/show/157,"Catalogue of St. John's College 1926-1927","College catalog for the years 1926-1927","St. John's College","Capital Gazette Press","Annapolis, MD",1926-1927,"St. John's College owns the rights to this publication.",text,pdf,,,,,English,,,,,,,,,,"62 pages",,,,,,,,,,paper,,,,,,,,,,,,,,,,,,,,,,,,,,"Catalog,Catalogue",https://s3.us-east-1.amazonaws.com/sjcdigitalarchives/original/50616da6ada78efb8740ba0a47d61d66.pdf,Text,"College Catalogs and Statements of the Program",1,0
158,https://digitalarchives.sjc.edu/items/show/158,"St. John's College Catalogue 1927-1928","College catalog for the years 1927-1928","St. John's College",,"Annapolis, MD",1927-1928,"St. John's College owns the rights to this publication.",text,pdf,,,,,English,,,,,,,,,,"68 pages",,,,,,,,,,paper,,,,,,,,,,,,,,,,,,,,,,,,,,"Catalog,Catalogue",https://s3.us-east-1.amazonaws.com/sjcdigitalarchives/original/9e1076e912371f730e3135492ae6a449.pdf,Text,"College Catalogs and Statements of the Program",1,0
159,https://digitalarchives.sjc.edu/items/show/159,"St. John's College Catalogue 1928-1929","College catalog for the years 1928-1929","St. John's College",,"Annapolis, MD",1928-1929,"St. John's College owns the rights to this publication.",text,pdf,,,,,English,,,,,,,,,,"80 pages",,,,,,,,,,paper,,,,,,,,,,,,,,,,,,,,,,,,,,"Catalog,Catalogue",https://s3.us-east-1.amazonaws.com/sjcdigitalarchives/original/536f03735fd2242fe3c29ea66d119b65.pdf,Text,"College Catalogs and Statements of the Program",1,0
160,https://digitalarchives.sjc.edu/items/show/160,"St. John's College in Annapolis Catalogue 1929-1930","College catalog for the years 1929-1930","St. John's College",,"Annapolis, MD",1929-1930,"St. John's College owns the rights to this publication.",text,pdf,,,,,English,,,,,,,,,,"95 pages",,,,,,,,,,paper,,,,,,,,,,,,,,,,,,,,,,,,,,"Catalog,Catalogue",https://s3.us-east-1.amazonaws.com/sjcdigitalarchives/original/c180b41f6f3a58bae67d1000702981a0.pdf,Text,"College Catalogs and Statements of the Program",1,0
161,https://digitalarchives.sjc.edu/items/show/161,"St. John's College 1930-31:  Announcement of Courses","Insert as part of the college catalog for the years 1930-1931","St. John's College",,"Annapolis, MD",1930-1931,"St. John's College owns the rights to this publication.",text,pdf,,,,,English,,,,,,,,,,"38 pages",,,,,,,,,,paper,,,,,,,,,,,,,,,,,,,,,,,,,,"Catalog,Catalogue",https://s3.us-east-1.amazonaws.com/sjcdigitalarchives/original/bbdcda5f32dfa42788a800f8c04318c1.pdf,Text,"College Catalogs and Statements of the Program",1,0
162,https://digitalarchives.sjc.edu/items/show/162,"Bulletin of St. John's College in Annapolis:   Catalogue Number for 1930-1931","College catalog for the years 1930-1931","St. John's College","St. John's College","Annapolis, MD",1931-03,"St. John's College owns the rights to this publication.",text,pdf,"Bulletin of St. John's College:  Volume I, Number 1",,,,English,,,,,,,,,,"101 pages",,,,,,,,,,paper,,,,,,,,,,,,,,,,,,,,,,,,,,"Bulletin,Catalog,Catalogue",https://s3.us-east-1.amazonaws.com/sjcdigitalarchives/original/500ead541773fa70333390bfbb848a2e.pdf,Text,"College Catalogs and Statements of the Program",1,0
163,https://digitalarchives.sjc.edu/items/show/163,"Bulletin of St. John's College in Annapolis:  Catalogue Number for 1931-1932","College catalog for the years 1931-1932","St. John's College","St. John's College","Annapolis, MD",1932-03,"St. John's College owns the rights to this publication.",text,pdf,"Bulletin of St. John's College;  Volume II, Number 1",,,,English,,,,,,,,,,"103 pages",,,,,,,,,,paper,,,,,,,,,,,,,,,,,,,,,,,,,,"Bulletin,Catalog,Catalogue",https://s3.us-east-1.amazonaws.com/sjcdigitalarchives/original/855594b4b6e1cfe2ade8158720f30882.pdf,Text,"College Catalogs and Statements of the Program",1,0
164,https://digitalarchives.sjc.edu/items/show/164,"Bulletin of St. John's College in Annapolis:  Announcement of Courses 1932-33","Insert as part of the college catalog for the years 1932-1933","St. John's College","St. John's College","Annapolis, MD",1932-09,"St. John's College owns the rights to this publication.",text,pdf,"Bulletin of St. John's College;  Volume II, Number 4",,,,English,,,,,,,,,,"43 pages",,,,,,,,,,paper,,,,,,,,,,,,,,,,,,,,,,,,,,"Bulletin,Catalog,Catalogue",https://s3.us-east-1.amazonaws.com/sjcdigitalarchives/original/b633bd512d1c7ae8feea4d7f3de71d97.pdf,Text,"College Catalogs and Statements of the Program",1,0
165,https://digitalarchives.sjc.edu/items/show/165,"Bulletin of St. John's College in Annapolis:  Catalogue Number for 1932-1933","College catalog for the years 1932-1933","St. John's College","St. John's College","Annapolis, MD",1932-12,"St. John's College owns the rights to this publication.",text,pdf,"Bulletin of St. John's College:  Volume III, Number 1",,,,English,,,,,,,,,,"111 pages",,,,,,,,,,paper,,,,,,,,,,,,,,,,,,,,,,,,,,"Bulletin,Catalog,Catalogue",https://s3.us-east-1.amazonaws.com/sjcdigitalarchives/original/5cca4836f4dd671d067d1549a6ab7f78.pdf,Text,"College Catalogs and Statements of the Program",1,0
166,https://digitalarchives.sjc.edu/items/show/166,"Bulletin of St. John's College in Annapolis:  Announcements for 1933-34","Insert as part of the college catalog for the years 1933-1934","St. John's College","St. John's College","Annapolis, MD",1933-09,"St. John's College owns the rights to this publication.",text,pdf,"Bulletin of St. John's College:  Volume III, Number 4",,,,English,,,,,,,,,,"58 pages",,,,,,,,,,paper,,,,,,,,,,,,,,,,,,,,,,,,,,"Bulletin,Catalog,Catalogue",https://s3.us-east-1.amazonaws.com/sjcdigitalarchives/original/ace9b0c1f3f4fa3d0d975c13aed577e9.pdf,Text,"College Catalogs and Statements of the Program",1,0
167,https://digitalarchives.sjc.edu/items/show/167,"Bulletin of St. John's College in Annapolis:  Catalogue Number for 1933-1934","College catalog for the years 1933-1934","St. John's College","St. John's College","Annapolis, MD",1934-01,"St. John's College owns the rights to this publication.",text,pdf,"Bulletin of St. John's College:  Volume IV, Number 1",,,,English,,,,,,,,,,"111 pages",,,,,,,,,,paper,,,,,,,,,,,,,,,,,,,,,,,,,,"Bulletin,Catalog,Catalogue",https://s3.us-east-1.amazonaws.com/sjcdigitalarchives/original/f6bcc9fd649eacb341dd9a69d240f1c2.pdf,Text,"College Catalogs and Statements of the Program",1,0
<br />
<b>Deprecated</b>:  Directive 'allow_url_include' is deprecated in <b>Unknown</b> on line <b>0</b><br />
