﻿"Item Id","Item URI","Dublin Core:Title","Dublin Core:Description","Dublin Core:Creator","Dublin Core:Publisher","Dublin Core:Coverage","Dublin Core:Date","Dublin Core:Rights","Dublin Core:Type","Dublin Core:Format","Dublin Core:Source","Dublin Core:Subject","Dublin Core:Contributor","Dublin Core:Relation","Dublin Core:Language","Dublin Core:Identifier","Item Type Metadata:Occupation","Item Type Metadata:Participants","Item Type Metadata:Death Date","Item Type Metadata:Birthplace","Item Type Metadata:Birth Date","Item Type Metadata:Interviewer","Item Type Metadata:Biographical Text","Item Type Metadata:Bibliography","Item Type Metadata:Page numeration","Item Type Metadata:Resolution","Item Type Metadata:Identifier","Item Type Metadata:Inventory","Item Type Metadata:URL","Item Type Metadata:Text","Item Type Metadata:Interviewee","Item Type Metadata:Location","Item Type Metadata:Transcription","Item Type Metadata:Local URL","Item Type Metadata:Original Format","Item Type Metadata:Physical Dimensions","Item Type Metadata:Duration","Item Type Metadata:Compression","Item Type Metadata:Producer","Item Type Metadata:Director","Item Type Metadata:Bit Rate/Frequency","Item Type Metadata:Email Body","Item Type Metadata:Event Type","Item Type Metadata:Lesson Plan Text","Item Type Metadata:Materials","Item Type Metadata:Objectives","Item Type Metadata:Standards","Item Type Metadata:Number of Attachments","Item Type Metadata:BCC","Item Type Metadata:CC","Item Type Metadata:To","Item Type Metadata:From","Item Type Metadata:Subject Line","Item Type Metadata:Time Summary","Item Type Metadata:Episode","Item Type Metadata:Season","Item Type Metadata:Episode Type","Item Type Metadata:Explicit","Item Type Metadata:Block","PDF Text:Text",tags,file,itemType,collection,public,featured
5476,https://digitalarchives.sjc.edu/items/show/5476,"Basement Level Stacks in Woodward Hall Library after the 1969 Renovation, Annapolis, Maryland","1 photographic print : b&w","Nakata, Tamotsu",,"Annapolis, MD","1969-1970 [circa]","St. John's College owns the rights to this photograph.","Still Image",jpeg,,,,,,SJC-P-1449,,,,,,,,,,,,,,,,,,,Photograph,"25.5 x 20.5 cm.",,,,,,,,,,,,,,,,,,,,,,,,,"Woodward Hall Library",https://s3.us-east-1.amazonaws.com/sjcdigitalarchives/original/cf62d732ae249a4167aa3d483f5ed819.jpg,"Still Image","Photographic Archive—Annapolis",1,0
5477,https://digitalarchives.sjc.edu/items/show/5477,"Basement Level Stacks in Woodward Hall Library after the 1969 Renovation, Annapolis, Maryland","1 photographic print : b&w","Nakata, Tamotsu",,"Annapolis, MD","1969-1970 [circa]","St. John's College owns the rights to this photograph.","Still Image",jpeg,,,,,,SJC-P-1450,,,,,,,,,,,,,,,,,,,Photograph,"25.5 x 20.5 cm.",,,,,,,,,,,,,,,,,,,,,,,,,"Woodward Hall Library",https://s3.us-east-1.amazonaws.com/sjcdigitalarchives/original/1d06464e31b463503c4dde6b6cf29474.jpg,"Still Image","Photographic Archive—Annapolis",1,0
5478,https://digitalarchives.sjc.edu/items/show/5478,"Basement Level Stacks in Woodward Hall Library after the 1969 Renovation, Annapolis, Maryland","1 photographic print : b&w","Nakata, Tamotsu",,"Annapolis, MD","1969-1970 [circa]","St. John's College owns the rights to this photograph.","Still Image",jpeg,,,,,,SJC-P-1451,,,,,,,,,,,,,,,,,,,Photograph,"25.5 x 20.5 cm.",,,,,,,,,,,,,,,,,,,,,,,,,"Woodward Hall Library",https://s3.us-east-1.amazonaws.com/sjcdigitalarchives/original/ff4e7ce556c9bd4195eea6bc2c6fdd22.jpg,"Still Image","Photographic Archive—Annapolis",1,0
5485,https://digitalarchives.sjc.edu/items/show/5485,"Contact sheet of The Interior and Exterior of Woodward Hall Library after 1969 Renovation, Annapolis, Maryland","1 sheet : 15 proof prints from 35mm film : b&w","Nakata, Tamotsu",,"Annapolis, MD",1969-05,"St. John's College owns the rights to this photograph.","Still Image",jpeg,,,,,,SJC-P-1458,,,,,,,,,,,,,,,,,,,Photograph,"25 x 13 cm.",,,,,,,,,,,,,,,,,,,,,,,,,"Woodward Hall Library",https://s3.us-east-1.amazonaws.com/sjcdigitalarchives/original/e7ddcc0d5b9db3dfbff2d58e7d1bdaf2.jpg,"Still Image","Photographic Archive—Annapolis",1,0
5490,https://digitalarchives.sjc.edu/items/show/5490,"Female Student Studying at Desk in the Basement Level of the Woodward Hall Library, Annapolis, Maryland","1 photographic print : b&w","Nakata, Tamotsu",,"Annapolis, MD",1969,"St. John's College owns the rights to this photograph.","Still Image",jpeg,,"St. John's College (Annapolis, Md.). -- Students.",,,,SJC-P-1463,,,,,,,,,,,,,,,,,,,Photograph,"25.5 x 20.5 cm.",,,,,,,,,,,,,,,,,,,,,,,,,"Alumni,Woodward Hall Library",https://s3.us-east-1.amazonaws.com/sjcdigitalarchives/original/7ea1862c248fc652f830ad9b2b4e2416.jpg,"Still Image","Photographic Archive—Annapolis",1,0
5491,https://digitalarchives.sjc.edu/items/show/5491,"Female Student Studying at Desk in the Basement Level of the Woodward Hall Library, Annapolis, Maryland","1 photographic print : b&w","Nakata, Tamotsu",,"Annapolis, MD",1969,"St. John's College owns the rights to this photograph.","Still Image",jpeg,,"St. John's College (Annapolis, Md.). -- Students.",,,,SJC-P-1464,,,,,,,,,,,,,,,,,,,Photograph,"25.5 x 20.5 cm.",,,,,,,,,,,,,,,,,,,,,,,,,"Alumni,Woodward Hall Library",https://s3.us-east-1.amazonaws.com/sjcdigitalarchives/original/4febb7b5bc54f71596c6633824a7c922.jpg,"Still Image","Photographic Archive—Annapolis",1,0
5475,https://digitalarchives.sjc.edu/items/show/5475,"Fireplace and Chair in the King William Room in the Woodward Hall Library after the 1969 Renovation, Annapolis, Maryland","1 photographic print : b&w","Nakata, Tamotsu",,"Annapolis, MD","1969-1970 [circa]","St. John's College owns the rights to this photograph.","Still Image",jpeg,,,,,,SJC-P-1448,,,,,,,,,,,,,,,,,,,Photograph,"25.5 x 20.5 cm.",,,,,,,,,,,,,,,,,,,,,,,,,"Woodward Hall Library",https://s3.us-east-1.amazonaws.com/sjcdigitalarchives/original/c30a466a52e6f07e2b2978c19eb90373.jpg,"Still Image","Photographic Archive—Annapolis",1,0
5139,https://digitalarchives.sjc.edu/items/show/5139,"Junior Great Books Classes at Jones Elementary School, Severna Park, Maryland Led by Susan J. Mackey and Pictures of a Memorial Plaque to Victor Zukerkandl","26 photographic prints : b&w","Nakata, Tamotsu",,"Annapolis, MD",5/27/1969,"St. John's College owns the rights to this photograph.","Still Image",jpeg,,"St. John's College (Annapolis, Md.) -- Students. ;  Mackey, Susan J.",,,,SJC-P-1117,,,,,,,,,,,,,,,,,,,Photograph,"25.5 x 20.5 cm.",,,,,,,,,,,,,,,,,,,,,,,,,"Alumni,Tutors",https://s3.us-east-1.amazonaws.com/sjcdigitalarchives/original/4787f894aba87da958db552f2e682f20.jpg,"Still Image","Photographic Archive—Annapolis",1,0
5492,https://digitalarchives.sjc.edu/items/show/5492,"Students Studying and Shelving Books in the Woodward Hall Library, Annapolis, Maryland","1 photographic print : b&w","Nakata, Tamotsu",,"Annapolis, MD",1969,"St. John's College owns the rights to this photograph.","Still Image",jpeg,,"St. John's College (Annapolis, Md.). -- Students.",,,,SJC-P-1465,,,,,,,,,,,,,,,,,,,Photograph,"25.5 x 20.5 cm.",,,,,,,,,,,,,,,,,,,,,,,,,"Alumni,Woodward Hall Library",https://s3.us-east-1.amazonaws.com/sjcdigitalarchives/original/d7ca9115a1859615fac219888021e9ef.jpg,"Still Image","Photographic Archive—Annapolis",1,0
