﻿"Item Id","Item URI","Dublin Core:Title","Dublin Core:Description","Dublin Core:Creator","Dublin Core:Publisher","Dublin Core:Coverage","Dublin Core:Date","Dublin Core:Rights","Dublin Core:Type","Dublin Core:Format","Dublin Core:Source","Dublin Core:Subject","Dublin Core:Contributor","Dublin Core:Relation","Dublin Core:Language","Dublin Core:Identifier","Item Type Metadata:Occupation","Item Type Metadata:Participants","Item Type Metadata:Death Date","Item Type Metadata:Birthplace","Item Type Metadata:Birth Date","Item Type Metadata:Interviewer","Item Type Metadata:Biographical Text","Item Type Metadata:Bibliography","Item Type Metadata:Page numeration","Item Type Metadata:Resolution","Item Type Metadata:Identifier","Item Type Metadata:Inventory","Item Type Metadata:URL","Item Type Metadata:Text","Item Type Metadata:Interviewee","Item Type Metadata:Location","Item Type Metadata:Transcription","Item Type Metadata:Local URL","Item Type Metadata:Original Format","Item Type Metadata:Physical Dimensions","Item Type Metadata:Duration","Item Type Metadata:Compression","Item Type Metadata:Producer","Item Type Metadata:Director","Item Type Metadata:Bit Rate/Frequency","Item Type Metadata:Email Body","Item Type Metadata:Event Type","Item Type Metadata:Lesson Plan Text","Item Type Metadata:Materials","Item Type Metadata:Objectives","Item Type Metadata:Standards","Item Type Metadata:Number of Attachments","Item Type Metadata:BCC","Item Type Metadata:CC","Item Type Metadata:To","Item Type Metadata:From","Item Type Metadata:Subject Line","Item Type Metadata:Time Summary","Item Type Metadata:Episode","Item Type Metadata:Season","Item Type Metadata:Episode Type","Item Type Metadata:Explicit","Item Type Metadata:Block","PDF Text:Text",tags,file,itemType,collection,public,featured
227,https://digitalarchives.sjc.edu/items/show/227,"Statement of the St. John's Program 2003-2004","College catalog for the years 2003-2004","St. John's College",,"Annapolis, MD; Santa Fe, NM",2003-2004,"St. John's College owns the rights to this publication.",text,pdf,,,,,English,,,,,,,,,,"88 pages",,,,,,,,,,paper,,,,,,,,,,,,,,,,,,,,,,,,,,"Catalog,Catalogue",https://s3.us-east-1.amazonaws.com/sjcdigitalarchives/original/e84563ac4f7a73fb67a10e38b274f41c.pdf,Text,"College Catalogs and Statements of the Program",1,0
739,https://digitalarchives.sjc.edu/items/show/739,"Graduate Institute Commencement Program,  2003","Program for the twenty-fourth summer commencement on the Annapolis campus of the Graduate Institute in liberal education.","St. John's College","St. John's College","Annapolis, MD",2003-08-08,"St. John's College owns the rights to this publication.",text,pdf,,"Commencement (St. John's College, Annapolis, MD)",,,English,GICommencementExercises2003,,,,,,,,,"2 pages",,,,,,,,,,paper,,,,,,,,,,,,,,,,,,,,,,,,,,"Commencement,Graduate Institute",https://s3.us-east-1.amazonaws.com/sjcdigitalarchives/original/bfc1fd9db1841f98a9d6724bfce9e29f.pdf,Text,"Commencement Programs and Addresses",1,0
4907,https://digitalarchives.sjc.edu/items/show/4907,"Santa Fe Commencement Program, Spring 2003","Program for the thirty-sixth commencement on the Santa Fe campus in the three hundredth and seventh year of St. John's College. ","St. John's College","St. John's College","Santa Fe, NM",2003-05-24,"St. John's College owns the rights to this publication.",text,pdf,,"Commencement (St. John's College, Santa Fe, NM)",,,English,"SF Commencement Program 2003-05-24",,,,,,,,,"13 pages",,,,,paper,,,,,,,,,,,,,,,,,,,,,,,,,,,,,,,Commencement,https://s3.us-east-1.amazonaws.com/sjcdigitalarchives/original/bdfe66d87fecd0b1c80db42ec5d170ca.pdf,Text,"Santa Fe Commencement Programs and Addresses",1,0
692,https://digitalarchives.sjc.edu/items/show/692,"Commencement Program,  2003","Program for the two hundred eleventh commencement in the three hundred seventh year of the college.","St. John's College","St. John's College","Annapolis, MD",2003-05-11,"St. John's College owns the rights to this publication.",text,pdf,,"Commencement (St. John's College, Annapolis, MD)",,,English,CommencementExercises2003,,,,,,,,,"24 pages",,,,,,,,,,paper,,,,,,,,,,,,,,,,,,,,,,,,,,Commencement,https://s3.us-east-1.amazonaws.com/sjcdigitalarchives/original/23aac1369544476b36b7c254b622047b.pdf,Text,"Commencement Programs and Addresses",1,0
7900,https://digitalarchives.sjc.edu/items/show/7900,"Charter and Polity of the College, 2003","Charter and Polity of the College, amended and restated April 2003. ","St. John's College","St. John's College","Annapolis, MD; Santa Fe, NM",2003-04,,text,PDF,,"St. John's College (Annapolis, Md.); Legal instruments",,,English,Charter_and_Polity_2003,,,,,,,,,"24 pages",,,,,,,,,,PDF,,,,,,,,,,,,,,,,,,,,,,,,,,"Charter and Polity",https://s3.us-east-1.amazonaws.com/sjcdigitalarchives/original/aa41fd0cebf43010b9125133581253b8.pdf,Text,"Charter and Polity of the College",1,0
4157,https://digitalarchives.sjc.edu/items/show/4157,"The Graduate Institute in Liberal Education, Program Statement, Liberal Arts, Eastern Classics","GI college catalog for the year 2003.","St. John's College","St. John's College","Annapolis, MD; Santa Fe, NM",2003,"St. John's College owns the rights to this publication.",text,pdf,,,,,English,"GI Catalog 2003",,,,,,,,,"ii, 34 pages",,,,,,,,,,paper,,,,,,,,,,,,,,,,,,,,,,,,,,"Catalog,Catalogue,Graduate Institute",https://s3.us-east-1.amazonaws.com/sjcdigitalarchives/original/9f9edfde699b2745e8287180b035bc22.pdf,Text,"College Catalogs and Statements of the Program",1,0
427,https://digitalarchives.sjc.edu/items/show/427,"The College, Winter 2003","Volume 29, Issue 1 of <em>The College</em> Magazine. Published in Winter 2003.","St. John's College","St. John's College","Annapolis, MD;  Santa Fe, NM",2003,"St. John's College owns the rights to this publication.",text,pdf,,,,,English,The_College_Magazine_Winter_2003,,,,,,,,,"48 pages",,,,,,,,,,paper,,,,,,,,,,,,,,,,,,,,,,,,,,"The College",https://s3.us-east-1.amazonaws.com/sjcdigitalarchives/original/48bc97ee162d9b5a7cda2bab17b7a7bf.pdf,Text,"<em>The College </em>(2001-2017)",1,0
423,https://digitalarchives.sjc.edu/items/show/423,"The College, Spring 2003","Volume 29, Issue 2 of <em>The College</em> Magazine. Published in Spring 2003.","St. John's College","St. John's College","Annapolis, MD;  Santa Fe, NM",2003,"St. John's College owns the rights to this publication.",text,pdf,,,,,English,The_College_Magazine_Spring_2003,,,,,,,,,"48 pages",,,,,,,,,,paper,,,,,,,,,,,,,,,,,,,,,,,,,,"The College",https://s3.us-east-1.amazonaws.com/sjcdigitalarchives/original/dd24ae3bd6c019815f5181b0f1954519.pdf,Text,"<em>The College </em>(2001-2017)",1,0
419,https://digitalarchives.sjc.edu/items/show/419,"The College, Fall 2003","Volume 29, Issue 3 of the <em>The College</em> Magazine. Published in Fall 2003.","St. John's College","St. John's College","Annapolis, MD;  Santa Fe, NM",2003,"St. John's College owns the rights to this publication.",text,pdf,,,,,English,The_College_Magazine_Fall_2003,,,,,,,,,"48 pages",,,,,,,,,,paper,,,,,,,,,,,,,,,,,,,,,,,,,,"The College",https://s3.us-east-1.amazonaws.com/sjcdigitalarchives/original/224088bb518fa8ce7b0936a38db2b71a.pdf,Text,"<em>The College </em>(2001-2017)",1,0
226,https://digitalarchives.sjc.edu/items/show/226,"Statement of the St. John's Program 2002-2003","College catalog for the years 2002-2003","St. John's College",,"Annapolis, MD; Santa Fe, NM",2002-2003,"St. John's College owns the rights to this publication.",text,pdf,,,,,English,,,,,,,,,,"86 pages",,,,,,,,,,paper,,,,,,,,,,,,,,,,,,,,,,,,,,"Catalog,Catalogue",https://s3.us-east-1.amazonaws.com/sjcdigitalarchives/original/4b0b126bd10bea34db710d89d2eb288e.pdf,Text,"College Catalogs and Statements of the Program",1,0
738,https://digitalarchives.sjc.edu/items/show/738,"Graduate Institute Commencement Program,  2002","Program for the twenty-third summer commencement on the Annapolis campus of the Graduate Institute in liberal education.","St. John's College","St. John's College","Annapolis, MD",2002-08-09,"St. John's College owns the rights to this publication.",text,pdf,,"Commencement (St. John's College, Annapolis, MD)",,,English,GICommencementExercises2002,,,,,,,,,"2 pages",,,,,,,,,,paper,,,,,,,,,,,,,,,,,,,,,,,,,,"Commencement,Graduate Institute",https://s3.us-east-1.amazonaws.com/sjcdigitalarchives/original/d185667e49251b98166c3370671d3e98.pdf,Text,"Commencement Programs and Addresses",1,0
4906,https://digitalarchives.sjc.edu/items/show/4906,"Santa Fe Commencement Program, Spring 2002","Program for the thirty-fifth commencement on the Santa Fe campus in the three hundredth and sixth year of St. John's College. ","St. John's College","St. John's College","Santa Fe, NM",2002-05-18,"St. John's College owns the rights to this publication.",text,pdf,,"Commencement (St. John's College, Santa Fe, NM)",,,English,"SF Commencement Program 2002-05-18",,,,,,,,,"13 pages",,,,,,,,,,paper,,,,,,,,,,,,,,,,,,,,,,,,,,,https://s3.us-east-1.amazonaws.com/sjcdigitalarchives/original/218ccfd328a6840715199b2c503df31b.pdf,Text,"Santa Fe Commencement Programs and Addresses",1,0
693,https://digitalarchives.sjc.edu/items/show/693,"Commencement Program,  2002","Program for the two hundred tenth commencement in the three hundred sixth year of the college.","St. John's College","St. John's College","Annapolis, MD",2002-05-12,"St. John's College owns the rights to this publication.",text,pdf,,"Commencement (St. John's College, Annapolis, MD)",,,English,CommencementExercises2002,,,,,,,,,"21 pages",,,,,,,,,,paper,,,,,,,,,,,,,,,,,,,,,,,,,,Commencement,https://s3.us-east-1.amazonaws.com/sjcdigitalarchives/original/81c805f7f792d6c21e2a876e13baead1.pdf,Text,"Commencement Programs and Addresses",1,0
6524,https://digitalarchives.sjc.edu/items/show/6524,"Invitation for the Inauguration of President John E. Balkcom","Invitation for the re-scheduled Inauguration of President John E. Balkcom, the fifth president of St. John's College, Santa Fe. Originally scheduled for September 15, 2001, the inauguration was held on January 26, 2002. ","St. John's College","St. John's College","Santa Fe, NM",2002-01-26,"St. John's College owns the rights to this publication.",text,pdf,,"inauguration invitation ",,,English,"Balkcom Inauguration 2001",,,,,,,,,"1 page",,,,,,,,,,paper,,,,,,,,,,,,,,,,,,,,,,,,,,,https://s3.us-east-1.amazonaws.com/sjcdigitalarchives/original/48204adafdeb385b890339182a7efec1.pdf,Text,"Playbills & Programs",1,0
7541,https://digitalarchives.sjc.edu/items/show/7541,"The College, Summer 2002","Volume 28, Issue 3 of The College Magazine. Published Summer 2002. ","St. John's College","St. John's College","St. John's College owns the rights to this publication.",2002,"St. John's College owns the rights to this publication.",text,pdf,,,"Goyette, Barbara (editor) ; Borden, Sus3en (managing editor) ; Ducker, Susanne (art editor) ; Mulry, Laura J. (Santa Fe editor) ; Johnson, David ; Morrison, Marissa ; van Doren, John ; Eoyang, Glenda H. ",,"English ","The College Vol. 28, Issue 3 Summer 2002 ",,,,,,,,,48,,,,,,,,,,paper,,,,,,,,,,,,,,,,,,,,,,,,,,"The College",https://s3.us-east-1.amazonaws.com/sjcdigitalarchives/original/107a2859a60bb352dcd9e70f7626062b.pdf,Text,"<em>The College </em>(2001-2017)",1,0
7540,https://digitalarchives.sjc.edu/items/show/7540,"The College, Winter/Spring 2002","Volume 28, Issue 2 of The College Magazine. Published Winter/Spring of 2002. ","St. John's College","St. John's College ","Annapolis, MD ; Santa Fe, NM ",2002,"St. John's College owns the rights to this publication.",text,pdf,,,"Goyette, Barbara (editor) ; Borden, Sus3en (managing editor) ; Ducker, Susanne (graphic designer) ; Mulry, Laura J. (Santa Fe editor) ; Johnson, David ; Fetterer, Florence ; Brann, Eva ; Moreno, Ed ; Gable, Roberta ; Eoyang, Glenda H.; Skilondz, Melinda ; Sanfilippo, Mark ",,"English ","The College Vol. 28, Issue 2 Winter/Spring 2002",,,,,,,,,40,,,,,,,,,,paper,,,,,,,,,,,,,,,,,,,,,,,,,,"The College",https://s3.us-east-1.amazonaws.com/sjcdigitalarchives/original/57b157947f831f4d09eab130ae796d52.pdf,Text,"<em>The College </em>(2001-2017)",1,0
225,https://digitalarchives.sjc.edu/items/show/225,"Statement of the St. John's Program 2001-2002","College catalog for the years 2001-2002","St. John's College",,"Annapolis, MD; Santa Fe, NM",2001-2002,"St. John's College owns the rights to this publication.",text,pdf,,,,,English,,,,,,,,,,"86 pages",,,,,,,,,,paper,,,,,,,,,,,,,,,,,,,,,,,,,,"Catalog,Catalogue",https://s3.us-east-1.amazonaws.com/sjcdigitalarchives/original/3437a929a79c22894344f413cfde0528.pdf,Text,"College Catalogs and Statements of the Program",1,0
6529,https://digitalarchives.sjc.edu/items/show/6529,"Inviting Conversations: Invitation for the Inauguration of President John E. Balkcom","Inviting Conversations: An invitation pamphlet distributed for the Inauguration of President John E. Balkcom, the fifth president of St. John's College, Santa Fe. ","St. John's College","St. John's College","Annapolis, MD
Santa Fe, NM",2001-10-15,"St. John's College owns the rights to this publication.",text,pdf,,"inauguration invitation ",,,English,"Inviting Conversations",,,,,,,,,"10 pages",,,,,,,,,,paper,,,,,,,,,,,,,,,,,,,,,,,,,,Inauguration,https://s3.us-east-1.amazonaws.com/sjcdigitalarchives/original/dc87777c7937f1373b0b4974a7fefdb8.pdf,Text,"Playbills & Programs",1,0
7539,https://digitalarchives.sjc.edu/items/show/7539,"The College, Fall 2001","Volume 28, Issue 1 of The College Magazine. Published in Fall 2001. ","St. John's College ","St. John's College ","Annapolis, MD ; Santa Fe, NM ",2001-09,"St. John's College owns the rights to this publication.",text,pdf,,,"Goyette, Barbara (editor); Borden, Sus3en (assistant editor) ; Ducker, Susanne (graphic designer) ; Mulry, Laura J. (Santa Fe editor) ; Johnson, David ; Morrison, Marissa ; Hancock, Evan ; Randall, Thomson ; Idema, James ; Pastille, William ; Sanfilippo, Mark ; Gable, Roberta ; Eoyang, Glenda H.",,"English ","The College Vol. 28, Issue 1 Fall 2001",,,,,,,,,48,,,,,,,,,,paper,,,,,,,,,,,,,,,,,,,,,,,,,,"The College",https://s3.us-east-1.amazonaws.com/sjcdigitalarchives/original/938f6f2472711f9912b0822a2e68aac0.pdf,Text,"<em>The College </em>(2001-2017)",1,0
737,https://digitalarchives.sjc.edu/items/show/737,"Graduate Institute Commencement Program,  2001","Program for the twenty-second summer commencement on the Annapolis campus of the Graduate Institute in liberal education.","St. John's College","St. John's College","Annapolis, MD",2001-08-10,"St. John's College owns the rights to this publication.",text,pdf,,"Commencement (St. John's College, Annapolis, MD)",,,English,GICommencementExercises2001,,,,,,,,,"2 pages",,,,,,,,,,paper,,,,,,,,,,,,,,,,,,,,,,,,,,"Commencement,Graduate Institute",https://s3.us-east-1.amazonaws.com/sjcdigitalarchives/original/212e0220343bb7da8f192e40df8dc5a7.pdf,Text,"Commencement Programs and Addresses",1,0
