﻿"Item Id","Item URI","Dublin Core:Title","Dublin Core:Description","Dublin Core:Creator","Dublin Core:Publisher","Dublin Core:Coverage","Dublin Core:Date","Dublin Core:Rights","Dublin Core:Type","Dublin Core:Format","Dublin Core:Source","Dublin Core:Subject","Dublin Core:Contributor","Dublin Core:Relation","Dublin Core:Language","Dublin Core:Identifier","Item Type Metadata:Occupation","Item Type Metadata:Participants","Item Type Metadata:Death Date","Item Type Metadata:Birthplace","Item Type Metadata:Birth Date","Item Type Metadata:Interviewer","Item Type Metadata:Biographical Text","Item Type Metadata:Bibliography","Item Type Metadata:Page numeration","Item Type Metadata:Resolution","Item Type Metadata:Identifier","Item Type Metadata:Inventory","Item Type Metadata:URL","Item Type Metadata:Text","Item Type Metadata:Interviewee","Item Type Metadata:Location","Item Type Metadata:Transcription","Item Type Metadata:Local URL","Item Type Metadata:Original Format","Item Type Metadata:Physical Dimensions","Item Type Metadata:Duration","Item Type Metadata:Compression","Item Type Metadata:Producer","Item Type Metadata:Director","Item Type Metadata:Bit Rate/Frequency","Item Type Metadata:Email Body","Item Type Metadata:Event Type","Item Type Metadata:Lesson Plan Text","Item Type Metadata:Materials","Item Type Metadata:Objectives","Item Type Metadata:Standards","Item Type Metadata:Number of Attachments","Item Type Metadata:BCC","Item Type Metadata:CC","Item Type Metadata:To","Item Type Metadata:From","Item Type Metadata:Subject Line","Item Type Metadata:Time Summary","Item Type Metadata:Episode","Item Type Metadata:Season","Item Type Metadata:Episode Type","Item Type Metadata:Explicit","Item Type Metadata:Block","PDF Text:Text",tags,file,itemType,collection,public,featured
4164,https://digitalarchives.sjc.edu/items/show/4164,"Stringfellow Barr Seated below a Portrait of King William at his Formal Lecture ""The Beginning of the St. John's Program"" in the King William Room, St. John's College, Annapolis, Maryland, July 1972","1 photographic print : b&w","Fox, Cecil H.",,"Annapolis, MD",1972-07,"St. John's College owns the rights to this photograph.","still image",jpeg,,"Barr, Stringfellow, 1897-1982",,,,SJCO-P-0055,,,,,,,,,,,,,,,,,,,photograph,"20.5 x 25.5 cm",,,,,,,,,,,,,,,,,,,,,,,,,"Honorary Alumni,Presidents",https://s3.us-east-1.amazonaws.com/sjcdigitalarchives/original/ca9019c4df8eee5595fea7966dbe8918.jpg,"Still Image","Photographic Archive—Annapolis",1,0
5233,https://digitalarchives.sjc.edu/items/show/5233,"Stringfellow Barr Seated during His Lecture ""The Beginning of the St. John's Program"" in the King William Room, Annapolis, Maryland","1 photographic print : b&w","Fox, Cecil H.",,"Annapolis, MD",1972-07,"St. John's College owns the rights to this photograph.","Still Image",jpeg,,"Barr, Stringfellow, 1897-",,,,SJC-P-1222,,,,,,,,,,,,,,,,,,,Photograph,"25.5 x 20.5 cm.",,,,,,,,,,,,,,,,,,,,,,,,,"Honorary Alumni,Presidents",https://s3.us-east-1.amazonaws.com/sjcdigitalarchives/original/3d5444a3d954c2a4e8c4545c6c38aeb0.jpg,"Still Image","Photographic Archive—Annapolis",1,0
5234,https://digitalarchives.sjc.edu/items/show/5234,"Stringfellow Barr Seated during His Lecture ""The Beginning of the St. John's Program"" in the King William Room, Annapolis, Maryland","1 photographic print : b&w","Fox, Cecil H.",,"Annapolis, MD",1972-07,"St. John's College owns the rights to this photograph.","Still Image",jpeg,,"Barr, Stringfellow, 1897-",,,,SJC-P-1223,,,,,,,,,,,,,,,,,,,Photograph,"25.5 x 20.5 cm.",,,,,,,,,,,,,,,,,,,,,,,,,"Honorary Alumni,Presidents",https://s3.us-east-1.amazonaws.com/sjcdigitalarchives/original/60156e4020b49850a699eacaf3ee12ed.jpg,"Still Image","Photographic Archive—Annapolis",1,0
5235,https://digitalarchives.sjc.edu/items/show/5235,"Stringfellow Barr Seated during His Lecture ""The Beginning of the St. John's Program"" in the King William Room, Annapolis, Maryland","1 photographic print : b&w","Fox, Cecil H.",,"Annapolis, MD",1972-07,"St. John's College owns the rights to this photograph.","Still Image",jpeg,,"Barr, Stringfellow, 1897-",,,,SJC-P-1224,,,,,,,,,,,,,,,,,,,Photograph,"25.5 x 20.5 cm.",,,,,,,,,,,,,,,,,,,,,,,,,"Honorary Alumni,Presidents",https://s3.us-east-1.amazonaws.com/sjcdigitalarchives/original/689fbd79e501e8796f9ea3e5ea2259ca.jpg,"Still Image","Photographic Archive—Annapolis",1,0
5236,https://digitalarchives.sjc.edu/items/show/5236,"Stringfellow Barr Seated during His Lecture ""The Beginning of the St. John's Program"" in the King William Room, Annapolis, Maryland","1 photographic print : b&w","Fox, Cecil H.",,"Annapolis, MD",1972-07,"St. John's College owns the rights to this photograph.","Still Image",jpeg,,"Barr, Stringfellow, 1897-",,,,SJC-P-1225,,,,,,,,,,,,,,,,,,,Photograph,"25.5 x 20.5 cm.",,,,,,,,,,,,,,,,,,,,,,,,,"Honorary Alumni,Presidents",https://s3.us-east-1.amazonaws.com/sjcdigitalarchives/original/e9d21b123bc0ab1b28ea52c789f727ef.jpg,"Still Image","Photographic Archive—Annapolis",1,0
5237,https://digitalarchives.sjc.edu/items/show/5237,"Stringfellow Barr Seated during His Lecture ""The Beginning of the St. John's Program"" in the King William Room, Annapolis, Maryland","1 photographic print : b&w","Fox, Cecil H.",,"Annapolis, MD",1972-07,"St. John's College owns the rights to this photograph.","Still Image",jpeg,,"Barr, Stringfellow, 1897-",,,,SJC-P-1226,,,,,,,,,,,,,,,,,,,Photograph,"25.5 x 20.5 cm.",,,,,,,,,,,,,,,,,,,,,,,,,"Honorary Alumni,Presidents",https://s3.us-east-1.amazonaws.com/sjcdigitalarchives/original/8cc192f6d0aad58d0428cce98b338df4.jpg,"Still Image","Photographic Archive—Annapolis",1,0
5238,https://digitalarchives.sjc.edu/items/show/5238,"Stringfellow Barr Seated during His Lecture ""The Beginning of the St. John's Program"" in the King William Room, Annapolis, Maryland","1 photographic print : b&w","Fox, Cecil H.",,"Annapolis, MD",1972-07,"St. John's College owns the rights to this photograph.","Still Image",jpeg,,"Barr, Stringfellow, 1897-",,,,SJC-P-1227,,,,,,,,,,,,,,,,,,,Photograph,"25.5 x 20.5 cm.",,,,,,,,,,,,,,,,,,,,,,,,,"Honorary Alumni,Presidents",https://s3.us-east-1.amazonaws.com/sjcdigitalarchives/original/254bb7f696c9aafeb364fc0d88a1e000.jpg,"Still Image","Photographic Archive—Annapolis",1,0
5239,https://digitalarchives.sjc.edu/items/show/5239,"Stringfellow Barr Speaking during His Lecture ""The Beginning of the St. John's Program"" in the King William Room, Annapolis, Maryland",,"Fox, Cecil H.",,"Annapolis, MD",1972-07,"St. John's College owns the rights to this photograph.","Still Image",jpeg,,"Barr, Stringfellow, 1897-",,,,SJC-P-1228,,,,,,,,,,,,,,,,,,,Photograph,"25.5 x 20.5 cm.",,,,,,,,,,,,,,,,,,,,,,,,,"Honorary Alumni,Presidents",https://s3.us-east-1.amazonaws.com/sjcdigitalarchives/original/194d1c32676e3fbbb002bc43d55e63ff.jpg,"Still Image","Photographic Archive—Annapolis",1,0
5240,https://digitalarchives.sjc.edu/items/show/5240,"Stringfellow Barr Speaking during His Lecture ""The Beginning of the St. John's Program"" in the King William Room, Annapolis, Maryland",,"Fox, Cecil H.",,"Annapolis, MD",1972-07,"St. John's College owns the rights to this photograph.","Still Image",jpeg,,"Barr, Stringfellow, 1897-",,,,SJC-P-1229,,,,,,,,,,,,,,,,,,,Photograph,"25.5 x 20.5 cm.",,,,,,,,,,,,,,,,,,,,,,,,,"Honorary Alumni,Presidents",https://s3.us-east-1.amazonaws.com/sjcdigitalarchives/original/8ab0fef0cecf2cfd37be8f44c6af87ad.jpg,"Still Image","Photographic Archive—Annapolis",1,0
5241,https://digitalarchives.sjc.edu/items/show/5241,"Stringfellow Barr Speaking during His Lecture ""The Beginning of the St. John's Program"" in the King William Room, Annapolis, Maryland",,"Fox, Cecil H.",,"Annapolis, MD",1972-07,"St. John's College owns the rights to this photograph.","Still Image",jpeg,,"Barr, Stringfellow, 1897-",,,,SJC-P-1230,,,,,,,,,,,,,,,,,,,Photograph,"25.5 x 20.5 cm.",,,,,,,,,,,,,,,,,,,,,,,,,"Honorary Alumni,Presidents",https://s3.us-east-1.amazonaws.com/sjcdigitalarchives/original/c97c2e33b67035d63f8ed70f419b4f46.jpg,"Still Image","Photographic Archive—Annapolis",1,0
5242,https://digitalarchives.sjc.edu/items/show/5242,"Stringfellow Barr Speaking during His Lecture ""The Beginning of the St. John's Program"" in the King William Room, Annapolis, Maryland",,"Fox, Cecil H.",,"Annapolis, MD",1972-07,"St. John's College owns the rights to this photograph.","Still Image",jpeg,,"Barr, Stringfellow, 1897-",,,,SJC-P-1231,,,,,,,,,,,,,,,,,,,Photograph,"20.5 x 25.5 cm.",,,,,,,,,,,,,,,,,,,,,,,,,"Honorary Alumni,Presidents",https://s3.us-east-1.amazonaws.com/sjcdigitalarchives/original/d61889f896f33f04d538bdefc0d016df.jpg,"Still Image","Photographic Archive—Annapolis",1,0
5243,https://digitalarchives.sjc.edu/items/show/5243,"Stringfellow Barr Speaking during His Lecture ""The Beginning of the St. John's Program"" in the King William Room, Annapolis, Maryland",,"Fox, Cecil H.",,"Annapolis, MD",1972-07,"St. John's College owns the rights to this photograph.","Still Image",jpeg,,"Barr, Stringfellow, 1897-",,,,SJC-P-1232,,,,,,,,,,,,,,,,,,,Photograph,"25.5 x 20.5 cm.",,,,,,,,,,,,,,,,,,,,,,,,,"Honorary Alumni,Presidents",https://s3.us-east-1.amazonaws.com/sjcdigitalarchives/original/ccd1b0fdd78e616cabd7d58c68f8de82.jpg,"Still Image","Photographic Archive—Annapolis",1,0
5244,https://digitalarchives.sjc.edu/items/show/5244,"Stringfellow Barr Speaking during His Lecture ""The Beginning of the St. John's Program"" in the King William Room, Annapolis, Maryland","1 photographic print : b&w","Fox, Cecil H.",,"Annapolis, MD",1972-07,"St. John's College owns the rights to this photograph.","Still Image",jpeg,,"Barr, Stringfellow, 1897-",,,,SJC-P-1233,,,,,,,,,,,,,,,,,,,Photograph,"25.5 x 20.5 cm.",,,,,,,,,,,,,,,,,,,,,,,,,"Honorary Alumni,Presidents",https://s3.us-east-1.amazonaws.com/sjcdigitalarchives/original/47b1b38839b62955a9b3121d5d5ea737.jpg,"Still Image","Photographic Archive—Annapolis",1,0
5245,https://digitalarchives.sjc.edu/items/show/5245,"Robert S. Zelenka Talking with Stringfellow Barr after Stringfellow Barr's Lecture ""The Beginning of the St. John's Program"" in the King William Room, Annapolis, Maryland","1 photographic print : b&w","Fox, Cecil H.",,"Annapolis, MD",1972-07,"St. John's College owns the rights to this photograph.","Still Image",jpeg,,"Barr, Stringfellow, 1897-;  Zelenka, Robert S.",,,,SJC-P-1234,,,,,,,,,,,,,,,,,,,Photograph,"20.5 x 25.5 cm.",,,,,,,,,,,,,,,,,,,,,,,,,,https://s3.us-east-1.amazonaws.com/sjcdigitalarchives/original/a7c788941bdc6010e9b7e39527e8390a.jpg,"Still Image","Photographic Archive—Annapolis",1,0
5246,https://digitalarchives.sjc.edu/items/show/5246,"Robert S. Zelenka Talking with Stringfellow Barr after Stringfellow Barr's Lecture ""The Beginning of the St. John's Program"" in the King William Room, Annapolis, Maryland","1 photographic print : b&w","Fox, Cecil H.",,"Annapolis, MD",1972-07,"St. John's College owns the rights to this photograph.","Still Image",jpeg,,"Barr, Stringfellow, 1897-;  Zelenka, Robert S.",,,,SJC-P-1235,,,,,,,,,,,,,,,,,,,Photograph,"25.5 x 20.5 cm.",,,,,,,,,,,,,,,,,,,,,,,,,,https://s3.us-east-1.amazonaws.com/sjcdigitalarchives/original/a6fd362c834dd8780859f61d19118927.jpg,"Still Image","Photographic Archive—Annapolis",1,0
5247,https://digitalarchives.sjc.edu/items/show/5247,"Robert S. Zelenka Talking with Stringfellow Barr after Stringfellow Barr's Lecture ""The Beginning of the St. John's Program"" in the King William Room, St. John's College, Annapolis, Maryland","1 photographic print : b&w","Fox, Cecil H.",,"Annapolis, MD",1972-07,"St. John's College owns the rights to this photograph.","Still Image",jpeg,,"Barr, Stringfellow, 1897-;  Zelenka, Robert S.",,,,SJC-P-1236,,,,,,,,,,,,,,,,,,,Photograph,"25.5 x 20.5 cm.",,,,,,,,,,,,,,,,,,,,,,,,,,https://s3.us-east-1.amazonaws.com/sjcdigitalarchives/original/843bbff2fa289e991a4f70d9aa33227e.jpg,"Still Image","Photographic Archive—Annapolis",1,0
5248,https://digitalarchives.sjc.edu/items/show/5248,"Stringfellow Barr, Seated, with John Kieffer Standing Behind him after  Barr's Lecture ""The Beginning of the St. John's Program"" in the King William Room, Annapolis, Maryland","1 photographic print : b&w","Fox, Cecil H.",,"Annapolis, MD",1972-07,"St. John's College owns the rights to this photograph.","Still Image",jpeg,,"Barr, Stringfellow, 1897-",,,,SJC-P-1239,,,,,,,,,,,,,,,,,,,Photograph,"25.5 x 20.5 cm.",,,,,,,,,,,,,,,,,,,,,,,,,"Honorary Alumni,Presidents",https://s3.us-east-1.amazonaws.com/sjcdigitalarchives/original/8efd996e44acf2148277ca6d69880cbc.jpg,"Still Image","Photographic Archive—Annapolis",1,0
932,https://digitalarchives.sjc.edu/items/show/932,"Portrait of Ford K. Brown Seated on a Bench in the Quad in front of Randall Hall, St. John's College, Annapolis, Maryland","1 photographic print : b&w","Fox, Cecil H.",,"Annapolis, MD",1972-08,"St. John's College owns the rights to this photograph.","still image",jpeg,,"Brown, Ford Keeler.",,,,SJC-P-0023,,,,,,,,,,"600 dpi",,,,,,,,,photograph,"25 x 20.5 cm.",,,,,,,,,,,,,,,,,,,,,,,,,Tutors,https://s3.us-east-1.amazonaws.com/sjcdigitalarchives/original/f386e24f851a93a6ec29a46419006828.jpg,"Still Image","Photographic Archive—Annapolis",1,1
4169,https://digitalarchives.sjc.edu/items/show/4169,"Ford K. Brown Seated on a Bench in the Quad in front of Randall Hall, St. John's College, Annapolis, Maryland","1 photographic print : b&w","Fox, Cecil H.",,"Annapolis, MD",1972-08,"St. John's College owns the rights to this photograph.","still image",jpeg,,"St. John's College (Annapolis, Md.). -- Faculty ;  Brown, Ford Keeler.",,,,SJC-P-0024,,,,,,,,,,,,,,,,,,,photograph,"20.5 x 25.5 cm.",,,,,,,,,,,,,,,,,,,,,,,,,"Honorary Alumni,Tutors",https://s3.us-east-1.amazonaws.com/sjcdigitalarchives/original/6587c845bdf6db184fb79b94098eff4e.jpg,"Still Image","Photographic Archive—Annapolis",1,0
6238,https://digitalarchives.sjc.edu/items/show/6238,"Portrait of Ford K. Brown Seated on a Bench in the Quad in front of Randall Hall, St. John's College, Annapolis, Maryland","1 photographic print : b&w","Fox, Cecil H.",,"Annapolis, MD",1972-08,"St. John's College owns the rights to this photograph.","Still Image",jpeg,,"Brown, Ford Keeler.",,,,SJC-P-2538,,,,,,,,,,,,,,,,,,,Photograph,"25.5 x 20.5 cm.",,,,,,,,,,,,,,,,,,,,,,,,,"Honorary Alumni,Tutors",https://s3.us-east-1.amazonaws.com/sjcdigitalarchives/original/ff5036419a4434d5e9c1e0c380e8edc5.jpg,"Still Image","Photographic Archive—Annapolis",1,0
