﻿"Item Id","Item URI","Dublin Core:Title","Dublin Core:Description","Dublin Core:Creator","Dublin Core:Publisher","Dublin Core:Coverage","Dublin Core:Date","Dublin Core:Rights","Dublin Core:Type","Dublin Core:Format","Dublin Core:Source","Dublin Core:Subject","Dublin Core:Contributor","Dublin Core:Relation","Dublin Core:Language","Dublin Core:Identifier","Item Type Metadata:Occupation","Item Type Metadata:Participants","Item Type Metadata:Death Date","Item Type Metadata:Birthplace","Item Type Metadata:Birth Date","Item Type Metadata:Interviewer","Item Type Metadata:Biographical Text","Item Type Metadata:Bibliography","Item Type Metadata:Page numeration","Item Type Metadata:Resolution","Item Type Metadata:Identifier","Item Type Metadata:Inventory","Item Type Metadata:URL","Item Type Metadata:Text","Item Type Metadata:Interviewee","Item Type Metadata:Location","Item Type Metadata:Transcription","Item Type Metadata:Local URL","Item Type Metadata:Original Format","Item Type Metadata:Physical Dimensions","Item Type Metadata:Duration","Item Type Metadata:Compression","Item Type Metadata:Producer","Item Type Metadata:Director","Item Type Metadata:Bit Rate/Frequency","Item Type Metadata:Email Body","Item Type Metadata:Event Type","Item Type Metadata:Lesson Plan Text","Item Type Metadata:Materials","Item Type Metadata:Objectives","Item Type Metadata:Standards","Item Type Metadata:Number of Attachments","Item Type Metadata:BCC","Item Type Metadata:CC","Item Type Metadata:To","Item Type Metadata:From","Item Type Metadata:Subject Line","Item Type Metadata:Time Summary","Item Type Metadata:Episode","Item Type Metadata:Season","Item Type Metadata:Episode Type","Item Type Metadata:Explicit","Item Type Metadata:Block","PDF Text:Text",tags,file,itemType,collection,public,featured
894,https://digitalarchives.sjc.edu/items/show/894,"Formal Lecture/Concert Schedule - 1979-1980","Schedule of lectures and concerts for the 1979-1980 Academic Year.","Office of the Dean","St. John's College","Annapolis, MD",1979-1980,"St. John's College owns the rights to this publication.",text,pdf,,,"Brann, Eva T. H.; Sacks, Richard; Barzun, Jacques, 1907-2012; Sparrow, Edward G.; Jones, David; Reyes, Renaldo; Venable, Bruce; Gilbert, Creighton; Grene, Marjorie, 1910-2009; Younger, Irving; diGaetani, Jan; Guinn, Leslie; Hollander, John; Knorr, Wilbur; Clark, Leonard; Adler, Mortimer Jerome, 1902-2001; Veatch, Henry; Holton, Gerald; Starr, David; Maistrellis, Nicholas; Sachs, Joe; Gildin, Hilail; Weigle, Richard Daniel, 1912-; King William Players","September 14, 1979. Brann, Eva T. H. <a href=""http://digitalarchives.sjc.edu/items/show/1239"" title=""Plato's theory of ideas"">Plato's theory of ideas</a> (typescript); April 11, 1980.  Sachs, Joe. <a href=""http://digitalarchives.sjc.edu/items/show/3726"" title=""An outline of the argument of Aristotle's Metaphysics"">An outline of the argument of Aristotle's Metaphysics</a> (typescript)",English,"Lecture Schedule 1979-1980",,,,,,,,,"2 pages",,,,,,,,,,paper,,,,,,,,,,,,,,,,,,,,,,,,,,"Friday night lecture,Lecture schedule",https://s3.us-east-1.amazonaws.com/sjcdigitalarchives/original/0d8bfd9ecd8dd8e4d4e56ae070a31d0d.pdf,Text,"St. John's College Formal Lecture Series—Annapolis",1,0
912,https://digitalarchives.sjc.edu/items/show/912,"Lecture Schedule, Summer 1981 - February Freshman","Schedule of lectures and concerts in Summer 1981, sponsored by the Graduate Institute.","Graduate Institute","St. John's College","Annapolis, MD",1981,"St. John's College owns the rights to this publication.",text,pdf,,,"Kutler, Samuel; White, John; Allanbrook, Douglas; Conroy, Donald; Lindemuth, Donald; Zuckerman, Elliott; Sachs, Joe; Smith, J. Winfree",,English,"Lecture Schedule 1981 Summer",,,,,,,,,"1 page",,,,,,,,,,paper,,,,,,,,,,,,,,,,,,,,,,,,,,"Graduate Institute,Lecture schedule,Summer lecture series",https://s3.us-east-1.amazonaws.com/sjcdigitalarchives/original/b66747e43e665d6bd1a8435c764d8230.pdf,Text,"Graduate Institute Summer Lecture Series",1,0
491,https://digitalarchives.sjc.edu/items/show/491,"The St. John's Review (formerly The College), Summer 1981","Volume XXXII, Number 3 of The St. John's Review, formerly The College.  Published in Summer 1981.","Office of the Dean","St. John's College","Annapolis, MD",1981-07,"St. John's College owns the rights to this publication.",text,pdf,,,"Radista, Leo; Parran, Jr., Thomas; Sisson, Barbara J.; von Oppen, Beate Ruhm; Wilson, Curtis A.; Sachs, Joe; Brann, Eva T. H.; Bacon, Helen H.; Blum, Etta; Aron, Raymond; Bruell, Christopher; Liben, Meyer; Roth, Robert; West, Thomas G.",,English,"ISSN 0010-0862; The_St_Johns_Review_Vol_32_No_3_1981",,,,,,,,,"81 pages",,,,,,,,,,paper,,,,,,,,,,,,,,,,,,,,,,,,,,"St. John's Review",https://s3.us-east-1.amazonaws.com/sjcdigitalarchives/original/a86b0251a287cc0834212303aee73791.pdf,Text,"<em>The St. John's Review</em>",1,0
492,https://digitalarchives.sjc.edu/items/show/492,"The St. John's Review (formerly The College), Autumn 1981","Volume XXXIII, Number 1 of The St. John's Review, formerly The College.  Published in Autumn 1981.","Office of the Dean","St. John's College","Annapolis, MD",1981-10,"St. John's College owns the rights to this publication.",text,pdf,,,"Radista, Leo; Parran, Jr., Thomas; Wilson, Curtis A.; Sachs, Joe; Brann, Eva T. H.; Jaffa, Henry V.; Josephs, Laurence; Klein, Jacob; Levin, Michael; Collins, Linda; Navrozov, Lev; Guaspari, David; Venable, Bruce; Lund, Nelson; Wasserman, Adam",,English,"ISSN 0277-4720; The_St_Johns_Review_Vol_33_No_1_1981",,,,,,,,,"88 pages",,,,,,,,,,paper,,,,,,,,,,,,,,,,,,,,,,,,,,"St. John's Review",https://s3.us-east-1.amazonaws.com/sjcdigitalarchives/original/c292c191a062a62a27723f1b738d29e2.pdf,Text,"<em>The St. John's Review</em>",1,0
892,https://digitalarchives.sjc.edu/items/show/892,"Formal Lecture/Concert Schedule - 1981-82","Schedule of lectures and concerts for the 1981-1982 Academic Year (duplicate pages included).","Office of the Dean","St. John's College","Annapolis, MD",1981-1982,"St. John's College owns the rights to this publication.",text,pdf,,,"Sparrow, Edward G.; Vona, Daniel O.; Sachs, Joe; Harré, Rom; Kass, Leon; Smith, Brother Robert; Lerner, Ralph; Banchoff, Thomas; Mullen, William; Allanbrook, Douglas; May, Thomas; Adler, Mortimer Jerome, 1902-2001; Darkey, William A.; Slakey, Thomas; Berns, Gisela N.; Taylor, Kent; Gray, Donald; Tobias, Paul; Moschetti, Elizabeth; Platt, Michael; O'Grady, William; Rorty, Richard; Blistein, Burton; Feldman, Gordon; Roche, Paul; King William Players","October 2, 1981. Sachs, Joe. <a href=""http://digitalarchives.sjc.edu/items/show/3723"" title=""The fury of Aeneas"">The fury of Aeneas</a> (typescript); February 26, 1982. Berns, Gisela. <a href=""http://digitalarchives.sjc.edu/items/show/1083"" title=""Schiller's drama"">Schiller's drama</a> (audio); February 26, 1982. Berns, Gisela. <a href=""http://digitalarchives.sjc.edu/items/show/1089"" title=""Schiller's drama"">Schiller's drama</a> (typescript)",,"Lecture Schedule 1981-1982",,,,,,,,,"2 pages",,,,,,,,,,paper,,,,,,,,,,,,,,,,,,,,,,,,,,"Friday night lecture,Lecture schedule",https://s3.us-east-1.amazonaws.com/sjcdigitalarchives/original/a7119724811165e3d68725d77e98425b.pdf,Text,"St. John's College Formal Lecture Series—Annapolis",1,0
493,https://digitalarchives.sjc.edu/items/show/493,"The St. John's Review (formerly The College), Winter 1982","Volume XXXIII, Number 2 of The St. John's Review, formerly The College.  Published in Winter 1982.","Office of the Dean","St. John's College","Annapolis, MD",1982-01,"St. John's College owns the rights to this publication.",text,pdf,,,"Radista, Leo; Parran, Jr., Thomas; Durholz, Janet; Bolotin, David;  Wilson, Curtis A.; Sachs, Joe; Allanbrook, Wye Jamison; Brann, Eva T. H.; Dennison, George; Mullen, William; Loewenberg, Robert; Smith, Brother Robert; Bell, Charles G.; Le Gloannecc, Anne-Marie; Josephs, Laurence; Montanelli, Indro; Collins, Arthur; Dulich, Jean; Navrozov, Lev",,English,"ISSN 0277-4720; The_St_Johns_Review_Vol_33_No_2_1982",,,,,,,,,"113 pages",,,,,,,,,,paper,,,,,,,,,,,,,,,,,,,,,,,,,,"St. John's Review",https://s3.us-east-1.amazonaws.com/sjcdigitalarchives/original/ac2f882eef7a07c42b5b5fc6bc838719.pdf,Text,"<em>The St. John's Review</em>",1,0
494,https://digitalarchives.sjc.edu/items/show/494,"The St. John's Review (formerly The College), Summer 1982","Volume XXXIII, Number 3 of The St. John's Review, formerly The College.  Published in Summer 1982.","Office of the Dean","St. John's College","Annapolis, MD",1982-07,"St. John's College owns the rights to this publication.",text,pdf,,,"Radista, Leo; Parran, Jr., Thomas; Carnes, David; Durholz, Janet; Bolotin, David;  Wilson, Curtis A.; Sachs, Joe; Brann, Eva T. H.; Smith, J. Winfree; Berns, Gisela; Landau, Julie; Loewenberg, Robert; Holt, Philip; Slakey, Thomas J.; Navrozov, Lev",,English,"ISSN 0277-4720; The_St_Johns_Review_Vol_33_No_3_1982",,,,,,,,,"72 pages",,,,,,,,,,paper,,,,,,,,,,,,,,,,,,,,,,,,,,"St. John's Review",https://s3.us-east-1.amazonaws.com/sjcdigitalarchives/original/ba76a93042d876ca41a3395a9207d116.pdf,Text,"<em>The St. John's Review</em>",1,0
495,https://digitalarchives.sjc.edu/items/show/495,"The St. John's Review (formerly The College), Autumn/Winter 1982-83","Volume XXXIV, Number 1 of The St. John's Review, formerly The College.  Published in Autumn/Winter 1982-1983.","Office of the Dean","St. John's College","Annapolis, MD","1982-10; 1983-01","St. John's College owns the rights to this publication.",text,pdf,,,"Radista, Leo; Parran, Jr., Thomas; Carnes, David; Bolotin, David;  Wilson, Curtis A.; Sachs, Joe; Alexander, Sidney; Brann, Eva T. H.",,English,"ISSN 0277-4720; The_St_Johns_Review_Vol_34_No_1_1982-1983",,,,,,,,,"112 pages",,,,,,,,,,paper,,,,,,,,,,,,,,,,,,,,,,,,,,"St. John's Review",https://s3.us-east-1.amazonaws.com/sjcdigitalarchives/original/6d66f4e9b03c3d40ac2c638ecf38bcd1.pdf,Text,"<em>The St. John's Review</em>",1,0
891,https://digitalarchives.sjc.edu/items/show/891,"Formal Lecture/Concert Schedule - 1982-83","Schedule of lectures and concerts for the 1982-1983 Academic Year.","Office of the Dean","St. John's College","Annapolis, MD",1982-1983,"St. John's College owns the rights to this publication.",text,pdf,,,"Kutler, Samuel S.; Sachs, Joe; Knox, Bernard, 1914-2010; Smith, J. Winfree; Bonner, J. T.; Wilson, James Q.; Lenkowski, John; Bolotin, David, 1944-; DeGrazia, Joseph; Davis, Ellen; Nussbaum, Martha Craven, 1947-; Allanbrook, Douglas; Brann, Eva T. H.; O'Grady, William; Stendhal, Krister; Raditsa, Leo; Miller, Malcolm B., 1933-; Carey, James; Adler, Mortimer Jerome, 1902-2001; Stephenson, David; Lederer, Wolfgang, 1912-2003; Arnott, Peter; King William Players","September 24, 1982. Sachs, Joe. <a href=""http://digitalarchives.sjc.edu/items/show/3715"" title=""The parable of Don Quixote"">The parable of Don Quixote</a> (audio); September 24, 1982. Sachs, Joe. <a href=""http://digitalarchives.sjc.edu/items/show/3716"" title=""The parable of Don Quixote"">The parable of Don Quixote</a> (typescript); February 18, 1983. Brann, Eva T. H. <a href=""http://digitalarchives.sjc.edu/items/show/263"" title=""Against time (part one)"">Against time (part one)</a> (audio); February 25, 1983. Brann, Eva T. H. <a href=""http://digitalarchives.sjc.edu/items/show/316"" title=""Against time (part two)"">Against time (part two)</a> (audio); February 18 &amp; 25, 1983. Brann, Eva T. H. <a href=""http://digitalarchives.sjc.edu/items/show/1240"" title=""Against time"">Against time</a> (text)",,"Lecture Schedule 1982-1983",,,,,,,,,"6 pages",,,,,,,,,,paper,,,,,,,,,,,,,,,,,,,,,,,,,,"Friday night lecture,Lecture schedule",https://s3.us-east-1.amazonaws.com/sjcdigitalarchives/original/95564fa89a37ce6267273abc3b43ded6.pdf,Text,"St. John's College Formal Lecture Series—Annapolis",1,0
496,https://digitalarchives.sjc.edu/items/show/496,"The St. John's Review (formerly The College), Winter/Spring 1983","Volume XXXIV, Number 2 of The St. John's Review, formerly The College.  Published in Winter/Spring 1983.","Office of the Dean","St. John's College","Annapolis, MD","1983-01; 1983-04","St. John's College owns the rights to this publication.",text,pdf,,,"Radista, Leo; Parran, Jr., Thomas; Lord, Susan; Bolotin, David;  Wilson, Curtis A.; Sachs, Joe; Aldanov, Mark; Carmichael, Joel; Brann, Eva T. H.; Himmelfarb, Gertrude; Collins, Arthur; Zuckerman, Elliott; Isaac, Rael-Jean and Erich; Holmes, Stephen; Hadas, Rachel; Ferrero, Guiglielmo; Mosca, Gaetano; Mongardini, Carlo; Ardrey, Daniel ; Jones, Gregory S.; Kocsis, Joan",,English,"ISSN 0277-4720; The_St_Johns_Review_Vol_34_No_2_1983",,,,,,,,,"141 pages",,,,,,,,,,paper,,,,,,,,,,,,,,,,,,,,,,,,,,"St. John's Review",https://s3.us-east-1.amazonaws.com/sjcdigitalarchives/original/a0267766e95d1b5ad744fc7f69b354d7.pdf,Text,"<em>The St. John's Review</em>",1,0
497,https://digitalarchives.sjc.edu/items/show/497,"The St. John's Review (formerly The College), Summer 1983","Volume XXXIV, Number 3 of The St. John's Review, formerly The College.  Published in Summer 1983.","Office of the Dean","St. John's College","Annapolis, MD",1983-07,"St. John's College owns the rights to this publication.",text,pdf,,,"Sterling, J. Walter; Parran, Jr., Thomas; Lord, Susan; Fried, S. Richard; Sachs, Joe; Stickney, Cary;  Wilson, Curtis A.; Sachs, Joe; Allanbrook, Douglas; Brann, Eva T. H.; Beall, J. H.; Cantor, Paul A.; de Grazia, Margreta; Zelenka, Robert S.; Webb, James; Dry, Murray; Macshler, Chaninah",,English,"ISSN 0277-4720; The_St_Johns_Review_Vol_34_No_3_1983",,,,,,,,,"104 pages",,,,,,,,,,paper,,,,,,,,,,,,,,,,,,,,,,,,,,"St. John's Review",https://s3.us-east-1.amazonaws.com/sjcdigitalarchives/original/30ea48378abc1d2e812e22a1dd443cea.pdf,Text,"<em>The St. John's Review</em>",1,0
499,https://digitalarchives.sjc.edu/items/show/499,"The St. John's Review (formerly The College), Winter 1984","Volume XXXV, number 1 of The St. John's Review, formerly The College.  Published in Winter 1984.","Office of the Dean","St. John's College","Annapolis, MD",1984-01,"St. John's College owns the rights to this publication.",text,pdf,,,"Sterling, J. Walter; Parran, Jr., Thomas; Lord, Susan; Freis, S. Richard; Sachs, Joe; Stickney, Cary; Wilson, Curtis A.; Sachs, Joe; Brann, Eva T. H.; von Oppen, Beate Ruhm; Kojeve, Alexandre; Lederer, Wolfgang; Zuckerman, Elliott; Carey, James; Fontaine, John; Darkey, William A. ",,English,"ISSN 0277-4720; The_St_Johns_Review_Vol_35_No_1_1984",,,,,,,,,"64 pages",,,,,,,,,,paper,,,,,,,,,,,,,,,,,,,,,,,,,,"St. John's Review",https://s3.us-east-1.amazonaws.com/sjcdigitalarchives/original/6dad157c7a87e6080aaecc97612892a1.pdf,Text,"<em>The St. John's Review</em>",1,0
500,https://digitalarchives.sjc.edu/items/show/500,"The St. John's Review (formerly The College), Spring 1984","Volume XXXV, number 2 of The St. John's Review, formerly The College.  Published in Spring 1984.","Office of the Dean","St. John's College","Annapolis, MD",1984-04,"St. John's College owns the rights to this publication.",text,pdf,,,"Sterling, J. Walter; Parran, Jr., Thomas; Lord, Susan; Freis, S. Richard; Sachs, Joe; Stickney, Cary; Wilson, Curtis A.; Sachs, Joe; Allanbrook, Douglas; Brann, Eva T. H.; Berg, Gretchen; Berman, Ronald; Stephenson, David; Mensch, James; Flaumenhaft, Mera; Klein, Jacob; Spaeth, Robert L.",,English,"ISSN 0277-4720; The_St_Johns_Review_Vol_35_No_2_1984",,,,,,,,,"76 pages",,,,,,,,,,paper,,,,,,,,,,,,,,,,,,,,,,,,,,"St. John's Review",https://s3.us-east-1.amazonaws.com/sjcdigitalarchives/original/0cfdf4b66c5ee4f1d0fc4f9424e1a900.pdf,Text,"<em>The St. John's Review</em>",1,0
501,https://digitalarchives.sjc.edu/items/show/501,"The St. John's Review (formerly The College), Summer 1984","Volume XXXV, number 3 of The St. John's Review, formerly The College.  Published in Summer 1984.","Office of the Dean","St. John's College","Annapolis, MD",1984-07,"St. John's College owns the rights to this publication.",text,pdf,,,"Sterling, J. Walter; Parran, Jr., Thomas; Walsh, Jason; Freis, S. Richard; Sachs, Joe; Stickney, Cary; Wilson, Curtis A.; Sachs, Joe; Brann, Eva T. H.; Killorin, Joseph; Buchanan, Scott; Thompson, William; Klein, Jacob; Zuckerman, Elliot; Kieffer, John S.; Zuckerkandl, Victor; Smith, J. Winfree; Middleton, Arthur Pierce; Fletcher, Charlotte; Berg, Gretchen",,English,"ISSN 0277-4720; The_St_Johns_Review_Vol_35_No_3_1984",,,,,,,,,"68 pages",,,,,,,,,,paper,,,,,,,,,,,,,,,,,,,,,,,,,,"St. John's Review",https://s3.us-east-1.amazonaws.com/sjcdigitalarchives/original/608f19dce5e2e91219b859731230b3bf.pdf,Text,"<em>The St. John's Review</em>",1,0
502,https://digitalarchives.sjc.edu/items/show/502,"The St. John's Review (formerly The College), Winter 1985","Volume XXXVI, number 1 of The St. John's Review, formerly The College.  Published in Winter 1985.","Office of the Dean","St. John's College","Annapolis, MD",1985-01,"St. John's College owns the rights to this publication.",text,pdf,,,"Sterling, J. Walter; Freis, Richard; Walsh, Jason; Freis, S. Richard; Sachs, Joe; Stickney, Cary; Wilson, Curtis A.; Sachs, Joe; Brann, Eva T. H.; Kates, J.; Engelberg, Joseph; Zuckerman, Elliot; Fain, Susan; Fisher, Howard J.; Kalkavage, Peter; Maschler, Chaninah",,English,"ISSN 0277-4720; The_St_Johns_Review_Vol_36_No_1_1985",,,,,,,,,"80 pages",,,,,,,,,,paper,,,,,,,,,,,,,,,,,,,,,,,,,,"St. John's Review",https://s3.us-east-1.amazonaws.com/sjcdigitalarchives/original/c90e86698867d0d27ae95eae9b7ed48f.pdf,Text,"<em>The St. John's Review</em>",1,0
503,https://digitalarchives.sjc.edu/items/show/503,"The St. John's Review (formerly The College), Spring 1985","Volume XXXVI, number 2 of The St. John's Review, formerly The College.  Published in Spring 1985.","Office of the Dean","St. John's College","Annapolis, MD",1985-04,"St. John's College owns the rights to this publication.",text,pdf,,,"Sterling, J. Walter; Kronsberg, Anita; Freis, Richard; Freis, S. Richard; Sachs, Joe; Stickney, Cary; Wilson, Curtis A.; Sachs, Joe; Brann, Eva T. H.; Zuckerman, Elliot; Clark, Allen; Strauss, Leo; Coughlin, M.L.; Benardete, Seth; von Oppen, Beate Ruhm; Dublin, Max",,English,"ISSN 0277-4720; The_St_Johns_Review_Vol_36_No_2_1985",,,,,,,,,"64 pages",,,,,,,,,,paper,,,,,,,,,,,,,,,,,,,,,,,,,,"St. John's Review",https://s3.us-east-1.amazonaws.com/sjcdigitalarchives/original/23a59cf8453a88cc0bfcdcde76e38def.pdf,Text,"<em>The St. John's Review</em>",1,0
504,https://digitalarchives.sjc.edu/items/show/504,"The St. John's Review (formerly The College), Summer 1985","Volume XXXVI, number 3 of The St. John's Review, formerly The College.  Published in Summer 1985.","Office of the Dean","St. John's College","Annapolis, MD",1985-07,"St. John's College owns the rights to this publication.",text,pdf,,,"Sterling, J. Walter; Coughlin, Maria; Freis, Richard; Freis, S. Richard; Sachs, Joe; Stickney, Cary; Wilson, Curtis A.; Sachs, Joe; Allanbrook, Wye Jamison; Brann, Eva T. H.; Alvis, John; Arnhart, Larry; Weatherman, Donald V.; Flaumenhaft, Mera ; Fletcher, Charlotte; Smith, Brother Robert; Benardete, Seth; Blitz, Jan H.",,English,"ISSN 0277-4720; The_St_Johns_Review_Vol_36_No_3_1985",,,,,,,,,"121 pages",,,,,,,,,,paper,,,,,,,,,,,,,,,,,,,,,,,,,,"St. John's Review",https://s3.us-east-1.amazonaws.com/sjcdigitalarchives/original/5facd3e5c2febc390d1ba36308053edc.pdf,Text,"<em>The St. John's Review</em>",1,0
505,https://digitalarchives.sjc.edu/items/show/505,"The St. John's Review (formerly The College), Winter 1986","Volume XXXVII, number 1 of The St. John's Review, formerly The College.  Published in Winter 1986.","Office of the Dean","St. John's College","Annapolis, MD",1986-01,"St. John's College owns the rights to this publication.",text,pdf,,,"Sterling, J. Walter; Coughlin, Maria; Freis, Richard; Freis, S. Richard; Sachs, Joe; Stickney, Cary; Wilson, Curtis A.; Sachs, Joe; Brann, Eva T. H.; O'Grady, William; Bart, Robert; Higuera, Marilyn; Littleton, Michael; Buchenauer, Nancy; Doskow, George; LeCuyer, Phil; Sparrow, Edward; Durgin, Frank; Dink, Michael; Rustan, Paula; Cohen, Martin; Jones, Mary Hannah",,English,"ISSN 0277-4720; The_St_Johns_Review_Vol_37_No_1_1986",,,,,,,,,"142 pages",,,,,,,,,,paper,,,,,,,,,,,,,,,,,,,,,,,,,,"St. John's Review",https://s3.us-east-1.amazonaws.com/sjcdigitalarchives/original/460b9dac86a6e54cf1967133f734c8b1.pdf,Text,"<em>The St. John's Review</em>",1,0
506,https://digitalarchives.sjc.edu/items/show/506,"The St. John's Review (formerly The College), Spring 1986","Volume XXXVII, number 2 and 3 of The St. John's Review, formerly The College.  Published in Spring 1986.","Office of the Dean","St. John's College","Annapolis, MD",1986-04,"St. John's College owns the rights to this publication.",text,pdf,,,"Sterling, J. Walter; Coughlin, Maria; Freis, Richard; Freis, S. Richard; Sachs, Joe; Stickney, Cary; Wilson, Curtis A.; Sachs, Joe; Allanbrook, Douglas; Brann, Eva T. H.; Jones, Mary Hannah; Littleton, Michael; Bart, Robert S.; Goerner, E.A.; Harris, Geoffery; Riezler, Kurt; Lenkowski, Jon",,English,"ISSN 0277-4720; The_St_Johns_Review_Vol_37_No_2-3_1986",,,,,,,,,"110 pages",,,,,,,,,,paper,,,,,,,,,,,,,,,,,,,,,,,,,,"St. John's Review",https://s3.us-east-1.amazonaws.com/sjcdigitalarchives/original/925fe3a2ced3927fb49e5863e2bd1667.pdf,Text,"<em>The St. John's Review</em>",1,0
887,https://digitalarchives.sjc.edu/items/show/887,"Lecture/Concert Schedule - First Semester 1986-87 & Second Semester 1986-87","Schedule of lectures and concerts for the 1986-1987 Academic Year.","Office of the Dean","St. John's College","Annapolis, MD",1986-1987,"St. John's College owns the rights to this publication.",text,pdf,,,"Slakey, Thomas; Goldwin, Robert A., 1922-2010; Higuera, Henry, 1952-; Bart, Robert S.; Comenetz, Michael, 1944-; Sachs, Joe; Culler, Jonathan D.; Baker, Houston A., Jr., 1943-; Sparrow, Edward; Berns, Laurence, 1928-; Bolotin, David, 1944-; Banchoff, Thomas; Venable, Bruce; MacIntyre, Alasdair C.; Adler, Mortimer Jerome, 1902-2001; Hartle, Ann; Greenberg, Alan; Zuckerman, Elliott; Kraus, Pamela; Van Herik, Judith; Jones, Charles; Sterling, Walter; Arnott, Peter; King William Players","October 24, 1986. Sachs, Joe. <a href=""http://digitalarchives.sjc.edu/items/show/3717"" title=""God of Abraham, Isaac, and Jacob."">God of Abraham, Isaac, and Jacob.</a> (audio); October 24, 1986. Sachs, Joe. <a href=""http://digitalarchives.sjc.edu/items/show/3718"" title=""God of Abraham, Isaac, and Jacob."">God of Abraham, Isaac, and Jacob.</a> (typescript)",,"Lecture Schedule 1986-1987",,,,,,,,,"3 pages",,,,,,,,,,paper,,,,,,,,,,,,,,,,,,,,,,,,,,"Friday night lecture,Lecture schedule",https://s3.us-east-1.amazonaws.com/sjcdigitalarchives/original/b2b4e400a3963da3994b764f207d8d3a.pdf,Text,"St. John's College Formal Lecture Series—Annapolis",1,0
