﻿"Item Id","Item URI","Dublin Core:Title","Dublin Core:Description","Dublin Core:Creator","Dublin Core:Publisher","Dublin Core:Coverage","Dublin Core:Date","Dublin Core:Rights","Dublin Core:Type","Dublin Core:Format","Dublin Core:Source","Dublin Core:Subject","Dublin Core:Contributor","Dublin Core:Relation","Dublin Core:Language","Dublin Core:Identifier","Item Type Metadata:Occupation","Item Type Metadata:Participants","Item Type Metadata:Death Date","Item Type Metadata:Birthplace","Item Type Metadata:Birth Date","Item Type Metadata:Interviewer","Item Type Metadata:Biographical Text","Item Type Metadata:Bibliography","Item Type Metadata:Page numeration","Item Type Metadata:Resolution","Item Type Metadata:Identifier","Item Type Metadata:Inventory","Item Type Metadata:URL","Item Type Metadata:Text","Item Type Metadata:Interviewee","Item Type Metadata:Location","Item Type Metadata:Transcription","Item Type Metadata:Local URL","Item Type Metadata:Original Format","Item Type Metadata:Physical Dimensions","Item Type Metadata:Duration","Item Type Metadata:Compression","Item Type Metadata:Producer","Item Type Metadata:Director","Item Type Metadata:Bit Rate/Frequency","Item Type Metadata:Email Body","Item Type Metadata:Event Type","Item Type Metadata:Lesson Plan Text","Item Type Metadata:Materials","Item Type Metadata:Objectives","Item Type Metadata:Standards","Item Type Metadata:Number of Attachments","Item Type Metadata:BCC","Item Type Metadata:CC","Item Type Metadata:To","Item Type Metadata:From","Item Type Metadata:Subject Line","Item Type Metadata:Time Summary","Item Type Metadata:Episode","Item Type Metadata:Season","Item Type Metadata:Episode Type","Item Type Metadata:Explicit","Item Type Metadata:Block","PDF Text:Text",tags,file,itemType,collection,public,featured
509,https://digitalarchives.sjc.edu/items/show/509,"The St. John's Review, 1988-89/3","Volume XXXVIII, number three of The St. John's Review.  Published in 1989.","Office of the Dean","St. John's College","Annapolis, MD",1988-1989,"St. John's College owns the rights to this publication.",text,pdf,,,"Zuckerman, Elliott; Ruhm von Oppen, Beate; Stickney, Cary; Van Doren, John; Williamson, Robert B.; Routt, Deidre; Sachs, Joe; Brann, Eva T. H.; Pesic, Peter D. ; Kutler, Samuel S.; Rooney, Melinda; Pickens, Leo; Levy, Robert J.; Ferrier, Richard",,English,"ISSN 0277-4720; The_St_Johns_Review_Vol_38_No_3_1988-1989",,,,,,,,,"87 pages",,,,,,,,,,paper,,,,,,,,,,,,,,,,,,,,,,,,,,"St. John's Review",https://s3.us-east-1.amazonaws.com/sjcdigitalarchives/original/3090c5f2e851a45cd5adea6b7a07bde5.pdf,Text,"<em>The St. John's Review</em>",1,0
508,https://digitalarchives.sjc.edu/items/show/508,"The St. John's Review, 1988/2","Volume XXXVIII, number two of The St. John's Review.  Published in 1988.","Office of the Dean","St. John's College","Annapolis, MD",1988,"St. John's College owns the rights to this publication.",text,pdf,,,"Zuckerman, Elliott; Ruhm von Oppen, Beate; Stickney, Cary; Van Doren, John; Williamson, Robert B.; Sachs, Joe; Achtenberg, Deborah; Brann, Eva T. H.; Zeiderman, Howard; Tuck, Johnathan; Wilson, Curtis; Loring, Carolyn Wade",,English,"ISSN 0277-4720; The_St_Johns_Review_Vol_38_No_2_1988",,,,,,,,,"81 pages",,,,,,,,,,paper,,,,,,,,,,,,,,,,,,,,,,,,,,"St. John's Review",https://s3.us-east-1.amazonaws.com/sjcdigitalarchives/original/b20a694177aaf6a881dda8f670000d9c.pdf,Text,"<em>The St. John's Review</em>",1,0
507,https://digitalarchives.sjc.edu/items/show/507,"The St. John's Review, 1988/1","Volume XXXVIII, number one of The St. John's Review.  Published in 1988.","Office of the Dean","St. John's College","Annapolis, MD",1988,"St. John's College owns the rights to this publication.",text,pdf,,,"Zuckerman, Elliott; Ruhm von Oppen, Beate; Stickney, Cary; Van Doren, John; Williamson, Robert B.; Lavery, John; Sachs, Joe; Allanbrook, Douglas; Allanbrook, Wye Jamison; Brann, Eva T. H.; Smith, J. Winfree; Colston, Ken",,English,"ISSN 0277-4720; The_St_Johns_Review_Vol_38_No_1_1988",,,,,,,,,"79 pages",,,,,,,,,,paper,,,,,,,,,,,,,,,,,,,,,,,,,,"St. John's Review",https://s3.us-east-1.amazonaws.com/sjcdigitalarchives/original/e135a839d3f5734df662dac67d615f9f.pdf,Text,"<em>The St. John's Review</em>",1,0
506,https://digitalarchives.sjc.edu/items/show/506,"The St. John's Review (formerly The College), Spring 1986","Volume XXXVII, number 2 and 3 of The St. John's Review, formerly The College.  Published in Spring 1986.","Office of the Dean","St. John's College","Annapolis, MD",1986-04,"St. John's College owns the rights to this publication.",text,pdf,,,"Sterling, J. Walter; Coughlin, Maria; Freis, Richard; Freis, S. Richard; Sachs, Joe; Stickney, Cary; Wilson, Curtis A.; Sachs, Joe; Allanbrook, Douglas; Brann, Eva T. H.; Jones, Mary Hannah; Littleton, Michael; Bart, Robert S.; Goerner, E.A.; Harris, Geoffery; Riezler, Kurt; Lenkowski, Jon",,English,"ISSN 0277-4720; The_St_Johns_Review_Vol_37_No_2-3_1986",,,,,,,,,"110 pages",,,,,,,,,,paper,,,,,,,,,,,,,,,,,,,,,,,,,,"St. John's Review",https://s3.us-east-1.amazonaws.com/sjcdigitalarchives/original/925fe3a2ced3927fb49e5863e2bd1667.pdf,Text,"<em>The St. John's Review</em>",1,0
505,https://digitalarchives.sjc.edu/items/show/505,"The St. John's Review (formerly The College), Winter 1986","Volume XXXVII, number 1 of The St. John's Review, formerly The College.  Published in Winter 1986.","Office of the Dean","St. John's College","Annapolis, MD",1986-01,"St. John's College owns the rights to this publication.",text,pdf,,,"Sterling, J. Walter; Coughlin, Maria; Freis, Richard; Freis, S. Richard; Sachs, Joe; Stickney, Cary; Wilson, Curtis A.; Sachs, Joe; Brann, Eva T. H.; O'Grady, William; Bart, Robert; Higuera, Marilyn; Littleton, Michael; Buchenauer, Nancy; Doskow, George; LeCuyer, Phil; Sparrow, Edward; Durgin, Frank; Dink, Michael; Rustan, Paula; Cohen, Martin; Jones, Mary Hannah",,English,"ISSN 0277-4720; The_St_Johns_Review_Vol_37_No_1_1986",,,,,,,,,"142 pages",,,,,,,,,,paper,,,,,,,,,,,,,,,,,,,,,,,,,,"St. John's Review",https://s3.us-east-1.amazonaws.com/sjcdigitalarchives/original/460b9dac86a6e54cf1967133f734c8b1.pdf,Text,"<em>The St. John's Review</em>",1,0
888,https://digitalarchives.sjc.edu/items/show/888,"Lecture/Concert Schedule - 1985-86","Schedule of lectures and concerts for the 1985-1986 Academic Year.","Office of the Dean","St. John's College","Annapolis, MD",1985-1986,"St. John's College owns the rights to this publication.",text,pdf,,,"Doskow, George; Reed, Robert; Brann, Eva T. H.; Lenkowski, Jon; Foley, Helen; Murray, Jo Ann, 1951-; Trimble, Virginia; Kutler, Samuel; Maschler, Chaninah, 1931-2014; Taylor, Kent; Perkins, Pheme; Umphrey, Stewart, 1942-; Charniak, Eugene; Dreyfus, Hubert L.; Buchanan, Bruce G.; Adler, Mortimer Jerome, 1902-2001; Carey, James; Jordan, Constance; Kirmmse, Bruce H.; Smith, Brother Robert; Salkever, Stephen G., 1943-; Mowatt, Barbara; Arnott, Peter; King William Players","September 27, 1985. Brann, Eva T. H. <a href=""http://digitalarchives.sjc.edu/items/show/1241"" title=""Mental imagery."">Mental imagery.</a>",,"Lecture Schedule 1985-1986",,,,,,,,,"4 pages",,,,,,,,,,paper,,,,,,,,,,,,,,,,,,,,,,,,,,"Friday night lecture,Lecture schedule",https://s3.us-east-1.amazonaws.com/sjcdigitalarchives/original/f9ea9ca9b8bcf69e0fd0d743f4baa0d2.pdf,Text,"St. John's College Formal Lecture Series—Annapolis",1,0
504,https://digitalarchives.sjc.edu/items/show/504,"The St. John's Review (formerly The College), Summer 1985","Volume XXXVI, number 3 of The St. John's Review, formerly The College.  Published in Summer 1985.","Office of the Dean","St. John's College","Annapolis, MD",1985-07,"St. John's College owns the rights to this publication.",text,pdf,,,"Sterling, J. Walter; Coughlin, Maria; Freis, Richard; Freis, S. Richard; Sachs, Joe; Stickney, Cary; Wilson, Curtis A.; Sachs, Joe; Allanbrook, Wye Jamison; Brann, Eva T. H.; Alvis, John; Arnhart, Larry; Weatherman, Donald V.; Flaumenhaft, Mera ; Fletcher, Charlotte; Smith, Brother Robert; Benardete, Seth; Blitz, Jan H.",,English,"ISSN 0277-4720; The_St_Johns_Review_Vol_36_No_3_1985",,,,,,,,,"121 pages",,,,,,,,,,paper,,,,,,,,,,,,,,,,,,,,,,,,,,"St. John's Review",https://s3.us-east-1.amazonaws.com/sjcdigitalarchives/original/5facd3e5c2febc390d1ba36308053edc.pdf,Text,"<em>The St. John's Review</em>",1,0
503,https://digitalarchives.sjc.edu/items/show/503,"The St. John's Review (formerly The College), Spring 1985","Volume XXXVI, number 2 of The St. John's Review, formerly The College.  Published in Spring 1985.","Office of the Dean","St. John's College","Annapolis, MD",1985-04,"St. John's College owns the rights to this publication.",text,pdf,,,"Sterling, J. Walter; Kronsberg, Anita; Freis, Richard; Freis, S. Richard; Sachs, Joe; Stickney, Cary; Wilson, Curtis A.; Sachs, Joe; Brann, Eva T. H.; Zuckerman, Elliot; Clark, Allen; Strauss, Leo; Coughlin, M.L.; Benardete, Seth; von Oppen, Beate Ruhm; Dublin, Max",,English,"ISSN 0277-4720; The_St_Johns_Review_Vol_36_No_2_1985",,,,,,,,,"64 pages",,,,,,,,,,paper,,,,,,,,,,,,,,,,,,,,,,,,,,"St. John's Review",https://s3.us-east-1.amazonaws.com/sjcdigitalarchives/original/23a59cf8453a88cc0bfcdcde76e38def.pdf,Text,"<em>The St. John's Review</em>",1,0
502,https://digitalarchives.sjc.edu/items/show/502,"The St. John's Review (formerly The College), Winter 1985","Volume XXXVI, number 1 of The St. John's Review, formerly The College.  Published in Winter 1985.","Office of the Dean","St. John's College","Annapolis, MD",1985-01,"St. John's College owns the rights to this publication.",text,pdf,,,"Sterling, J. Walter; Freis, Richard; Walsh, Jason; Freis, S. Richard; Sachs, Joe; Stickney, Cary; Wilson, Curtis A.; Sachs, Joe; Brann, Eva T. H.; Kates, J.; Engelberg, Joseph; Zuckerman, Elliot; Fain, Susan; Fisher, Howard J.; Kalkavage, Peter; Maschler, Chaninah",,English,"ISSN 0277-4720; The_St_Johns_Review_Vol_36_No_1_1985",,,,,,,,,"80 pages",,,,,,,,,,paper,,,,,,,,,,,,,,,,,,,,,,,,,,"St. John's Review",https://s3.us-east-1.amazonaws.com/sjcdigitalarchives/original/c90e86698867d0d27ae95eae9b7ed48f.pdf,Text,"<em>The St. John's Review</em>",1,0
501,https://digitalarchives.sjc.edu/items/show/501,"The St. John's Review (formerly The College), Summer 1984","Volume XXXV, number 3 of The St. John's Review, formerly The College.  Published in Summer 1984.","Office of the Dean","St. John's College","Annapolis, MD",1984-07,"St. John's College owns the rights to this publication.",text,pdf,,,"Sterling, J. Walter; Parran, Jr., Thomas; Walsh, Jason; Freis, S. Richard; Sachs, Joe; Stickney, Cary; Wilson, Curtis A.; Sachs, Joe; Brann, Eva T. H.; Killorin, Joseph; Buchanan, Scott; Thompson, William; Klein, Jacob; Zuckerman, Elliot; Kieffer, John S.; Zuckerkandl, Victor; Smith, J. Winfree; Middleton, Arthur Pierce; Fletcher, Charlotte; Berg, Gretchen",,English,"ISSN 0277-4720; The_St_Johns_Review_Vol_35_No_3_1984",,,,,,,,,"68 pages",,,,,,,,,,paper,,,,,,,,,,,,,,,,,,,,,,,,,,"St. John's Review",https://s3.us-east-1.amazonaws.com/sjcdigitalarchives/original/608f19dce5e2e91219b859731230b3bf.pdf,Text,"<em>The St. John's Review</em>",1,0
500,https://digitalarchives.sjc.edu/items/show/500,"The St. John's Review (formerly The College), Spring 1984","Volume XXXV, number 2 of The St. John's Review, formerly The College.  Published in Spring 1984.","Office of the Dean","St. John's College","Annapolis, MD",1984-04,"St. John's College owns the rights to this publication.",text,pdf,,,"Sterling, J. Walter; Parran, Jr., Thomas; Lord, Susan; Freis, S. Richard; Sachs, Joe; Stickney, Cary; Wilson, Curtis A.; Sachs, Joe; Allanbrook, Douglas; Brann, Eva T. H.; Berg, Gretchen; Berman, Ronald; Stephenson, David; Mensch, James; Flaumenhaft, Mera; Klein, Jacob; Spaeth, Robert L.",,English,"ISSN 0277-4720; The_St_Johns_Review_Vol_35_No_2_1984",,,,,,,,,"76 pages",,,,,,,,,,paper,,,,,,,,,,,,,,,,,,,,,,,,,,"St. John's Review",https://s3.us-east-1.amazonaws.com/sjcdigitalarchives/original/0cfdf4b66c5ee4f1d0fc4f9424e1a900.pdf,Text,"<em>The St. John's Review</em>",1,0
499,https://digitalarchives.sjc.edu/items/show/499,"The St. John's Review (formerly The College), Winter 1984","Volume XXXV, number 1 of The St. John's Review, formerly The College.  Published in Winter 1984.","Office of the Dean","St. John's College","Annapolis, MD",1984-01,"St. John's College owns the rights to this publication.",text,pdf,,,"Sterling, J. Walter; Parran, Jr., Thomas; Lord, Susan; Freis, S. Richard; Sachs, Joe; Stickney, Cary; Wilson, Curtis A.; Sachs, Joe; Brann, Eva T. H.; von Oppen, Beate Ruhm; Kojeve, Alexandre; Lederer, Wolfgang; Zuckerman, Elliott; Carey, James; Fontaine, John; Darkey, William A. ",,English,"ISSN 0277-4720; The_St_Johns_Review_Vol_35_No_1_1984",,,,,,,,,"64 pages",,,,,,,,,,paper,,,,,,,,,,,,,,,,,,,,,,,,,,"St. John's Review",https://s3.us-east-1.amazonaws.com/sjcdigitalarchives/original/6dad157c7a87e6080aaecc97612892a1.pdf,Text,"<em>The St. John's Review</em>",1,0
890,https://digitalarchives.sjc.edu/items/show/890,"Formal Lecture/Concert Schedule 1983-84","Schedule of lectures and concerts for the 1983-1984 Academic Year.","Office of the Dean","St. John's College","Annapolis, MD",1983-1984,"St. John's College owns the rights to this publication.",text,pdf,,,"Kutler, Samual S.; Flaumenhaft, Mera J.; Goldwin, Robert A., 1922-2010; Bell, Charles; Stickney, Carey; Brann, Eva T. H.; Benardete, José A. (José Amado); Coppinger, Raymond; Morris, Richard; Mullen, William; Gray, Judith; Beall, James; Bremer, John; Adler, Mortimer Jerome, 1902-2001; Fortin, Ernest L.; Smit, Leo; Fisher, Howard; Kalkavage, Peter; Allanbrook, Wendy; Banks, William; Zuckerman, Elliott; Barolsky, Paul, 1941-; Arnott, Peter; King William Players","April 13, 1984. Kalkavage, Peter. <a href=""http://digitalarchives.sjc.edu/items/show/3809"" title=""The song of Timaeus"">The song of Timaeus</a>",,"Lecture Schedule 1983-1984",,,,,,,,,"2 pages",,,,,,,,,,paper,,,,,,,,,,,,,,,,,,,,,,,,,,"Friday night lecture,Lecture schedule",https://s3.us-east-1.amazonaws.com/sjcdigitalarchives/original/e5d86b4e8055db24f84bd06b85fe56de.pdf,Text,"St. John's College Formal Lecture Series—Annapolis",1,0
497,https://digitalarchives.sjc.edu/items/show/497,"The St. John's Review (formerly The College), Summer 1983","Volume XXXIV, Number 3 of The St. John's Review, formerly The College.  Published in Summer 1983.","Office of the Dean","St. John's College","Annapolis, MD",1983-07,"St. John's College owns the rights to this publication.",text,pdf,,,"Sterling, J. Walter; Parran, Jr., Thomas; Lord, Susan; Fried, S. Richard; Sachs, Joe; Stickney, Cary;  Wilson, Curtis A.; Sachs, Joe; Allanbrook, Douglas; Brann, Eva T. H.; Beall, J. H.; Cantor, Paul A.; de Grazia, Margreta; Zelenka, Robert S.; Webb, James; Dry, Murray; Macshler, Chaninah",,English,"ISSN 0277-4720; The_St_Johns_Review_Vol_34_No_3_1983",,,,,,,,,"104 pages",,,,,,,,,,paper,,,,,,,,,,,,,,,,,,,,,,,,,,"St. John's Review",https://s3.us-east-1.amazonaws.com/sjcdigitalarchives/original/30ea48378abc1d2e812e22a1dd443cea.pdf,Text,"<em>The St. John's Review</em>",1,0
496,https://digitalarchives.sjc.edu/items/show/496,"The St. John's Review (formerly The College), Winter/Spring 1983","Volume XXXIV, Number 2 of The St. John's Review, formerly The College.  Published in Winter/Spring 1983.","Office of the Dean","St. John's College","Annapolis, MD","1983-01; 1983-04","St. John's College owns the rights to this publication.",text,pdf,,,"Radista, Leo; Parran, Jr., Thomas; Lord, Susan; Bolotin, David;  Wilson, Curtis A.; Sachs, Joe; Aldanov, Mark; Carmichael, Joel; Brann, Eva T. H.; Himmelfarb, Gertrude; Collins, Arthur; Zuckerman, Elliott; Isaac, Rael-Jean and Erich; Holmes, Stephen; Hadas, Rachel; Ferrero, Guiglielmo; Mosca, Gaetano; Mongardini, Carlo; Ardrey, Daniel ; Jones, Gregory S.; Kocsis, Joan",,English,"ISSN 0277-4720; The_St_Johns_Review_Vol_34_No_2_1983",,,,,,,,,"141 pages",,,,,,,,,,paper,,,,,,,,,,,,,,,,,,,,,,,,,,"St. John's Review",https://s3.us-east-1.amazonaws.com/sjcdigitalarchives/original/a0267766e95d1b5ad744fc7f69b354d7.pdf,Text,"<em>The St. John's Review</em>",1,0
891,https://digitalarchives.sjc.edu/items/show/891,"Formal Lecture/Concert Schedule - 1982-83","Schedule of lectures and concerts for the 1982-1983 Academic Year.","Office of the Dean","St. John's College","Annapolis, MD",1982-1983,"St. John's College owns the rights to this publication.",text,pdf,,,"Kutler, Samuel S.; Sachs, Joe; Knox, Bernard, 1914-2010; Smith, J. Winfree; Bonner, J. T.; Wilson, James Q.; Lenkowski, John; Bolotin, David, 1944-; DeGrazia, Joseph; Davis, Ellen; Nussbaum, Martha Craven, 1947-; Allanbrook, Douglas; Brann, Eva T. H.; O'Grady, William; Stendhal, Krister; Raditsa, Leo; Miller, Malcolm B., 1933-; Carey, James; Adler, Mortimer Jerome, 1902-2001; Stephenson, David; Lederer, Wolfgang, 1912-2003; Arnott, Peter; King William Players","September 24, 1982. Sachs, Joe. <a href=""http://digitalarchives.sjc.edu/items/show/3715"" title=""The parable of Don Quixote"">The parable of Don Quixote</a> (audio); September 24, 1982. Sachs, Joe. <a href=""http://digitalarchives.sjc.edu/items/show/3716"" title=""The parable of Don Quixote"">The parable of Don Quixote</a> (typescript); February 18, 1983. Brann, Eva T. H. <a href=""http://digitalarchives.sjc.edu/items/show/263"" title=""Against time (part one)"">Against time (part one)</a> (audio); February 25, 1983. Brann, Eva T. H. <a href=""http://digitalarchives.sjc.edu/items/show/316"" title=""Against time (part two)"">Against time (part two)</a> (audio); February 18 &amp; 25, 1983. Brann, Eva T. H. <a href=""http://digitalarchives.sjc.edu/items/show/1240"" title=""Against time"">Against time</a> (text)",,"Lecture Schedule 1982-1983",,,,,,,,,"6 pages",,,,,,,,,,paper,,,,,,,,,,,,,,,,,,,,,,,,,,"Friday night lecture,Lecture schedule",https://s3.us-east-1.amazonaws.com/sjcdigitalarchives/original/95564fa89a37ce6267273abc3b43ded6.pdf,Text,"St. John's College Formal Lecture Series—Annapolis",1,0
495,https://digitalarchives.sjc.edu/items/show/495,"The St. John's Review (formerly The College), Autumn/Winter 1982-83","Volume XXXIV, Number 1 of The St. John's Review, formerly The College.  Published in Autumn/Winter 1982-1983.","Office of the Dean","St. John's College","Annapolis, MD","1982-10; 1983-01","St. John's College owns the rights to this publication.",text,pdf,,,"Radista, Leo; Parran, Jr., Thomas; Carnes, David; Bolotin, David;  Wilson, Curtis A.; Sachs, Joe; Alexander, Sidney; Brann, Eva T. H.",,English,"ISSN 0277-4720; The_St_Johns_Review_Vol_34_No_1_1982-1983",,,,,,,,,"112 pages",,,,,,,,,,paper,,,,,,,,,,,,,,,,,,,,,,,,,,"St. John's Review",https://s3.us-east-1.amazonaws.com/sjcdigitalarchives/original/6d66f4e9b03c3d40ac2c638ecf38bcd1.pdf,Text,"<em>The St. John's Review</em>",1,0
494,https://digitalarchives.sjc.edu/items/show/494,"The St. John's Review (formerly The College), Summer 1982","Volume XXXIII, Number 3 of The St. John's Review, formerly The College.  Published in Summer 1982.","Office of the Dean","St. John's College","Annapolis, MD",1982-07,"St. John's College owns the rights to this publication.",text,pdf,,,"Radista, Leo; Parran, Jr., Thomas; Carnes, David; Durholz, Janet; Bolotin, David;  Wilson, Curtis A.; Sachs, Joe; Brann, Eva T. H.; Smith, J. Winfree; Berns, Gisela; Landau, Julie; Loewenberg, Robert; Holt, Philip; Slakey, Thomas J.; Navrozov, Lev",,English,"ISSN 0277-4720; The_St_Johns_Review_Vol_33_No_3_1982",,,,,,,,,"72 pages",,,,,,,,,,paper,,,,,,,,,,,,,,,,,,,,,,,,,,"St. John's Review",https://s3.us-east-1.amazonaws.com/sjcdigitalarchives/original/ba76a93042d876ca41a3395a9207d116.pdf,Text,"<em>The St. John's Review</em>",1,0
493,https://digitalarchives.sjc.edu/items/show/493,"The St. John's Review (formerly The College), Winter 1982","Volume XXXIII, Number 2 of The St. John's Review, formerly The College.  Published in Winter 1982.","Office of the Dean","St. John's College","Annapolis, MD",1982-01,"St. John's College owns the rights to this publication.",text,pdf,,,"Radista, Leo; Parran, Jr., Thomas; Durholz, Janet; Bolotin, David;  Wilson, Curtis A.; Sachs, Joe; Allanbrook, Wye Jamison; Brann, Eva T. H.; Dennison, George; Mullen, William; Loewenberg, Robert; Smith, Brother Robert; Bell, Charles G.; Le Gloannecc, Anne-Marie; Josephs, Laurence; Montanelli, Indro; Collins, Arthur; Dulich, Jean; Navrozov, Lev",,English,"ISSN 0277-4720; The_St_Johns_Review_Vol_33_No_2_1982",,,,,,,,,"113 pages",,,,,,,,,,paper,,,,,,,,,,,,,,,,,,,,,,,,,,"St. John's Review",https://s3.us-east-1.amazonaws.com/sjcdigitalarchives/original/ac2f882eef7a07c42b5b5fc6bc838719.pdf,Text,"<em>The St. John's Review</em>",1,0
492,https://digitalarchives.sjc.edu/items/show/492,"The St. John's Review (formerly The College), Autumn 1981","Volume XXXIII, Number 1 of The St. John's Review, formerly The College.  Published in Autumn 1981.","Office of the Dean","St. John's College","Annapolis, MD",1981-10,"St. John's College owns the rights to this publication.",text,pdf,,,"Radista, Leo; Parran, Jr., Thomas; Wilson, Curtis A.; Sachs, Joe; Brann, Eva T. H.; Jaffa, Henry V.; Josephs, Laurence; Klein, Jacob; Levin, Michael; Collins, Linda; Navrozov, Lev; Guaspari, David; Venable, Bruce; Lund, Nelson; Wasserman, Adam",,English,"ISSN 0277-4720; The_St_Johns_Review_Vol_33_No_1_1981",,,,,,,,,"88 pages",,,,,,,,,,paper,,,,,,,,,,,,,,,,,,,,,,,,,,"St. John's Review",https://s3.us-east-1.amazonaws.com/sjcdigitalarchives/original/c292c191a062a62a27723f1b738d29e2.pdf,Text,"<em>The St. John's Review</em>",1,0
