﻿"Item Id","Item URI","Dublin Core:Title","Dublin Core:Description","Dublin Core:Creator","Dublin Core:Publisher","Dublin Core:Coverage","Dublin Core:Date","Dublin Core:Rights","Dublin Core:Type","Dublin Core:Format","Dublin Core:Source","Dublin Core:Subject","Dublin Core:Contributor","Dublin Core:Relation","Dublin Core:Language","Dublin Core:Identifier","Item Type Metadata:Occupation","Item Type Metadata:Participants","Item Type Metadata:Death Date","Item Type Metadata:Birthplace","Item Type Metadata:Birth Date","Item Type Metadata:Interviewer","Item Type Metadata:Biographical Text","Item Type Metadata:Bibliography","Item Type Metadata:Page numeration","Item Type Metadata:Resolution","Item Type Metadata:Identifier","Item Type Metadata:Inventory","Item Type Metadata:URL","Item Type Metadata:Text","Item Type Metadata:Interviewee","Item Type Metadata:Location","Item Type Metadata:Transcription","Item Type Metadata:Local URL","Item Type Metadata:Original Format","Item Type Metadata:Physical Dimensions","Item Type Metadata:Duration","Item Type Metadata:Compression","Item Type Metadata:Producer","Item Type Metadata:Director","Item Type Metadata:Bit Rate/Frequency","Item Type Metadata:Email Body","Item Type Metadata:Event Type","Item Type Metadata:Lesson Plan Text","Item Type Metadata:Materials","Item Type Metadata:Objectives","Item Type Metadata:Standards","Item Type Metadata:Number of Attachments","Item Type Metadata:BCC","Item Type Metadata:CC","Item Type Metadata:To","Item Type Metadata:From","Item Type Metadata:Subject Line","Item Type Metadata:Time Summary","Item Type Metadata:Episode","Item Type Metadata:Season","Item Type Metadata:Episode Type","Item Type Metadata:Explicit","Item Type Metadata:Block","PDF Text:Text",tags,file,itemType,collection,public,featured
5205,https://digitalarchives.sjc.edu/items/show/5205,"David H. Shipman, Brooke Harris and Janet Nelson, in Academic Robes, at Commencement, Annapolis, Maryland, 1972","1 photographic print : b&w","Elzey, Craig C.",,"Annapolis, MD",1972,"St. John's College owns the rights to this photograph.","Still Image",jpeg,,"St. John's College (Annapolis, Md.). -- Students. ;  Shipman, David H.;  Harris, Brooke;  Nelson, Janet",,,,SJC-P-1192,,,,,,,,,,,,,,,,,,,Photograph,"25.5 x 20.5 cm.",,,,,,,,,,,,,,,,,,,,,,,,,"Alumni,Commencement",https://s3.us-east-1.amazonaws.com/sjcdigitalarchives/original/c74df39ec6ae1a111f781c001be46bea.jpg,"Still Image","Photographic Archive—Annapolis",1,0
1074,https://digitalarchives.sjc.edu/items/show/1074,"David Reisman and Members of the St. John's College Peace Corps Faculty on Back Campus, St. John's College, Annapolis, Maryland","1 photographic print : b&w",Unknown,,"Annapolis, MD",1965-08-04,"St. John's College owns the rights to this photograph.","still image",jpeg,,"Peace Corps (U.S.) ;  St. John's College (Annapolis, Md.). -- Assistant Deans. ;  St. John's College (Annapolis, Md.). -- Faculty.; Reisman, David ;  Smith, J. Winfree.",,,,SJC-P-0568,,,,,,,,,,,,,,,,,,,photograph,"11 x 9 cm.",,,,,,,,,,,,,,,,,,,,,,,,,Tutors,https://s3.us-east-1.amazonaws.com/sjcdigitalarchives/original/61bbdcb2d0d30a492938def872402bfe.jpg,"Still Image","Photographic Archive—Annapolis",1,1
1075,https://digitalarchives.sjc.edu/items/show/1075,"David Reisman and Members of the St. John's College Peace Corps Faculty on Back Campus, St. John's College, Annapolis, Maryland","1 photographic print : b&w",Unknown,,"Annapolis, MD",1965-08-04,"St. John's College owns the rights to this photograph.","still image",jpeg,,"Peace Corps (U.S.) ;  St. John's College (Annapolis, Md.). -- Assistant Deans. ;  St. John's College (Annapolis, Md.). -- Faculty.; Reisman, David ;  Smith, J. Winfree.",,,,SJC-P-0569,,,,,,,,,,,,,,,,,,,photograph,"12 x 9 cm.",,,,,,,,,,,,,,,,,,,,,,,,,Tutors,https://s3.us-east-1.amazonaws.com/sjcdigitalarchives/original/c902cb46c93b7071bce1cc1623dccaae.jpg,"Still Image","Photographic Archive—Annapolis",1,1
1071,https://digitalarchives.sjc.edu/items/show/1071,"David Reisman with J. Winfree Smith and Members of the St. John's College Peace Corps Faculty on Back Campus, St. John's College, Annapolis, Maryland","1 photographic print : b&w",Unknown,,"Annapolis, MD",1965-08-04,"St. John's College owns the rights to this photograph.","still image",jpeg,,"Peace Corps (U.S.) ;  St. John's College (Annapolis, Md.). -- Assistant Deans. ;  St. John's College (Annapolis, Md.). -- Faculty.; Reisman, David ;  Smith, J. Winfree.",,,,SJC-P-0565,,,,,,,,,,,,,,,,,,,photograph,"9 x 9 cm.",,,,,,,,,,,,,,,,,,,,,,,,,"Honorary Alumni,Tutors",https://s3.us-east-1.amazonaws.com/sjcdigitalarchives/original/2e3c30f6ad076f18e062d68f2ae584e5.jpg,"Still Image","Photographic Archive—Annapolis",1,1
1072,https://digitalarchives.sjc.edu/items/show/1072,"David Reisman with J. Winfree Smith and Members of the St. John's College Peace Corps Faculty on Back Campus, St. John's College, Annapolis, Maryland","1 photographic print : b&w",Unknown,,"Annapolis, MD",1965-08-04,"St. John's College owns the rights to this photograph.","still image",jpeg,,"Peace Corps (U.S.) ;  St. John's College (Annapolis, Md.). -- Assistant Deans. ;  St. John's College (Annapolis, Md.). -- Faculty.; Reisman, David ;  Smith, J. Winfree.",,,,SJC-P-0566,,,,,,,,,,,,,,,,,,,photograph,"9 x 9 cm.",,,,,,,,,,,,,,,,,,,,,,,,,"Honorary Alumni,Tutors",https://s3.us-east-1.amazonaws.com/sjcdigitalarchives/original/d838858c58ee33be87c4262b288c01a8.jpg,"Still Image","Photographic Archive—Annapolis",1,1
1073,https://digitalarchives.sjc.edu/items/show/1073,"David Reisman with J. Winfree Smith and Members of the St. John's College Peace Corps Faculty on Back Campus, St. John's College, Annapolis, Maryland","1 photographic print : b&w",Unknown,,"Annapolis, MD",1965-08-04,"St. John's College owns the rights to this photograph.","still image",jpeg,,"Peace Corps (U.S.) ;  St. John's College (Annapolis, Md.). -- Assistant Deans. ;  St. John's College (Annapolis, Md.). -- Faculty.; Reisman, David ;  Smith, J. Winfree.",,,,SJC-P-0567,,,,,,,,,,,,,,,,,,,photograph,"10 x 9 cm.",,,,,,,,,,,,,,,,,,,,,,,,,"Honorary Alumni,Tutors",https://s3.us-east-1.amazonaws.com/sjcdigitalarchives/original/dd9a59657c4c98f24909825305645a63.jpg,"Still Image","Photographic Archive—Annapolis",1,1
774,https://digitalarchives.sjc.edu/items/show/774,"David's lament : modes, moods, and melody","Transcript of a lecture given on November 14, 1997 by Peter Pesic as part of the Dean's Concert and Lecture Series.","Pesic, Peter","St. John's College","Santa Fe, NM",1997-11-14,"Meem Library has been given permission to make this item available online.",text,pdf,,"Boethius, -524. De consolatione philosophiae.; Music, Greek and Roman",,,English,24003353,,,,,,,,,"13 pages",,,,,,,,,,paper,,,,,,,,,,,,,,,,,,,,,,,,,,"Friday night lecture",https://s3.us-east-1.amazonaws.com/sjcdigitalarchives/original/fd6e5856fbeb98af2b08e036d1296598.pdf,Text,"St. John's College Lecture Transcripts—Santa Fe",1,0
3789,https://digitalarchives.sjc.edu/items/show/3789,"Dead leaves:  illustrations of the genealogy of the epic poem","Audio recording of a lecture delivered on April 8, 1988 by Jonathan Tuck as part of the Formal Lecture Series.","Tuck, Jonathan",,"Annapolis, MD",1988-04-08,"St. John's College has been given permission to make this item available online.",sound,mp3,,,,"<a href=""http://digitalarchives.sjc.edu/items/show/3791"" title=""Typescript"">Typescript</a>",English,"lec Tuck 1988-04-08",,,,,,,,,,,,,,,,,,,"audio cassette tape (Tape 407)",,01:06:56,,,,,,,,,,,,,,,,,,,,,,,,"Friday night lecture,Tutors",https://s3.us-east-1.amazonaws.com/sjcdigitalarchives/original/53cea5e66eb420bd15258c1db655b368.mp3,Sound,"St. John's College Formal Lecture Series—Annapolis",1,0
3791,https://digitalarchives.sjc.edu/items/show/3791,"Dead leaves: illustrations of the genealogy of the epic poem","Typescript of a lecture delivered on April 8, 1988 by Jonathan Tuck as part of the Formal Lecture Series.","Tuck, Jonathan",,"Annapolis, MD",1988-04-08,"St. John's College has been given permission to make this item available online.",text,pdf,,,,"<a href=""http://digitalarchives.sjc.edu/items/show/3789"" title=""Sound recording"">Sound recording</a>",English,"lec Tuck 1988-04-08",,,,,,,,,"35 pages",,,,,,,,,,paper,,,,,,,,,,,,,,,,,,,,,,,,,,"Friday night lecture,Tutors",https://s3.us-east-1.amazonaws.com/sjcdigitalarchives/original/34c5572b8d8eb0c2666e476ebb7185c7.pdf,Text,"St. John's College Formal Lecture Series—Annapolis",1,0
1163,https://digitalarchives.sjc.edu/items/show/1163,"Deborah J. Ross as Francis during the King William Players Rehearsal of ""Henry IV, Part I"" by William Shakespeare, St. John's College, Annapolis, Maryland","1 photographic print : b&w","Villere, James",,"Annapolis, MD",1970-11,"St. John's College owns the rights to this photograph.","still image",jpeg,,"King William Players (St. John's College, Annapolis, Maryland) ;  Henry IV, King of England, 1367-1413 -- Drama.; Ross, Deborah J.",,,,SJC-P-0657,,,,,,,,,,,,,,,,,,,photograph,"13 x 17.5 cm.",,,,,,,,,,,,,,,,,,,,,,,,,"Alumni,King William Players",https://s3.us-east-1.amazonaws.com/sjcdigitalarchives/original/33d8bdf668357f018794f3d5dd7ee124.jpg,"Still Image","Photographic Archive—Annapolis",1,1
4640,https://digitalarchives.sjc.edu/items/show/4640,"Deborah Traynor, Judy Hochman and Pearl Rosenberg at a Reception for the Greer Garson Film Festival, St. John's College, Santa Fe, New Mexico","1 photographic print : b&w","Parran, Tom",,"Annapolis, MD",1970-05-23,"St. John's College owns the rights to this photograph.","Still Image",jpeg,,"Film festivals ;  Traynor, Deborah ;  Hochman, Judy ;  Rosenberg, Pearl",,,,SJC-P-0715,,,,,,,,,,,,,,,,,,,Photograph,"18 x 12.5 cm.",,,,,,,,,,,,,,,,,,,,,,,,,,https://s3.us-east-1.amazonaws.com/sjcdigitalarchives/original/f3a46eae28c56afe5d311b1e44686c0d.jpg,"Still Image","Photographic Archive—Annapolis",1,0
5572,https://digitalarchives.sjc.edu/items/show/5572,"Delagates and Faculty March to the Inaugural Platform near the Liberty Tree on Front Campus, Annapolis, Maryland, Fall 1980","1 photographic print : b&w",Unknown,,"Annapolis, MD",1980-09,"St. John's College owns the rights to this photograph.","Still Image",jpeg,,,,,,SJC-P-1639,,,,,,,,,,,,,,,,,,,Photograph,"20.5 x 25.5 cm.",,,,,,,,,,,,,,,,,,,,,,,,,"Inauguration,Liberty tree",https://s3.us-east-1.amazonaws.com/sjcdigitalarchives/original/84f3a2c99c6400da69166b6c4c66d3e7.jpg,"Still Image","Photographic Archive—Annapolis",1,0
5571,https://digitalarchives.sjc.edu/items/show/5571,"Delegates and Faculty Assemble in the Great Hall of McDowell Hall for the Inaguration of Edwin J. Delattre, Fall 1980","1 photographic print : b&w",Unknown,,"Annapolis, MD",1980-09,"St. John's College owns the rights to this photograph.","Still Image",jpeg,,,,,,SJC-P-1638,,,,,,,,,,,,,,,,,,,Photograph,"20.5 x 25.5 cm.",,,,,,,,,,,,,,,,,,,,,,,,,Inauguration,https://s3.us-east-1.amazonaws.com/sjcdigitalarchives/original/f4a3e000c6d0e4ccb24220dbf9801f3e.jpg,"Still Image","Photographic Archive—Annapolis",1,0
5716,https://digitalarchives.sjc.edu/items/show/5716,"Delegates, in Academic Robes, at the Inauguration Ceremony for Edwin J. Delattre, Annapolis, Maryland, Fall 1980","1 photographic print : b&w",Unknown,,"Annapolis, MD",1980-09,"St. John's College owns the rights to this photograph.","Still Image",jpeg,,,,,,SJC-P-1792,,,,,,,,,,,,,,,,,,,Photograph,"25.5 x 20.5 cm.",,,,,,,,,,,,,,,,,,,,,,,,,,https://s3.us-east-1.amazonaws.com/sjcdigitalarchives/original/cc8de005a7fc40dd7a067061e03ef90b.jpg,"Still Image","Photographic Archive—Annapolis",1,0
5717,https://digitalarchives.sjc.edu/items/show/5717,"Delegates, in Academic Robes, at the Inauguration Ceremony for Edwin J. Delattre, Annapolis, Maryland, Fall 1980","1 photographic print : b&w",Unknown,,"Annapolis, MD",1980-09,"St. John's College owns the rights to this photograph.","Still Image",jpeg,,,,,,SJC-P-1793,,,,,,,,,,,,,,,,,,,Photograph,"25.5 x 20.5 cm.",,,,,,,,,,,,,,,,,,,,,,,,,,https://s3.us-east-1.amazonaws.com/sjcdigitalarchives/original/f29dd0b1fcad4ad4b6ef900e31b88a45.jpg,"Still Image","Photographic Archive—Annapolis",1,0
5,https://digitalarchives.sjc.edu/items/show/5,"Depth and desire","Typescript of a lecture delivered on  August 31, 1990 by Eva Brann as part of the Formal Lecture Series.","Brann, Eva T. H.","St. John's College","Annapolis, MD",1990-08-31,"St. John's College has been given permission to make this item available online.",text,pdf,"Taken from the St. John's Review, Volume XXIX, Number 3, 1989-90. It was originally the opening lecture of the 1990-91 academic year at St. John's College, Annapolis.",,,"<a title=""Audio recording"" href=""http://digitalarchives.sjc.edu/items/show/326"">Audio recording</a>",English,"Bib # 57332",,,,,,,,,,,,,,,,,,,paper,,,,,,,,,,,,,,,,,,,,,,,,,,"Deans,Friday night lecture,St. John's Review,Tutors",https://s3.us-east-1.amazonaws.com/sjcdigitalarchives/original/1c0101ce28ea085841d2551fe7afa90b.pdf,Text,"St. John's College Formal Lecture Series—Annapolis",1,0
326,https://digitalarchives.sjc.edu/items/show/326,"Depth and desire","Audio recording of a lecture delivered on August 31, 1990 by Eva Brann as part of the Formal Lecture Series.","Brann, Eva T. H.","St. John's College","Annapolis, MD",1990-08-31,"St. John's College has been given permission to make this item available online.",sound,mp3,,"Heraclitus, of Ephesus; Communism",,"<a title=""Typescript"" href=""http://digitalarchives.sjc.edu/items/show/5"">Typescript</a>",English,"Bib # 10245",,,,,,,,,,,,,,,,,,,"audio cassette",,00:35:24,,,,,,,,,,,,,,,,,,,,,,,,"Deans,Friday night lecture,Tutors",https://s3.us-east-1.amazonaws.com/sjcdigitalarchives/original/b70c11230755fc2c9e5a92d0bdc64ed4.mp3,Sound,"St. John's College Formal Lecture Series—Annapolis",1,0
7478,https://digitalarchives.sjc.edu/items/show/7478,"Depth and Desire","Typescript of a lecture delivered on August 31, 1990 by Eva Brann as part of the Formal Lecture Series.","Brann, Eva T. H.","St. John's College","Annapolis, MD",1990-08-31,"St. John's College has been given permission to make this item available online.",text,pdf,,"College freshmen; Depth (Philosophy)",,,English,Brann_Eva_1990-08-31,,,,,,,,,"9 pages",,,,,,,,,,paper,,,,,,,,,,,,,,,,,,,,,,,,,,"Deans,Friday night lecture,Tutors",https://s3.us-east-1.amazonaws.com/sjcdigitalarchives/original/89b849ef04ab118959d4c10bc7a0b8b6.pdf,Text,"St. John's College Formal Lecture Series—Annapolis",1,0
3602,https://digitalarchives.sjc.edu/items/show/3602,"Descartes on imagination and truth","Audio recording of a lecture given on February 16, 2018 by Mary Domski as part of the Dean's Lecture and Concert Series.","Domski, Mary, 1975-","St. John's College","Santa Fe, NM",2018-02-16,"Meem Library has been given permission to make this item available online.",sound,mp3,,"Descartes, René, 1596-1650. Meditationes de prima philosophia; Descartes, René, 1596-1650. Principia philosophiae",,,English,20014430,,,,,,,,,,,,,,,,,,,wav,,00:55:19,,,,,,,,,,,,,,,,,,,,,,,,"Friday night lecture",https://s3.us-east-1.amazonaws.com/sjcdigitalarchives/original/647e3416aced3cec00e4d3c2be0a095c.mp3,Sound,"St. John's College Lecture Recordings—Santa Fe",1,0
7474,https://digitalarchives.sjc.edu/items/show/7474,"Desiring What is Beautiful","Audio recording of a lecture delivered on November 19, 1993 by Samuel S. Kutler as part of the Formal Lecture Series.","Kutler, Samuel S.","St. John's College","Annapolis, MD",1993-11-19,"A signed permission form has been received stating: ""I hereby grant St. John's College permission to: Make an audiovisual recording of my lecture, and retain copies for circulation and archival preservation in the St. John's College Greenfield Library. Make an audiovisual recording of my lecture available online. Make a typescript copy of my lecture available for circulation and archival preservation in the St. John's College Greenfield Library. Make a typescript of my lecture available online.""",sound,mp3,,,,,English,Kutler_Samuel_1993-11-19,,,,,,,,,,,,,,,,,,,"audio cassette",,00:54:43,,,,,,,,,,,,,,,,,,,,,,,,"Friday night lecture,Tutors",https://s3.us-east-1.amazonaws.com/sjcdigitalarchives/original/c84ebb2ceea1c524b0194146adb63862.mp3,Sound,"St. John's College Formal Lecture Series—Annapolis",1,0
