﻿"Item Id","Item URI","Dublin Core:Title","Dublin Core:Description","Dublin Core:Creator","Dublin Core:Publisher","Dublin Core:Coverage","Dublin Core:Date","Dublin Core:Rights","Dublin Core:Type","Dublin Core:Format","Dublin Core:Source","Dublin Core:Subject","Dublin Core:Contributor","Dublin Core:Relation","Dublin Core:Language","Dublin Core:Identifier","Item Type Metadata:Occupation","Item Type Metadata:Participants","Item Type Metadata:Death Date","Item Type Metadata:Birthplace","Item Type Metadata:Birth Date","Item Type Metadata:Interviewer","Item Type Metadata:Biographical Text","Item Type Metadata:Bibliography","Item Type Metadata:Page numeration","Item Type Metadata:Resolution","Item Type Metadata:Identifier","Item Type Metadata:Inventory","Item Type Metadata:URL","Item Type Metadata:Text","Item Type Metadata:Interviewee","Item Type Metadata:Location","Item Type Metadata:Transcription","Item Type Metadata:Local URL","Item Type Metadata:Original Format","Item Type Metadata:Physical Dimensions","Item Type Metadata:Duration","Item Type Metadata:Compression","Item Type Metadata:Producer","Item Type Metadata:Director","Item Type Metadata:Bit Rate/Frequency","Item Type Metadata:Email Body","Item Type Metadata:Event Type","Item Type Metadata:Lesson Plan Text","Item Type Metadata:Materials","Item Type Metadata:Objectives","Item Type Metadata:Standards","Item Type Metadata:Number of Attachments","Item Type Metadata:BCC","Item Type Metadata:CC","Item Type Metadata:To","Item Type Metadata:From","Item Type Metadata:Subject Line","Item Type Metadata:Time Summary","Item Type Metadata:Episode","Item Type Metadata:Season","Item Type Metadata:Episode Type","Item Type Metadata:Explicit","Item Type Metadata:Block","PDF Text:Text",tags,file,itemType,collection,public,featured
6463,https://digitalarchives.sjc.edu/items/show/6463,"St. John's Collegian, February 16, 1934","Vol. XLV, No. 8 of the St. John's Collegian. Published on February 16, 1934.","Lampee, Robert H. (Editor-in-Chief)","St. John's College","Annapolis, MD",1934-02-16,"St. John's College owns the rights to this publication.",text,pdf,,,,,English,Collegian_1934_2_16,,,,,,,,,"4 pages",,,,,,,,,,paper,,,,,,,,,,,,,,,,,,,,,,,,,,"Student publication",https://s3.us-east-1.amazonaws.com/sjcdigitalarchives/original/2850e668c649d47f29fbf8b7351e9ae6.pdf,Text,"The Collegian",1,0
6464,https://digitalarchives.sjc.edu/items/show/6464,"St. John's Collegian, February 23, 1934","Vol. XLV, No. 9 of the St. John's Collegian. Published on February 23, 1934.","Lampee, Robert H. (Editor-in-Chief)","St. John's College","Annapolis, MD",1934-02-23,"St. John's College owns the rights to this publication.",text,pdf,,,,,English,Collegian_1934_2_23,,,,,,,,,"6 pages",,,,,,,,,,paper,,,,,,,,,,,,,,,,,,,,,,,,,,"Student publication",https://s3.us-east-1.amazonaws.com/sjcdigitalarchives/original/4d3f0c73615025b7aa14e988d308302e.pdf,Text,"The Collegian",1,0
6465,https://digitalarchives.sjc.edu/items/show/6465,"St. John's Collegian, March 2, 1934","Vol. XLV, No. 10 of the St. John's Collegian. Published on March 2, 1934.","Lampee, Robert H. (Editor-in-Chief)","St. John's College","Annapolis, MD",1934-03-02,"St. John's College owns the rights to this publication.",text,pdf,,,,,English,Collegian_1934_3_2,,,,,,,,,"4 pages",,,,,,,,,,paper,,,,,,,,,,,,,,,,,,,,,,,,,,"Student publication",https://s3.us-east-1.amazonaws.com/sjcdigitalarchives/original/e8877b46a9d957dd6ec50ad5e11559e1.pdf,Text,"The Collegian",1,0
6466,https://digitalarchives.sjc.edu/items/show/6466,"St. John's Collegian, March 9, 1934","Vol. XLV, No. 11 of the St. John's Collegian. Published on March 9, 1934.","Lampee, Robert H. (Editor-in-Chief)","St. John's College","Annapolis, MD",1934-03-09,"St. John's College owns the rights to this publication.",text,pdf,,,,,English,Collegian_1934_3_9,,,,,,,,,"6 pages",,,,,,,,,,paper,,,,,,,,,,,,,,,,,,,,,,,,,,"Student publication",https://s3.us-east-1.amazonaws.com/sjcdigitalarchives/original/a361c4f441c56cbc87e0eec8db7e5d67.pdf,Text,"The Collegian",1,0
6467,https://digitalarchives.sjc.edu/items/show/6467,"St. John's Collegian, March 16, 1934","Vol. XLV, No. 12 of the St. John's Collegian. Published on March 16, 1934.","Lampee, Robert H. (Editor-in-Chief)","St. John's College","Annapolis, MD",1934-03-16,"St. John's College owns the rights to this publication.",text,pdf,,,,,English,Collegian_1934_3_16,,,,,,,,,"4 pages",,,,,,,,,,paper,,,,,,,,,,,,,,,,,,,,,,,,,,"Student publication",https://s3.us-east-1.amazonaws.com/sjcdigitalarchives/original/bf30636ddc9c72ef1770d2dffec12814.pdf,Text,"The Collegian",1,0
6468,https://digitalarchives.sjc.edu/items/show/6468,"St. John's Collegian, March 21, 1934","Vol. XLV, No. 13 of the St. John's Collegian. Published on March 21, 1934.","Lampee, Robert H. (Editor-in-Chief)","St. John's College","Annapolis, MD",1934-03-21,"St. John's College owns the rights to this publication.",text,pdf,,,,,English,Collegian_1934_3_21,,,,,,,,,"4 pages",,,,,,,,,,paper,,,,,,,,,,,,,,,,,,,,,,,,,,"Student publication",https://s3.us-east-1.amazonaws.com/sjcdigitalarchives/original/8d75048322b5177b7ecb1ee61b1ac015.pdf,Text,"The Collegian",1,0
6469,https://digitalarchives.sjc.edu/items/show/6469,"St. John's Collegian, April 13, 1934","Vol. XLV, No. 14  of the St. John's Collegian. Published on April 13, 1934.","Lampee, Robert H. (Editor-in-Chief)","St. John's College","Annapolis, MD",1934-04-13,"St. John's College owns the rights to this publication.",text,pdf,,,,,English,Collegian_1934_4_13,,,,,,,,,"4 pages",,,,,,,,,,paper,,,,,,,,,,,,,,,,,,,,,,,,,,"Student publication",https://s3.us-east-1.amazonaws.com/sjcdigitalarchives/original/953e1280bd666b1c2cd15c874191dbe7.pdf,Text,"The Collegian",1,0
6470,https://digitalarchives.sjc.edu/items/show/6470,"St. John's Collegian, April 27, 1934","Vol. XLV, No. 16 of the St. John's Collegian. Published on April 27, 1934.","Lampee, Robert H. (Editor-in-Chief)","St. John's College","Annapolis, MD",1934-04-27,"St. John's College owns the rights to this publication.",text,pdf,,,,,English,Collegian_1934_4_27,,,,,,,,,"4 pages",,,,,,,,,,paper,,,,,,,,,,,,,,,,,,,,,,,,,,"Student publication",https://s3.us-east-1.amazonaws.com/sjcdigitalarchives/original/6f8e8cf011e9695bd5e315ecefb3be89.pdf,Text,"The Collegian",1,0
6471,https://digitalarchives.sjc.edu/items/show/6471,"St. John's Collegian, May 4, 1934","Vol. XLV, No. 17 of the St. John's Collegian. Published on May 4, 1934.","Lampee, Robert H. (Editor-in-Chief)","St. John's College","Annapolis, MD",1934-05-04,"St. John's College owns the rights to this publication.",text,pdf,,,,,English,Collegian_1934_5_4,,,,,,,,,"4 pages",,,,,,,,,,paper,,,,,,,,,,,,,,,,,,,,,,,,,,"Student publication",https://s3.us-east-1.amazonaws.com/sjcdigitalarchives/original/f51272e8b43e98ade81ee0a68a97f936.pdf,Text,"The Collegian",1,0
6472,https://digitalarchives.sjc.edu/items/show/6472,"St. John's Collegian, May 11, 1934","Vol. XLV, No. 18 of the St. John's Collegian. Published on May 11, 1934.","Lampee, Robert H. (Editor-in-Chief)","St. John's College","Annapolis, MD",1934-05-11,"St. John's College owns the rights to this publication.",text,pdf,,,,,English,Collegian_1934_5_11,,,,,,,,,"4 pages",,,,,,,,,,paper,,,,,,,,,,,,,,,,,,,,,,,,,,"Student publication",https://s3.us-east-1.amazonaws.com/sjcdigitalarchives/original/d67a7d2f1c87a1ee66a3c5ccdcbc2d67.pdf,Text,"The Collegian",1,0
6473,https://digitalarchives.sjc.edu/items/show/6473,"St. John's Collegian, May 18, 1934","Vol. XLV, No. 19 of the St. John's Collegian. Published on May 18, 1934.","Lampee, Robert H. (Editor-in-Chief)","St. John's College","Annapolis, MD",1934-05-18,"St. John's College owns the rights to this publication.",text,pdf,,,,,English,Collegian_1934_5_18,,,,,,,,,"6 pages",,,,,,,,,,paper,,,,,,,,,,,,,,,,,,,,,,,,,,"Student publication",https://s3.us-east-1.amazonaws.com/sjcdigitalarchives/original/6b95ba695b1f63e1ea11b0d4753bbc31.pdf,Text,"The Collegian",1,0
6165,https://digitalarchives.sjc.edu/items/show/6165,"The Brice House Dining Room, Annapolis, Maryland","1 photographic print : b&w",Unknown,,"Annapolis, MD",1934-06,"St. John's College owns the rights to this photograph.","Still Image",jpeg,,,,,,SJC-P-2378,,,,,,,,,,,,,,,,,,,Photograph,"25.5 x 20.5 cm.",,,,,,,,,,,,,,,,,,,,,,,,,,https://s3.us-east-1.amazonaws.com/sjcdigitalarchives/original/0c9ac18b81abd5c8c204ac42bc877c59.jpg,"Still Image","Photographic Archive—Annapolis",1,0
6474,https://digitalarchives.sjc.edu/items/show/6474,"St. John's Collegian, June 6, 1934","Vol. XLV, No. 20 of the St. John's Collegian. Published on June 6, 1934.","Bailey Jr., Roland J. (Executive Editor)","St. John's College","Annapolis, MD",1934-06-06,"St. John's College owns the rights to this publication.",text,pdf,,,,,English,Collegian_1934_6_6,,,,,,,,,"4 pages",,,,,,,,,,paper,,,,,,,,,,,,,,,,,,,,,,,,,,"Student publication",https://s3.us-east-1.amazonaws.com/sjcdigitalarchives/original/6a80982a44804b25d77315d836100580.pdf,Text,"The Collegian",1,0
6475,https://digitalarchives.sjc.edu/items/show/6475,"St. John's Collegian, October 5, 1934","Vol. XLV, No. 21 of the St. John's Collegian. Published on October 5, 1934.","Lampee, Robert H. (Editor-in-Chief)","St. John's College","Annapolis, MD",1934-10-05,"St. John's College owns the rights to this publication.",text,pdf,,,,,English,Collegian_1934_10_5,,,,,,,,,"4 pages",,,,,,,,,,paper,,,,,,,,,,,,,,,,,,,,,,,,,,"Student publication",https://s3.us-east-1.amazonaws.com/sjcdigitalarchives/original/7db2823210ff73f1fbda82cb438290c8.pdf,Text,"The Collegian",1,0
6476,https://digitalarchives.sjc.edu/items/show/6476,"St. John's Collegian, October 12, 1934","Vol. XLV, No. 22 of the St. John's Collegian. Published on October 12, 1934.","Lampee, Robert H. (Editor-in-Chief)","St. John's College","Annapolis, MD",1934-10-12,"St. John's College owns the rights to this publication.",text,pdf,,,,,English,Collegian_1934_10_12,,,,,,,,,"4 pages",,,,,,,,,,paper,,,,,,,,,,,,,,,,,,,,,,,,,,"Student publication",https://s3.us-east-1.amazonaws.com/sjcdigitalarchives/original/cb5358f05bd8d6288bd5ffa16299186c.pdf,Text,"The Collegian",1,0
6477,https://digitalarchives.sjc.edu/items/show/6477,"St. John's Collegian, October 19, 1934","Vol. XLVI, No. 1 of the St. John's Collegian. Published on October 19, 1934.","Bailey Jr., Roland J. (Editor-in-Chief)","St. John's College","Annapolis, MD",1934-10-19,"St. John's College owns the rights to this publication.",text,pdf,,,,,English,Collegian_1934_10_19,,,,,,,,,"4 pages",,,,,,,,,,paper,,,,,,,,,,,,,,,,,,,,,,,,,,"Student publication",https://s3.us-east-1.amazonaws.com/sjcdigitalarchives/original/51aff67ffb4e5714f59e4fa9e3620d8a.pdf,Text,"The Collegian",1,0
1322,https://digitalarchives.sjc.edu/items/show/1322,"Inauguration of Colonel Amos Walter Wright Woodcock as President of St. John's","Program of the inauguration",,"St. John's College","Annapolis, MD",1934-10-20,"St. John's College owns the rights to this publication.",text,pdf,,,,,English,Bx1-75,,,,,,,,,"4 pages",,,,,,,,,,paper,,,,,,,,,,,,,,,,,,,,,,,,,,"Inauguration,Presidents",https://s3.us-east-1.amazonaws.com/sjcdigitalarchives/original/ece60f1d6d313a2e212ae64db2df2e57.pdf,Text,"Playbills & Programs",1,1
6478,https://digitalarchives.sjc.edu/items/show/6478,"St. John's Collegian, October 26, 1934","Vol. XLVI, No. 2 of the St. John's Collegian. Published on October 26, 1934.","Bailey Jr., Roland J. (Editor-in-Chief)","St. John's College","Annapolis, MD",1934-10-26,"St. John's College owns the rights to this publication.",text,pdf,,,,,English,Collegian_1934_10_26,,,,,,,,,"4 pages",,,,,,,,,,paper,,,,,,,,,,,,,,,,,,,,,,,,,,"Student publication",https://s3.us-east-1.amazonaws.com/sjcdigitalarchives/original/15cbd6c73910562e94c8f89509440cbb.pdf,Text,"The Collegian",1,0
6479,https://digitalarchives.sjc.edu/items/show/6479,"St. John's Collegian, November 2, 1934","Vol. XLVI, No. 3 of the St. John's Collegian. Published on November 2, 1934.","Bailey Jr., Roland J. (Editor-in-Chief)","St. John's College","Annapolis, MD",1934-11-02,"St. John's College owns the rights to this publication.",text,pdf,,,,,English,Collegian_1934_11_2,,,,,,,,,"4 pages",,,,,,,,,,paper,,,,,,,,,,,,,,,,,,,,,,,,,,"Student publication",https://s3.us-east-1.amazonaws.com/sjcdigitalarchives/original/fca7c075948d970cba98de585fd32ca7.pdf,Text,"The Collegian",1,0
6480,https://digitalarchives.sjc.edu/items/show/6480,"St. John's Collegian, November 9, 1934","Vol. XLVI, No. 4 of the St. John's Collegian. Published on November 9, 1934.","Bailey Jr., Roland J. (Editor-in-Chief)","St. John's College","Annapolis, MD",1934-11-09,"St. John's College owns the rights to this publication.",text,pdf,,,,,English,Collegian_1934_11_9,,,,,,,,,"6 pages",,,,,,,,,,paper,,,,,,,,,,,,,,,,,,,,,,,,,,"Student publication",https://s3.us-east-1.amazonaws.com/sjcdigitalarchives/original/2c3ae6bd2688e2fe23becf7872932fca.pdf,Text,"The Collegian",1,0
