﻿"Item Id","Item URI","Dublin Core:Title","Dublin Core:Description","Dublin Core:Creator","Dublin Core:Publisher","Dublin Core:Coverage","Dublin Core:Date","Dublin Core:Rights","Dublin Core:Type","Dublin Core:Format","Dublin Core:Source","Dublin Core:Subject","Dublin Core:Contributor","Dublin Core:Relation","Dublin Core:Language","Dublin Core:Identifier","Item Type Metadata:Occupation","Item Type Metadata:Participants","Item Type Metadata:Death Date","Item Type Metadata:Birthplace","Item Type Metadata:Birth Date","Item Type Metadata:Interviewer","Item Type Metadata:Biographical Text","Item Type Metadata:Bibliography","Item Type Metadata:Page numeration","Item Type Metadata:Resolution","Item Type Metadata:Identifier","Item Type Metadata:Inventory","Item Type Metadata:URL","Item Type Metadata:Text","Item Type Metadata:Interviewee","Item Type Metadata:Location","Item Type Metadata:Transcription","Item Type Metadata:Local URL","Item Type Metadata:Original Format","Item Type Metadata:Physical Dimensions","Item Type Metadata:Duration","Item Type Metadata:Compression","Item Type Metadata:Producer","Item Type Metadata:Director","Item Type Metadata:Bit Rate/Frequency","Item Type Metadata:Email Body","Item Type Metadata:Event Type","Item Type Metadata:Lesson Plan Text","Item Type Metadata:Materials","Item Type Metadata:Objectives","Item Type Metadata:Standards","Item Type Metadata:Number of Attachments","Item Type Metadata:BCC","Item Type Metadata:CC","Item Type Metadata:To","Item Type Metadata:From","Item Type Metadata:Subject Line","Item Type Metadata:Time Summary","Item Type Metadata:Episode","Item Type Metadata:Season","Item Type Metadata:Episode Type","Item Type Metadata:Explicit","Item Type Metadata:Block","PDF Text:Text",tags,file,itemType,collection,public,featured
3757,https://digitalarchives.sjc.edu/items/show/3757,"Bulletin of The Friends of St. John's College, March 1950","Volume II, Number 2 of the Bulletin of the Friends of St. John's College, the Language Tutorial.  Published in March 1950.","St. John's College","St. John's College","Annapolis, MD",1950-03,"St. John's College owns the rights to this publication.",text,pdf,,,,,English,"Bulletin March 1950 Curricular Activities The Language Tutorial Vol. II No. 2",,,,,,,,,"8 pages",,,,,,,,,,paper,,,,,,,,,,,,,,,,,,,,,,,,,,,https://s3.us-east-1.amazonaws.com/sjcdigitalarchives/original/c75f8c59a393743e7c3ffe6c62a134e1.pdf,Text,"<em>Bulletin of the Friends of St. John's College</em>",1,0
5050,https://digitalarchives.sjc.edu/items/show/5050,"F. Townsend Morgan Painting in his Studio, Annapolis, Maryland","1 photographic print : b&w",Unknown,,"Annapolis, MD",1950-03,"St. John's College owns the rights to this photograph.","Still Image",jpeg,,,,,,SJC-P-0972,,,,,,,,,,,,,,,,,,,Photograph,"25.5 x 20.5 cm.",,,,,,,,,,,,,,,,,,,,,,,,,,https://s3.us-east-1.amazonaws.com/sjcdigitalarchives/original/34917cc8991890cb8a17d5a51c98249a.jpg,"Still Image","Photographic Archive—Annapolis",1,0
5051,https://digitalarchives.sjc.edu/items/show/5051,"F. Townsend Morgan in his Studio with Patricia Parslow","1 photographic print : b&w",Unknown,,"Annapolis, MD",1950-03,"St. John's College owns the rights to this photograph.","Still Image",jpeg,,,,,,SJC-P-0973,,,,,,,,,,,,,,,,,,,Photograph,"25.5 x 20.5 cm.",,,,,,,,,,,,,,,,,,,,,,,,,,https://s3.us-east-1.amazonaws.com/sjcdigitalarchives/original/423cf3455a1c4f47ad1ab274fa04604f.jpg,"Still Image","Photographic Archive—Annapolis",1,0
6445,https://digitalarchives.sjc.edu/items/show/6445,"Bulletin of St. John's College, March 1950","Volume II, No. 1 of the Bulletin of St. John's College, entitled ""Official Statement of the Program"". Published in March 1950.","St. John's College","St. John's College","Annapolis, MD",1950-03,"St. John's College owns the rights to this publication.",text,pdf,,,,,English,"Bulletin, March 1950, Vol. II, #1",,,,,,,,,"95 pages",,,,,,,,,,paper,,,,,,,,,,,,,,,,,,,,,,,,,,,https://s3.us-east-1.amazonaws.com/sjcdigitalarchives/original/9ccdb29f3aded377b47d2b33092f670c.pdf,Text,"The Bulletin",1,0
2834,https://digitalarchives.sjc.edu/items/show/2834,"The Real Collegian, March 03, 1950","Vol. II, No. 2 of The Real Collegian.  Published on March 3, 1950.",,"St. John's College","Annapolis, MD",1950-03-03,"St. John's College owns the rights to this publication.",text,pdf,,,,,English,"The Real Collegian Vol. II No. 02",,,,,,,,,"4 pages",,,,,,,,,,paper,,,,,,,,,,,,,,,,,,,,,,,,,,"Student publication,The Collegian",https://s3.us-east-1.amazonaws.com/sjcdigitalarchives/original/04399d6d37157ed4da84722f5d1f18de.pdf,Text,"The Collegian",1,0
2822,https://digitalarchives.sjc.edu/items/show/2822,"St. John's Collegian, March 15, 1950","Vol. LXVIII, No. 6 of the St. John's Collegian. Published on March 15, 1950.",,"St. John's College","Annapolis, MD",1950-03-15,"St. John's College owns the rights to this publication.",text,pdf,,,,,English,"Collegian Vol. LXIII No. 06",,,,,,,,,"16 pages",,,,,,,,,,paper,,,,,,,,,,,,,,,,,,,,,,,,,,"Student publication,The Collegian",https://s3.us-east-1.amazonaws.com/sjcdigitalarchives/original/61dcfe29b2e27c245c2b61c9e821d491.pdf,Text,"The Collegian",1,0
3772,https://digitalarchives.sjc.edu/items/show/3772,"Bulletin of The Friends of St. John's College, April 1950","Volume II, Number 3 of the Bulletin of the Friends of St. John's College, the Mathematics Tutorial.  Published in April 1950.","St. John's College","St. John's College","Annapolis, MD",1950-04,"St. John's College owns the rights to this publication.",text,pdf,,,,,English,"Bulletin Vol II #3 April 1950 Curricular Activities - Mathematics Tutorial",,,,,,,,,"8 pages",,,,,,,,,,paper,,,,,,,,,,,,,,,,,,,,,,,,,,,https://s3.us-east-1.amazonaws.com/sjcdigitalarchives/original/e03a6b5e7709715c17bb8387b46d5c6d.pdf,Text,"<em>Bulletin of the Friends of St. John's College</em>",1,0
1199,https://digitalarchives.sjc.edu/items/show/1199,"Theodore J. Otteson Hiding Easter Eggs outside for an Easter Egg Hunt, [St. John's College, Annapolis, Maryland]","1 photographic print : b&w",Unknown,,"Annapolis, MD",1950-04-09,"St. John's College owns the rights to this photograph.","still image",jpeg,,"St. John's College (Annapolis, MD) -- Students. ;  Easter egg hunts.; Otteson, Theodore J.",,,,SJC-P-0694,,,,,,,,,,,,,,,,,,,photograph,"17 x 12.5 cm.",,,,,,,,,,,,,,,,,,,,,,,,,Alumni,https://s3.us-east-1.amazonaws.com/sjcdigitalarchives/original/a5c395d548031520d7f34278775263e5.jpg,"Still Image","Photographic Archive—Annapolis",1,0
2823,https://digitalarchives.sjc.edu/items/show/2823,"St. John's Collegian, May 13, 1950","Vol. LXVIII, No. 7 of the St. John's Collegian. Published on May 13, 1950.",,"St. John's College","Annapolis, MD",1950-05-13,"St. John's College owns the rights to this publication.",text,pdf,,,,,English,"Collegian Vol. LXIII No. 07",,,,,,,,,"12 pages",,,,,,,,,,paper,,,,,,,,,,,,,,,,,,,,,,,,,,"Student publication,The Collegian",https://s3.us-east-1.amazonaws.com/sjcdigitalarchives/original/a5393d371505748844df2e8cff197893.pdf,Text,"The Collegian",1,0
3754,https://digitalarchives.sjc.edu/items/show/3754,"Bulletin of St. John's College in Annapolis, June 1950","Volume II, No. 2 of the Bulletin of St. John's College in Annapolis, Report of the President.  Published in June 1950.","St. John's College","St. John's College","Annapolis, MD",1950-06,"St. John's College owns the rights to this publication.",text,pdf,,"Weigle, Richard Daniel, 1912- ",,,English,Bulletin_vol2_no2_1950_June,,,,,,,,,"15 pages",,,,,,,,,,paper,,,,,,,,,,,,,,,,,,,,,,,,,,"President's Report,Presidents",https://s3.us-east-1.amazonaws.com/sjcdigitalarchives/original/eea6faf539d2414d2a34265033c35f03.pdf,Text,"The Bulletin",1,0
2824,https://digitalarchives.sjc.edu/items/show/2824,"St. John's Collegian, June 07, 1950","Vol. LXVIII, No. 8 of the St. John's Collegian. Published on June 7, 1950.",,"St. John's College","Annapolis, MD",1950-06-07,"St. John's College owns the rights to this publication.",text,pdf,,,,,English,"Collegian Vol. LXIII No. 08",,,,,,,,,"16 pages",,,,,,,,,,paper,,,,,,,,,,,,,,,,,,,,,,,,,,"Student publication,The Collegian",https://s3.us-east-1.amazonaws.com/sjcdigitalarchives/original/9638d0f37222ce103b9ab0780056e283.pdf,Text,"The Collegian",1,0
3319,https://digitalarchives.sjc.edu/items/show/3319,"Commencement Program,  1950","Program for the One Hundred and Fifty-Eighth Commencement in the Two Hundred Fifty-Third Year of the College.","St. John's College","St. John's College","Annapolis, MD",1950-06-12,"St. John's College owns the rights to this publication.",text,pdf,,,,,English,"Commencement Exercises from 1950 {1950-06-12}",,,,,,,,,"6 pages",,,,,,,,,,paper,,,,,,,,,,,,,,,,,,,,,,,,,,Commencement,https://s3.us-east-1.amazonaws.com/sjcdigitalarchives/original/7537af574b33b0ac848f20a7d451dcec.pdf,Text,"Commencement Programs and Addresses",1,0
3779,https://digitalarchives.sjc.edu/items/show/3779,"Bulletin of The Friends of St. John's College, August 1950","Volume II, Number 4 of the Bulletin of The Friends of St. John's College, the Laboratory.  Published in August 1950.","St. John's College","St. John's College","Annapolis, MD",1950-08,"St. John's College owns the rights to this publication.",text,pdf,,,,,English,"Bulletin-August 1950-The Curricular Activities at the College-The laboratory and Formal Lectures-Vol. II No. 4",,,,,,,,,"8 pages",,,,,,,,,,paper,,,,,,,,,,,,,,,,,,,,,,,,,,,https://s3.us-east-1.amazonaws.com/sjcdigitalarchives/original/68e90b7dd4aa631b36238ee488323243.pdf,Text,"<em>Bulletin of the Friends of St. John's College</em>",1,0
3768,https://digitalarchives.sjc.edu/items/show/3768,"Bulletin of St. John's College in Annapolis, September 1950","Volume II, No. 3 of the Bulletin of St. John's College in Annapolis, Polity of the College.  Published in September 1950","St. John's College","St. John's College","Annapolis, MD",1950-09,"St. John's College owns the rights to this publication.",text,pdf,,,,,English,"Bulletin September 1950-Vol II No 3-Polity of the College",,,,,,,,,"16 pages",,,,,,,,,,paper,,,,,,,,,,,,,,,,,,,,,,,,,,"Charter and Polity",https://s3.us-east-1.amazonaws.com/sjcdigitalarchives/original/3a608b072c84d5dafc0b4103f44fd586.pdf,Text,"The Bulletin",1,0
2825,https://digitalarchives.sjc.edu/items/show/2825,"St. John's Collegian, October 21, 1950","Vol. LXIV, No. [1] of the St. John's Collegian. Published on October 21, 1950.",,"St. John's College","Annapolis, MD",1950-10-21,"St. John's College owns the rights to this publication.",text,pdf,,,,,English,"Collegian Vol. LXIV No. 01",,,,,,,,,"8 pages",,,,,,,,,,paper,,,,,,,,,,,,,,,,,,,,,,,,,,"Student publication,The Collegian",https://s3.us-east-1.amazonaws.com/sjcdigitalarchives/original/d4a010f0a2b5047ea26db9b107f6dfdc.pdf,Text,"The Collegian",1,0
1326,https://digitalarchives.sjc.edu/items/show/1326,"Inauguration of Richard Daniel Weigle as Eighteenth President of St. John's College","Program of the inauguration",,"St. John's College","Annapolis, MD",1950-10-28,"St. John's College owns the rights to this publication.",text,pdf,,,,,English,Bx1-79,,,,,,,,,"8 pages",,,,,,,,,,paper,,,,,,,,,,,,,,,,,,,,,,,,,,"Inauguration,Presidents",https://s3.us-east-1.amazonaws.com/sjcdigitalarchives/original/381d2b27734c2b27d026d489a51de7b5.pdf,Text,"Playbills & Programs",1,1
6530,https://digitalarchives.sjc.edu/items/show/6530,"Address of John W. Owens at the Inauguration of Richard D. Weigle","Address of John W. Owens at the Inauguration of St. John's College President Richard D. Weigle on October 28, 1950.","John W. Owens ","St. John's College","Annapolis, MD",1950-10-28,"St. John's College owns the rights to this publication.
",text,pdf,,"inauguration ",,,,"John Owens Address for Weigle Inauguaration",,,,,,,,,,,,,,,,,,,,,,,,,,,,,,,,,,,,,,,,,,,,,Inauguration,https://s3.us-east-1.amazonaws.com/sjcdigitalarchives/original/6356a46b8bc98643a5a69457472ad514.pdf,Text,"Speeches, presentations, and other lectures",1,0
6537,https://digitalarchives.sjc.edu/items/show/6537,"Inaugural Address of President Richard D. Weigle","The Inaugural Address given by St. John's College President Richard D. Weigle on October 28, 1950.","Weigle, Richard D.","St. John's College","Annapolis, MD",1950-10-28,"St. John's College owns the rights to this publication.",text,pdf,,,,,English,"Weigle Inaugural Address 1950",,,,,,,,,"9 pages",,,,,,,,,,paper,,,,,,,,,,,,,,,,,,,,,,,,,,,https://s3.us-east-1.amazonaws.com/sjcdigitalarchives/original/afea2ae171d789c12478e682068a6fce.pdf,Text,"Speeches, presentations, and other lectures",1,0
2826,https://digitalarchives.sjc.edu/items/show/2826,"St. John's Collegian, November 11, 1950","Vol. LXIV, No. 2 of the St. John's Collegian. Published on November 11, 1950.",,"St. John's College","Annapolis, MD",1950-11-11,"St. John's College owns the rights to this publication.",text,pdf,,,,,English,"Collegian Vol. LXIV No. 02",,,,,,,,,"14 pages",,,,,,,,,,paper,,,,,,,,,,,,,,,,,,,,,,,,,,"Student publication,The Collegian",https://s3.us-east-1.amazonaws.com/sjcdigitalarchives/original/7a00866cf7a56a4ad50d1f84efcde057.pdf,Text,"The Collegian",1,0
3745,https://digitalarchives.sjc.edu/items/show/3745,"Bulletin of St. John's College in Annapolis, December 1950","Volume II, No. 4 of the Bulletin of St. John's College in Annapolis, Inaugural Proceedings.  Published in  December 1950.","St. John's College","St. John's College","Annapolis, MD",1950-12,"St. John's College owns the rights to this publication.",text,pdf,,"Weigle, Richard Daniel, 1912- ",,,English,"Bulletin December 1950-Vol II #4a-Inaugural Procedings",,,,,,,,,"24 pages",,,,,,,,,,paper,,,,,,,,,,,,,,,,,,,,,,,,,,"Inauguration,Presidents",https://s3.us-east-1.amazonaws.com/sjcdigitalarchives/original/0c833bb48c07fc126271db888a5fd033.pdf,Text,"The Bulletin",1,0
