﻿"Item Id","Item URI","Dublin Core:Title","Dublin Core:Description","Dublin Core:Creator","Dublin Core:Publisher","Dublin Core:Coverage","Dublin Core:Date","Dublin Core:Rights","Dublin Core:Type","Dublin Core:Format","Dublin Core:Source","Dublin Core:Subject","Dublin Core:Contributor","Dublin Core:Relation","Dublin Core:Language","Dublin Core:Identifier","Item Type Metadata:Occupation","Item Type Metadata:Participants","Item Type Metadata:Death Date","Item Type Metadata:Birthplace","Item Type Metadata:Birth Date","Item Type Metadata:Interviewer","Item Type Metadata:Biographical Text","Item Type Metadata:Bibliography","Item Type Metadata:Page numeration","Item Type Metadata:Resolution","Item Type Metadata:Identifier","Item Type Metadata:Inventory","Item Type Metadata:URL","Item Type Metadata:Text","Item Type Metadata:Interviewee","Item Type Metadata:Location","Item Type Metadata:Transcription","Item Type Metadata:Local URL","Item Type Metadata:Original Format","Item Type Metadata:Physical Dimensions","Item Type Metadata:Duration","Item Type Metadata:Compression","Item Type Metadata:Producer","Item Type Metadata:Director","Item Type Metadata:Bit Rate/Frequency","Item Type Metadata:Email Body","Item Type Metadata:Event Type","Item Type Metadata:Lesson Plan Text","Item Type Metadata:Materials","Item Type Metadata:Objectives","Item Type Metadata:Standards","Item Type Metadata:Number of Attachments","Item Type Metadata:BCC","Item Type Metadata:CC","Item Type Metadata:To","Item Type Metadata:From","Item Type Metadata:Subject Line","Item Type Metadata:Time Summary","Item Type Metadata:Episode","Item Type Metadata:Season","Item Type Metadata:Episode Type","Item Type Metadata:Explicit","Item Type Metadata:Block","PDF Text:Text",tags,file,itemType,collection,public,featured
800,https://digitalarchives.sjc.edu/items/show/800,"Lecture/Concert Schedule 2013-2014","Schedule of lectures and concerts for the 2013-2014 Academic Year.","Office of the Dean","St. John's College","Annapolis, MD",2013-2014,"St. John's College owns the rights to this publication.",text,pdf,,,"Kraus, Pamela; Pepperberg, Irene M. (Irene Maxine); Wiener, Linda F., 1957-; Townsend, David; Braithwaite, William; Link, Matthew, 1975-; Peirce, William; Burger, Ronna; Maher, Daniel P. (Daniel Patrick), 1964-; Russell, George; Brogan, Michael; Scott, John T.; Ricks, Christopher; Velkley, Richard L.; Roochnik, David; Harman, Graham, 1968-; Harrell, Daniel M., 1961-; The Aulos Ensemble; Panthaki, Sherezade; King William Players; Goldberg, Robert; Craig, Tobin; Kelly, Christopher J., 1970-",,English,"Lecture Schedule 2013-2014",,,,,,,,,"4 pages",,,,,,,,,,paper,,,,,,,,,,,,,,,,,,,,,,,,,,"Friday night lecture,Lecture schedule",https://s3.us-east-1.amazonaws.com/sjcdigitalarchives/original/f4888c41c53bb20fbde67afad9888b10.pdf,Text,"St. John's College Formal Lecture Series—Annapolis",1,0
801,https://digitalarchives.sjc.edu/items/show/801,"Lecture/Concert Schedule 2012-2013","Schedule of lectures and concerts for the 2012-2013 Academic Year.","Office of the Dean","St. John's College","Annapolis, MD",2012-2013,"St. John's College owns the rights to this publication.",text,pdf,,,"Kraus, Pamela, 1945-; Kutler, Samuel S.; Schulman, Adam; Braithwaite, William; Parker Quartet; Kalkavage, Peter; Crockett, Steven; Selcer, Daniel; Stephenson, David; New York Polyphony (Musical group); Recco, Gregory; Wood, James; Grenke, Michael W.; Chiu, Frederic; Casey, Dylan; Harrell, Daniel; Duvoisin, Jacques; Lennox, James; Sinnett, Mark, 1963-; Peters, Ralph; Smith, Jeffrey; LeCuyer, Phillip; Zuckerman, Elliott; King William Players","September 7, 2012. Schulman, Adam. <a href=""http://digitalarchives.sjc.edu/items/show/53"" title=""The anger of Achilles, and its source"">The anger of Achilles, and its source</a> (audio); September 7, 2012. Schulman, Adam. <a href=""http://digitalarchives.sjc.edu/items/show/54"" title=""The anger of Achilles, and its source"">The anger of Achilles, and its source</a> (typescript); September 28, 2012. Kalkavage, Peter. <a href=""http://digitalarchives.sjc.edu/items/show/36"" title=""The musical universe and Mozart's Magic Flute"">The musical universe and Mozart's Magic Flute</a> (audio); September 28, 2012. Kalkavage, Peter. <a href=""http://digitalarchives.sjc.edu/items/show/37"" title=""The musical universe and Mozart's Magic Flute"">The musical universe and Mozart's Magic Flute</a> (typescript); November 2, 2012. Stephenson, David. <a href=""http://digitalarchives.sjc.edu/items/show/57"" title=""Melodies and faces"">Melodies and faces</a> (audio); November 2, 2012. Stephenson, David. <a href=""http://digitalarchives.sjc.edu/items/show/58"" title=""Melodies and faces"">Melodies and faces</a> (typescript); November 30, 2012. Recco, Greg. <a href=""http://digitalarchives.sjc.edu/items/show/49"" title=""The soul's choice of life"">The soul's choice of life</a> (audio); November 30, 2012. Recco, Greg. <a href=""http://digitalarchives.sjc.edu/items/show/51"" title=""The soul's choice of life"">The soul's choice of life</a> (typescript); January 18, 2013. Grenke, Michael. <a href=""http://digitalarchives.sjc.edu/items/show/28"" title=""What will heaven be like?"">What will heaven be like?</a> (audio); January 18, 2013. Grenke, Michael. <a href=""http://digitalarchives.sjc.edu/items/show/29"" title=""What will heaven be like?"">What will heaven be like?</a> (typescript); February 8, 2013. Casey, Dylan. <a href=""http://digitalarchives.sjc.edu/items/show/22"" title=""Surprises and sweet spots"">Surprises and sweet spots</a> (audio); February 15, 2013. Harrell, Daniel. <a href=""http://digitalarchives.sjc.edu/items/show/33"" title=""Does music move?"">Does music move?</a> (audio); February 15, 2013. Harrell, Daniel. <a href=""http://digitalarchives.sjc.edu/items/show/34"" title=""Does music move?"">Does music move?</a> (typescript); March 22, 2013. Lennox, James. <a href=""http://digitalarchives.sjc.edu/items/show/41"" title=""Aristotle on respiration"">Aristotle on respiration</a> (audio); April 12, 2013. LeCuyer, Phillip. <a href=""http://digitalarchives.sjc.edu/items/show/39"" title=""Intellectual sin"">Intellectual sin</a> (audio); April 12, 2013. LeCuyer, Phillip. <a href=""http://digitalarchives.sjc.edu/items/show/40"" title=""Intellectual sin"">Intellectual sin</a> (typescript); April 19, 2013. Zuckerman, Elliott. <a href=""http://digitalarchives.sjc.edu/items/show/332"" title=""Why I still scan verse"">Why I still scan verse</a> (audio)",English,"Lecture Schedule 2012-2013",,,,,,,,,"3 pages",,,,,,,,,,paper,,,,,,,,,,,,,,,,,,,,,,,,,,"Friday night lecture,Lecture schedule",https://s3.us-east-1.amazonaws.com/sjcdigitalarchives/original/b53b4b242b4112e24ef785eae6adc0af.pdf,Text,"St. John's College Formal Lecture Series—Annapolis",1,0
802,https://digitalarchives.sjc.edu/items/show/802,"Lecture/Concert Schedule 2011-2012","Schedule of lectures and concerts for the 2011-2012 Academic Year.","Office of the Dean","St. John's College","Annapolis, MD",2011-2012,"St. John's College owns the rights to this publication.",text,pdf,,,"Kraus, Pamela; Trigg, Fawn; Palmieri, Paolo; Braithwaite, William; Bill Charlap Jazz Trio; Mazur, Barry; Nadler, Steven M., 1958-; Parker String Quartet; Brann, Eva T. H.; Greene, Josh; Smith, Jay; Pihas, Gabriel; Davis, Matthew; Flaumenhaft, Mera J.; Wells, Jonathan; Nordic Voices (Musical group); Smith, Jeffrey; Dickson, Colin; Widzisz, Marcel Andrew, 1972-; Wolff, Christoph; Kirby, Margaret; Petrich, Louis; King William Players","September 30, 2011. Mazur, Barry. <a title=""What is the surface area of a hedgehog?"" href=""http://digitalarchives.sjc.edu/items/show/42"">What is the surface area of a hedgehog?</a> (audio); November 4, 2011. Brann, Eva T. H. <a title=""Talking, reading, writing, listening: a lecture for parents and students"" href=""http://digitalarchives.sjc.edu/items/show/12"">Talking, reading, writing, listening: a lecture for parents and students</a> (audio); November 11, 2011. Greene, Josh. <a title=""Beyond point-and-shoot morality : why cognitive science matters for ethics"" href=""http://digitalarchives.sjc.edu/items/show/27"">Beyond point-and-shoot morality : why cognitive science matters for ethics</a> (audio); December 2, 2011. Pihas, Gabriel. <a title=""Dante's Beatrice : between idolatry and iconoclasm"" href=""http://digitalarchives.sjc.edu/items/show/48"">Dante's Beatrice : between idolatry and iconoclasm</a> (audio); January 13, 2012. Davis, Matthew. <a title=""Is man the measure of all things? : Plato's analysis of relativism"" href=""http://digitalarchives.sjc.edu/items/show/25"">Is man the measure of all things? : Plato's analysis of relativism </a>(audio); January 27, 2012. Wells, Jonathan. <a title=""Poetry reading from &quot;Train Dance&quot;"" href=""http://digitalarchives.sjc.edu/items/show/59"">Poetry reading from ""Train Dance""</a> (audio); April 13, 2012. Kirby, Margaret. <a title=""Lucretius on the nature of things"" href=""http://digitalarchives.sjc.edu/items/show/60"">Lucretius on the nature of things</a> (audio); April 13, 2012. Kirby, Margaret. <a title=""Lucretius on the nature of things"" href=""http://digitalarchives.sjc.edu/items/show/38"">Lucretius on the nature of things</a> (typescript); April 20, 2012. Petrich, Louis. <a title=""To meet with Macbeth"" href=""http://digitalarchives.sjc.edu/items/show/47"">To meet with Macbeth</a> (audio)",English,"Lecture Schedule 2011-2012",,,,,,,,,"3 pages",,,,,,,,,,paper,,,,,,,,,,,,,,,,,,,,,,,,,,"Friday night lecture,Lecture schedule",https://s3.us-east-1.amazonaws.com/sjcdigitalarchives/original/8092707f4f4b09d84c3c2ef57de46889.pdf,Text,"St. John's College Formal Lecture Series—Annapolis",1,0
803,https://digitalarchives.sjc.edu/items/show/803,"Lecture/Concert Schedule 2010-2011 (Revised 2/24/11)","Schedule of lectures and concerts for the 2010-2011 Academic Year.","Office of the Dean","St. John's College","Annapolis, MD",2010-2011,"St. John's College owns the rights to this publication.",text,pdf,,,"Kraus, Pamela; Harrell, Daniel; Carey, James; Braithwaite, William; Berns, Laurence, 1928-; Pesic, Peter; Kalkavage, Peter; McCombs, Richard; Pratt, Awadagin; McClay, Wilfred M.; The Western Wind Vocal Sextet; Crist, Joan Frances; Ramachandran, S.; Brubaker, Lauren; Moevs, Christian; Locke, Patricia M.; Parker String Quartet; Hanning, Barbara Russano, 1940-; Casson, Douglas; McCoy, Marina, 1968-; Schaub, Diana; Casey, Dylan; King William Players","September 3, 2010. Harrell, Daniel. <a title=""Does beauty have a place in liberal education?"" href=""http://digitalarchives.sjc.edu/items/show/32"">Does beauty have a place in liberal education?</a> (audio); October 15, 2010. Kalkavage, Peter. <a title=""Principles of motion and the motion of principles : Hegel's inverted world"" href=""http://digitalarchives.sjc.edu/items/show/35"">Principles of motion and the motion of principles : Hegel's inverted world</a> (audio); January 21, 2011. Brubaker, Lauren. <a title=""Wealth, virtue and corruption : Adam Smith's moral philosophy"" href=""http://digitalarchives.sjc.edu/items/show/20"">Wealth, virtue and corruption : Adam Smith's moral philosophy</a> (audio); March 25, 2011. Hanning, Barbara. <a title=""How opera began : and why it began in Florence"" href=""http://digitalarchives.sjc.edu/items/show/30"">How opera began : and why it began in Florence</a> (audio); April 1, 2011. Casson, Douglas. <a title=""Stabilizing currency : Locke on money, morality, and natural law"" href=""http://digitalarchives.sjc.edu/items/show/23"">Stabilizing currency : Locke on money, morality, and natural law</a> (audio) [Schedule lists incorrect title]; April 8, 2011. McCoy, Marina. <a title=""Pity as a civic virtue in Sophocles' Philoctetes"" href=""http://digitalarchives.sjc.edu/items/show/43"">Pity as a civic virtue in Sophocles' Philoctetes</a> (audio)",English,"Lecture Schedule 2010-2011",,,,,,,,,"3 pages",,,,,,,,,,paper,,,,,,,,,,,,,,,,,,,,,,,,,,"Friday night lecture,Lecture schedule",https://s3.us-east-1.amazonaws.com/sjcdigitalarchives/original/31438cda32a0ba15ba3787750c7ab5b7.pdf,Text,"St. John's College Formal Lecture Series—Annapolis",1,0
804,https://digitalarchives.sjc.edu/items/show/804,"Lecture/Concert Schedule First Semester 2009-2010 (Revised December 11, 2009) & Second Semester 2009-2010 (Revised April 2, 2010)","Schedule of lectures and concerts for the 2009-2010 Academic Year.","Office of the Dean","St. John's College","Annapolis, MD",2009-2010,"St. John's College owns the rights to this publication.",text,pdf,,,"Dink, Michael; Hills, Roderick; Wiesel, Elie, 1928-2016; Fisk, Elliott; Martínez-Fraga, Pedro J.; Kutler, Samuel; Fagan, Patricia; Miller, Mitchell; Anonymous 4 (Musical group); Borjesson, Gary; Simonides, Yannis; Anderson, Sybol Cook; Allen, Danielle; Stephenson, David; Smith, Jeffrey; Kinzie, Mary; Parker String Quartet; Smith, Joseph; Mansir, Brother Donald; Zuckerman, Elliott; Ludwig, Paul; Duvoisin, Jacques; King William Players",,English,"Lecture Schedule 2009-2010",,,,,,,,,"4 pages",,,,,,,,,,paper,,,,,,,,,,,,,,,,,,,,,,,,,,"Friday night lecture,Lecture schedule",https://s3.us-east-1.amazonaws.com/sjcdigitalarchives/original/d3d681ef2ba25f42d3a917fef8b5f100.pdf,Text,"St. John's College Formal Lecture Series—Annapolis",1,0
805,https://digitalarchives.sjc.edu/items/show/805,"Lecture/Concert Schedule 2008-2009 (Revised 12/19/08)","Schedule of lectures and concerts for the 2008-2009 Academic Year.","Office of the Dean","St. John's College","Annapolis, MD",2008-2009,"St. John's College owns the rights to this publication.",text,pdf,,,"Dink, Michael; Edelman, Peter; Townsend, David; Morse, Steve; Parker String Quartet; Short, Thomas L.; Feldman, Noah, 1970-; Nicgorski, Walter; Grenke, Michael W.; Bernasconi, Robert; Pichanick, Alan; Lear, Jonathan; Tuck, Jonathan; Lubin, Steven; Silver, Joan; Licad, Cecile, 1961-; Mercer, Christia; Smith, Jeffrey; Hopkins, Burt; Tweney, Ryan D.; Higuera, Henry, 1952-; Jackiw, Stefan; King William Players","January 16, 2009. Tuck, Jonathan. <a href=""http://digitalarchives.sjc.edu/items/show/3801"" title=""Gargantua's games"">Gargantua's games</a> (audio)",English,"Lecture Schedule 2008-2009",,,,,,,,,"3 pages",,,,,,,,,,paper,,,,,,,,,,,,,,,,,,,,,,,,,,"Friday night lecture,Lecture schedule",https://s3.us-east-1.amazonaws.com/sjcdigitalarchives/original/2576b8282de15fc8a731398b0e3f7851.pdf,Text,"St. John's College Formal Lecture Series—Annapolis",1,0
806,https://digitalarchives.sjc.edu/items/show/806,"Lecture/Concert Schedule 2007-2008 (Updated 3/26/08) ","Schedule of lectures and concerts for the 2007-2008 Academic Year.","Office of the Dean","St. John's College","Annapolis, MD",2007-2008,"St. John's College owns the rights to this publication.",text,pdf,,,"Dink, Michael; Petrich, Louis; Fiez, Julie A.; Grenke, Michael W.; Malamud, Deborah; McNeill, David; Dougherty, Janet; DiBennedetto, Angela; Honeywell, Claudia; Café Zimmermann (Musical group); Livio, Mario, 1945-; Young, Andrew; Levine, Alan; Smith, Thee; Painter, Corinne Michelle; Pomerium Chapel Choir; Druecker, Robert; Miller, Mitchell; Marsoner, Ingrid; Schulman, Adam; Burke, Chester; Caswell, Matthew; King William Players",,English,"Lecture Schedule 2007-2008",,,,,,,,,"3 pages",,,,,,,,,,paper,,,,,,,,,,,,,,,,,,,,,,,,,,"Friday night lecture,Lecture schedule",https://s3.us-east-1.amazonaws.com/sjcdigitalarchives/original/e6015cf6aee2a3214e83c8c7bfa13ac0.pdf,Text,"St. John's College Formal Lecture Series—Annapolis",1,0
807,https://digitalarchives.sjc.edu/items/show/807,"Lecture/Concert Schedule First Semester - 2006-2007 (August 24, 2006 - corrected copy) & Second Semester - 2006-2007","Schedule of lectures and concerts for the 2006-2007 Academic Year.","Office of the Dean","St. John's College","Annapolis, MD",2006-2007,"St. John's College owns the rights to this publication.",text,pdf,,,"Dink, Michael; Barbera, André; Poe, L. Harvey (Luke Harvey); Sterling IV, J. Walter; Kutler, Samuel; Tuck, Jonathan; Bagley, Paul; Arieti, James A.; Haefliger, Andreas; Branning, David; Pagano, Frank N.; Tomarchio, John; Sanders, Kirk R., 1966-; The Aulos Ensemble; Smith, Joseph; Mlinko, Ange; Paglia, Camille, 1947-; Norris, James; von Nolcken, Christina; Russell, George; Tipton, Jason A.; King William Players","October 13, 2006. Tuck, Jonathan. <a href=""http://digitalarchives.sjc.edu/items/show/3800"" title=""Baudelaire's swan song"">Baudelaire's swan song</a> (audio); October 13, 2006. Tuck, Jonathan. <a href=""http://digitalarchives.sjc.edu/items/show/3797"">Baudelaire's swan song</a> (typescript)",English,"Lecture Schedule 2006-2008",,,,,,,,,"3 pages",,,,,,,,,,paper,,,,,,,,,,,,,,,,,,,,,,,,,,"Friday night lecture,Lecture schedule",https://s3.us-east-1.amazonaws.com/sjcdigitalarchives/original/905a24c0f76c81129a3bf1e766e514ca.pdf,Text,"St. John's College Formal Lecture Series—Annapolis",1,0
808,https://digitalarchives.sjc.edu/items/show/808,"An ennobling innocence : the founding of Socrates' Republic","Transcript of a lecture given on August 2, 1995 by David Levine as part of the Graduate Institute Summer Lecture Series.","Levine, David Lawrence","St. John's College","Santa Fe, NM",1995-08-02,"Meem Library has been given permission to make this item available online.",text,pdf,,"Plato. Republic",,,English,24000405,,,,,,,,,"16 pages",,,,,,,,,,paper,,,,,,,,,,,,,,,,,,,,,,,,,,"Graduate Institute",https://s3.us-east-1.amazonaws.com/sjcdigitalarchives/original/a4275500f36cd16d9b13e585a2305b37.pdf,Text,"St. John's College Lecture Transcripts—Santa Fe",1,0
809,https://digitalarchives.sjc.edu/items/show/809,"""I hate books"" or making room for learning","Transcript of the Graduate Institute convocation address given on June 15, 1997 by David Levine in Santa Fe, NM.","Levine, David Lawrence","St. John's College","Santa Fe, NM",1997-06-15,"Meem Library has been given permission to make this item available online.",text,pdf,,"Rousseau, Jean-Jacques, 1712-1778. Emile.; Education",,,English,24000406,,,,,,,,,"5 pages",,,,,,,,,,paper,,,,,,,,,,,,,,,,,,,,,,,,,,"Convocation,Graduate Institute",https://s3.us-east-1.amazonaws.com/sjcdigitalarchives/original/95696876ebdbc5a675af4d563e36b1f2.pdf,Text,"Speeches, presentations, and other lectures",1,0
810,https://digitalarchives.sjc.edu/items/show/810,"Four sides of a cube : or, why a certain question must be asked again and again","Transcript of a lecture given on August 31, 2001 by David Levine as part of the Dean's Lecture and Concert Series.","Levine, David Lawrence","St. John's College","Santa Fe, NM",2001-08-31,"Meem Library has been given permission to make this item available online.",text,pdf,,"Philosophy; Questions and answers",,,English,24000613,,,,,,,,,"16 pages",,,,,,,,,,paper,,,,,,,,,,,,,,,,,,,,,,,,,,"Friday night lecture",https://s3.us-east-1.amazonaws.com/sjcdigitalarchives/original/e15e3f5243a8a1ae925c953b8b53f708.pdf,Text,"St. John's College Lecture Transcripts—Santa Fe",1,0
811,https://digitalarchives.sjc.edu/items/show/811,"A community of learning... in a land of Cartesians?","Transcript of a lecture given on August 30, 2002 by David Levine as part of the Dean's Lecture and Concert Series.","Levine, David Lawrence","St. John's College","Santa Fe, NM",2002-08-30,"Meem Library has been given permission to make this item available online.",text,pdf,,"Tocqueville, Alexis de, 1805-1859.; Descartes, René, 1596-1650.; Plato; United States -- Intellectual life",,,English,24000652,,,,,,,,,"18 pages",,,,,,,,,,paper,,,,,,,,,,,,,,,,,,,,,,,,,,"Friday night lecture",https://s3.us-east-1.amazonaws.com/sjcdigitalarchives/original/8181547ef4ead9780876e1d33aa8a91c.pdf,Text,"St. John's College Lecture Transcripts—Santa Fe",1,0
812,https://digitalarchives.sjc.edu/items/show/812,"""At the very center of the plenitude"" : Goethe's grand attempt to overcome the 18th century, or how freshman laboratory saved Goethe from the general sickness of his age","Transcript of a lecture given on August 29, 2003 by David Levine as part of the Dean's Lecture and Concert Series.","Levine, David Lawrence","St. John's College","Santa Fe, NM",2003-08-29,"Meem Library has been given permission to make this item available online.",text,pdf,,"Goethe, Johann Wolfgang von, 1749-1832.",,,English,24000772,,,,,,,,,"19 pages",,,,,,,,,,paper,,,,,,,,,,,,,,,,,,,,,,,,,,"Friday night lecture",https://s3.us-east-1.amazonaws.com/sjcdigitalarchives/original/b7e04bd419d83ac6518790016c792369.pdf,Text,"St. John's College Lecture Transcripts—Santa Fe",1,0
813,https://digitalarchives.sjc.edu/items/show/813,"The forgotten faculty : the place of phronesis or practical sense in liberal education","Transcript of a lecture given on August 27, 2004 by David Levine as part of the Dean's Lecture and Concert Series.","Levine, David Lawrence","St. John's College","Santa Fe, NM",2004-08-27,"Meem Library has been given permission to make this item available online.",text,pdf,,"Education, Humanistic",,,English,24002948,,,,,,,,,"18 pages",,,,,,,,,,paper,,,,,,,,,,,,,,,,,,,,,,,,,,"Friday night lecture",https://s3.us-east-1.amazonaws.com/sjcdigitalarchives/original/503ca1bd6d522474815e09dc26a52487.pdf,Text,"St. John's College Lecture Transcripts—Santa Fe",1,0
814,https://digitalarchives.sjc.edu/items/show/814,"You too have read Newton!","Transcript of the commencement address given on May 20, 2006 by David Levine in Santa Fe, NM.","Levine, David Lawrence","St. John's College","Santa Fe, NM",2006-05-20,"Meem Library has been given permission to make this item available online.",text,pdf,,"Education, Higher",,,English,24003171,,,,,,,,,"6 pages",,,,,,,,,,paper,,,,,,,,,,,,,,,,,,,,,,,,,,Commencement,https://s3.us-east-1.amazonaws.com/sjcdigitalarchives/original/6f5b46790354c9d7056ae9176f2e10c7.pdf,Text,"Speeches, presentations, and other lectures",1,0
815,https://digitalarchives.sjc.edu/items/show/815,"This senseless course of human things : 'one of Professor Kant's most cherished ideas'","Transcript of a lecture given on August 26, 2005 by David Levine as part of the Dean's Lecture and Concert Series.","Levine, David Lawrence","St. John's College","Santa Fe, NM",2005-08-26,"Meem Library has been given permission to make this item available online.",text,pdf,,"Kant, Immanuel, 1724-1804.; Education, Higher",,,English,24003173,,,,,,,,,"20 pages",,,,,,,,,,paper,,,,,,,,,,,,,,,,,,,,,,,,,,"Friday night lecture",https://s3.us-east-1.amazonaws.com/sjcdigitalarchives/original/0f20ac4b2e691cb4e0de1e6b41d12e5a.pdf,Text,"St. John's College Lecture Transcripts—Santa Fe",1,0
816,https://digitalarchives.sjc.edu/items/show/816,"Hand-me-downs : or the traditionalization of thought","Transcript of the Graduate Institute convocation address given on June 14, 1998 by David Levine in Santa Fe, NM.","Levine, David Lawrence","St. John's College","Santa Fe, NM",1998-06-14,"Meem Library has been given permission to make this item available online.",text,pdf,,"Learning and scholarship",,,English,24003174,,,,,,,,,"8 pages",,,,,,,,,,paper,,,,,,,,,,,,,,,,,,,,,,,,,,"Convocation,Graduate Institute",https://s3.us-east-1.amazonaws.com/sjcdigitalarchives/original/6ad1a18a9b2b9c77460e76fec6acb025.pdf,Text,"Speeches, presentations, and other lectures",1,0
817,https://digitalarchives.sjc.edu/items/show/817,"A world of worldless truths, an invitation to philosophy","Transcript of the Graduate Institute convocation address given on June 20, 1999 by David Levine in Santa Fe, NM.","Levine, David Lawrence","St. John's College","Santa Fe, NM",1999-06-20,"Meem Library has been given permission to make this item available online.",text,pdf,,"Philosophy; Learning and scholarship",,,English,24003175,,,,,,,,,"12 pages",,,,,,,,,,paper,,,,,,,,,,,,,,,,,,,,,,,,,,"Convocation,Graduate Institute",https://s3.us-east-1.amazonaws.com/sjcdigitalarchives/original/c03377a141baddbe91eb9196f92e2a1b.pdf,Text,"Speeches, presentations, and other lectures",1,0