﻿"Item Id","Item URI","Dublin Core:Title","Dublin Core:Description","Dublin Core:Creator","Dublin Core:Publisher","Dublin Core:Coverage","Dublin Core:Date","Dublin Core:Rights","Dublin Core:Type","Dublin Core:Format","Dublin Core:Source","Dublin Core:Subject","Dublin Core:Contributor","Dublin Core:Relation","Dublin Core:Language","Dublin Core:Identifier","Item Type Metadata:Occupation","Item Type Metadata:Participants","Item Type Metadata:Death Date","Item Type Metadata:Birthplace","Item Type Metadata:Birth Date","Item Type Metadata:Interviewer","Item Type Metadata:Biographical Text","Item Type Metadata:Bibliography","Item Type Metadata:Page numeration","Item Type Metadata:Resolution","Item Type Metadata:Identifier","Item Type Metadata:Inventory","Item Type Metadata:URL","Item Type Metadata:Text","Item Type Metadata:Interviewee","Item Type Metadata:Location","Item Type Metadata:Transcription","Item Type Metadata:Local URL","Item Type Metadata:Original Format","Item Type Metadata:Physical Dimensions","Item Type Metadata:Duration","Item Type Metadata:Compression","Item Type Metadata:Producer","Item Type Metadata:Director","Item Type Metadata:Bit Rate/Frequency","Item Type Metadata:Email Body","Item Type Metadata:Event Type","Item Type Metadata:Lesson Plan Text","Item Type Metadata:Materials","Item Type Metadata:Objectives","Item Type Metadata:Standards","Item Type Metadata:Number of Attachments","Item Type Metadata:BCC","Item Type Metadata:CC","Item Type Metadata:To","Item Type Metadata:From","Item Type Metadata:Subject Line","Item Type Metadata:Time Summary","Item Type Metadata:Episode","Item Type Metadata:Season","Item Type Metadata:Episode Type","Item Type Metadata:Explicit","Item Type Metadata:Block","PDF Text:Text",tags,file,itemType,collection,public,featured
5457,https://digitalarchives.sjc.edu/items/show/5457,"Side View of Woodward Hall Library during Construction, Annapolis, Maryland","1 photographic print : b&w","Stewart Brothers, Inc.",,"Annapolis, MD",9/26/1968,"St. John's college owns the rights to this photograph.","Still Image",jpeg,,,,,,SJC-P-1430,,,,,,,,,,,,,,,,,,,Photograph,"25.5 x 20.5 cm.",,,,,,,,,,,,,,,,,,,,,,,,,"Woodward Hall Library",https://s3.us-east-1.amazonaws.com/sjcdigitalarchives/original/577d7d89f14530bfcfe186cd467e86c1.jpg,"Still Image","Photographic Archive—Annapolis",1,0
5456,https://digitalarchives.sjc.edu/items/show/5456,"Front View of Woodward Hall Library under Construction, Annapolis, Maryland","1 photographic print : b&w","Stewart Brothers, Inc.",,"Annapolis, MD",9/26/1968,"St. John's college owns the rights to this photograph.","Still Image",jpeg,,,,,,SJC-P-1429,,,,,,,,,,,,,,,,,,,Photograph,"25.5 x 20.5 cm.",,,,,,,,,,,,,,,,,,,,,,,,,"Woodward Hall Library",https://s3.us-east-1.amazonaws.com/sjcdigitalarchives/original/76188a4105ad325eaa8a32cb49ee5ee2.jpg,"Still Image","Photographic Archive—Annapolis",1,0
5043,https://digitalarchives.sjc.edu/items/show/5043,"Students Seated at Convocation in Iglehart Hall","1 photographic print : b&w",Unknown,,"Annapolis, MD",9/25/1941,"St. John's College owns the rights to this photograph.","Still Image",jpeg,,"St. John's College (Annapolis, Md.) -- Students. ;  Iglehart Hall (St. John's College, Annapolis, MD)",,,,SJC-P-0963,,,,,,,,,,,,,,,,,,,Photograph,"25.5 x 20.5 cm.",,,,,,,,,,,,,,,,,,,,,,,,,"Convocation,Iglehart Hall",https://s3.us-east-1.amazonaws.com/sjcdigitalarchives/original/bad6b0b23bb006270d505590af2449ec.jpg,"Still Image","Photographic Archive—Annapolis",1,0
5042,https://digitalarchives.sjc.edu/items/show/5042,"Students Seated at Convocation in Iglehart Hall","1 photographic print : b&w",Unknown,,"Annapolis, MD",9/25/1941,"St. John's College owns the rights to this photograph.","Still Image",jpeg,,"St. John's College (Annapolis, Md.) -- Students. ;  Iglehart Hall (St. John's College, Annapolis, MD)",,,,SJC-P-0962,,,,,,,,,,,,,,,,,,,Photograph,"25.5 x 20.5 cm.",,,,,,,,,,,,,,,,,,,,,,,,,"Convocation,Iglehart Hall",https://s3.us-east-1.amazonaws.com/sjcdigitalarchives/original/bba592eac72d469273558cea1b7edeb3.jpg,"Still Image","Photographic Archive—Annapolis",1,0
5041,https://digitalarchives.sjc.edu/items/show/5041,"Convocation in Iglehart Hall","1 photographic print : b&w",Unknown,,"Annapolis, MD",9/25/1941,"St. John's College owns the rights to this photograph.","Still Image",jpeg,,"St. John's College (Annapolis, Md.) -- Students. ;  Iglehart Hall (St. John's College, Annapolis, MD)",,,,SJC-P-0961,,,,,,,,,,,,,,,,,,,Photograph,"25.5 x 20.5 cm.",,,,,,,,,,,,,,,,,,,,,,,,,"Convocation,Iglehart Hall",https://s3.us-east-1.amazonaws.com/sjcdigitalarchives/original/d6dc1b51038c57d733d5a5eb16b67595.jpg,"Still Image","Photographic Archive—Annapolis",1,0
5040,https://digitalarchives.sjc.edu/items/show/5040,"Convocation Procession Led by George A. Bingley","1 photographic print : b&w",Unknown,,"Annapolis, MD",9/25/1941,"St. John's College owns the rights to this photograph.","Still Image",jpeg,,"St. John's College (Annapolis, Md.) -- Students.",,,,SJC-P-0960,,,,,,,,,,,,,,,,,,,Photograph,"25.5 x 20.5 cm.",,,,,,,,,,,,,,,,,,,,,,,,,Convocation,https://s3.us-east-1.amazonaws.com/sjcdigitalarchives/original/4d504e55706b3935aec266eaea3a882d.jpg,"Still Image","Photographic Archive—Annapolis",1,0
5867,https://digitalarchives.sjc.edu/items/show/5867,"Side View of Woodward Hall Library under Construction, St. John's College, Annapolis, Maryland","1 photographic print : b&w","Stewart Brothers, Inc.",,"Annapolis, MD",8/23/1968,"St. John's College owns the rights to this photograph.","Still Image",jpeg,,,,,,SJC-P-2066,,,,,,,,,,,,,,,,,,,Photograph,"25.5 x 20.5 cm.",,,,,,,,,,,,,,,,,,,,,,,,,"Woodward Hall Library",https://s3.us-east-1.amazonaws.com/sjcdigitalarchives/original/be3e33003b80a0b5ceb8eb1a6a1350a1.jpg,"Still Image","Photographic Archive—Annapolis",1,0
5460,https://digitalarchives.sjc.edu/items/show/5460,"Woodward Hall Library Interior under Construction, Annapolis, Maryland","1 photographic print : b&w","Stewart Brothers, Inc.",,"Annapolis, MD",8/23/1968,"St. John's College owns the rights to this photograph.","Still Image",jpeg,,,,,,SJC-P-1433,,,,,,,,,,,,,,,,,,,Photograph,"25.5 x 20.5 cm.",,,,,,,,,,,,,,,,,,,,,,,,,"Woodward Hall Library",https://s3.us-east-1.amazonaws.com/sjcdigitalarchives/original/d20e98858c88dcf764b0ad12675ffcb3.jpg,"Still Image","Photographic Archive—Annapolis",1,0
5459,https://digitalarchives.sjc.edu/items/show/5459,"Woodward Hall Library Interior during Renovation, Annapolis, Maryland","1 photographic print : b&w","Stewart Brothers, Inc.",,"Annapolis, MD",8/23/1968,"St. John's College owns the rights to this photograph.","Still Image",jpeg,,,,,,SJC-P-1432,,,,,,,,,,,,,,,,,,,Photograph,"25.5 x 20.5 cm.",,,,,,,,,,,,,,,,,,,,,,,,,"Woodward Hall Library",https://s3.us-east-1.amazonaws.com/sjcdigitalarchives/original/4ec8071a5d4cfdc500945cabc94e853a.jpg,"Still Image","Photographic Archive—Annapolis",1,0
5454,https://digitalarchives.sjc.edu/items/show/5454,"Side View of Woodward Hall Library under Construction, Annapolis, Maryland","1 photographic print : b&w","Stewart Brothers, Inc.",,"Annapolis, MD",8/23/1968,"St. John's college owns the rights to this photograph.","Still Image",jpeg,,,,,,SJC-P-1427,,,,,,,,,,,,,,,,,,,Photograph,"25.5 x 20.5 cm.",,,,,,,,,,,,,,,,,,,,,,,,,"Woodward Hall Library",https://s3.us-east-1.amazonaws.com/sjcdigitalarchives/original/2746eb72ab7e4677ebbdeab6b42eb8ab.jpg,"Still Image","Photographic Archive—Annapolis",1,0
5734,https://digitalarchives.sjc.edu/items/show/5734,"John Spangler Kieffer and Colleagues Talk in the King William Room after Ford K. Brown's Lecture ""Shakespeare and Chartres"", August 16, 1972","1 photographic print : b&w","Fox, Cecil H.",,"Annapolis, MD",8/16/1972,"St. John's College owns the rights to this photograph.","Still Image",jpeg,,"Kieffer, John Spangler",,,,SJC-P-1811,,,,,,,,,,,,,,,,,,,Photograph,"20.5 x 25.5 cm.",,,,,,,,,,,,,,,,,,,,,,,,,Deans,https://s3.us-east-1.amazonaws.com/sjcdigitalarchives/original/5eb22778bea3ab506d1e3d7e64f7353a.jpg,"Still Image","Photographic Archive—Annapolis",1,0
5733,https://digitalarchives.sjc.edu/items/show/5733,"John Spangler Kieffer Seated in the King William Room during Ford K. Brown's Lecture ""Shakespeare and Chartres"", August 16, 1972","1 photographic print : b&w","Fox, Cecil H.",,"Annapolis, MD",8/16/1972,"St. John's College owns the rights to this photograph.","Still Image",jpeg,,"Kieffer, John Spangler",,,,SJC-P-1810,,,,,,,,,,,,,,,,,,,Photograph,"25.5 x 20.5 cm.",,,,,,,,,,,,,,,,,,,,,,,,,Deans,https://s3.us-east-1.amazonaws.com/sjcdigitalarchives/original/7736f88eb11513c03d30d661db6888ba.jpg,"Still Image","Photographic Archive—Annapolis",1,0
5732,https://digitalarchives.sjc.edu/items/show/5732,"John Spangler Kieffer Seated in the King William Room before Ford K. Brown's Lecture ""Shakespeare and Chartres"", August 16, 1972","1 photographic print : b&w","Fox, Cecil H.",,"Annapolis, MD",8/16/1972,"St. John's College owns the rights to this photograph.","Still Image",jpeg,,"Kieffer, John Spangler",,,,SJC-P-1809,,,,,,,,,,,,,,,,,,,Photograph,"25.5 x 20.5 cm.",,,,,,,,,,,,,,,,,,,,,,,,,Deans,https://s3.us-east-1.amazonaws.com/sjcdigitalarchives/original/edf05c788471b2c2d817198a96ce4e85.jpg,"Still Image","Photographic Archive—Annapolis",1,0
5788,https://digitalarchives.sjc.edu/items/show/5788,"A Man Standing on a Fallen Branch from the Liberty Tree, Annapolis, Maryland","1 photographic print : b&w","Pickering, E. H.",,"Annapolis, MD",7/6/1931,"St. John's College owns the rights to this photograph.","Still Image",jpeg,,,,,,SJC-P-1858,,,,,,,,,,,,,,,,,,,Photograph,"20.5 x 25.5 cm.",,,,,,,,,,,,,,,,,,,,,,,,,"Liberty tree",https://s3.us-east-1.amazonaws.com/sjcdigitalarchives/original/12b1b8bde69397a64b6ea027c4bff2e3.jpg,"Still Image","Photographic Archive—Annapolis",1,0
5176,https://digitalarchives.sjc.edu/items/show/5176,"Richard D. Weigle and Dudley Dowell Shaking Hands at a Meeting of the Independent College Funds of America","1 photographic print : b&w",Unknown,,"Annapolis, MD",6/22/1967,"St. John's College owns the rights to this photograph.","Still Image",jpeg,,"Weigle, Richard Daniel 1912- ;  Dowell, Dudley",,,,SJC-P-1146,,,,,,,,,,,,,,,,,,,Photograph,"25.5 x 20.5 cm.",,,,,,,,,,,,,,,,,,,,,,,,,"Honorary Alumni,Presidents",https://s3.us-east-1.amazonaws.com/sjcdigitalarchives/original/050c550469080c8bfe2a1a34a1787f0b.jpg,"Still Image","Photographic Archive—Annapolis",1,0
6206,https://digitalarchives.sjc.edu/items/show/6206,"Portrait of Edward G. Sparrow Seated with Book, St. John's College, Annapolis, Maryland","1 photographic print : b&w","Parran, Tom",,"Annapolis, MD",6/18/1981,"St. John's College owns the rights to this photograph.","Still Image",jpeg,,"Sparrow, Edward G.",,,,SJC-P-2451,,,,,,,,,,,,,,,,,,,Photograph,"20.5 x 25.5 cm.",,,,,,,,,,,,,,,,,,,,,,,,,,https://s3.us-east-1.amazonaws.com/sjcdigitalarchives/original/a83b2e1da8edb1e539232fac97368715.jpg,"Still Image","Photographic Archive—Annapolis",1,0
5664,https://digitalarchives.sjc.edu/items/show/5664,"Commencement under the Liberty Tree with Richard D. Weigle, in Academic Robe, Speaking while Three Children Seated on the Grass Look on, Annapolis, Maryland, June 10, 1968","1 photographic print : b&w","Troutner, Lee",,"Annapolis, MD",6/10/1968,"St. John's College owns the rights to this photograph.","Still Image",jpeg,,"Weigle, Richard Daniel 1912-",,,,SJC-P-1732,,,,,,,,,,,,,,,,,,,Photograph,"20.5 x 13.5 cm.",,,,,,,,,,,,,,,,,,,,,,,,,"Commencement,Honorary Alumni,Presidents",https://s3.us-east-1.amazonaws.com/sjcdigitalarchives/original/4a0051d35f5050aaf4444afdf1255f61.jpg,"Still Image","Photographic Archive—Annapolis",1,0
6203,https://digitalarchives.sjc.edu/items/show/6203,"Portrait of Edward G. Sparrow, St. John's College, Annapolis, Maryland","1 photographic print : b&w","Parran, Tom",,"Annapolis, MD",6-18-1681,"St. John's College owns the rights to this photograph.","Still Image",jpeg,,"Sparrow, Edward G.",,,,SJC-P-2448,,,,,,,,,,,,,,,,,,,Photograph,"12.5 x 20.5 cm.",,,,,,,,,,,,,,,,,,,,,,,,,,https://s3.us-east-1.amazonaws.com/sjcdigitalarchives/original/53bff28bba531bdb7098f1d0096c8df9.jpg,"Still Image","Photographic Archive—Annapolis",1,0
5139,https://digitalarchives.sjc.edu/items/show/5139,"Junior Great Books Classes at Jones Elementary School, Severna Park, Maryland Led by Susan J. Mackey and Pictures of a Memorial Plaque to Victor Zukerkandl","26 photographic prints : b&w","Nakata, Tamotsu",,"Annapolis, MD",5/27/1969,"St. John's College owns the rights to this photograph.","Still Image",jpeg,,"St. John's College (Annapolis, Md.) -- Students. ;  Mackey, Susan J.",,,,SJC-P-1117,,,,,,,,,,,,,,,,,,,Photograph,"25.5 x 20.5 cm.",,,,,,,,,,,,,,,,,,,,,,,,,"Alumni,Tutors",https://s3.us-east-1.amazonaws.com/sjcdigitalarchives/original/4787f894aba87da958db552f2e682f20.jpg,"Still Image","Photographic Archive—Annapolis",1,0
4669,https://digitalarchives.sjc.edu/items/show/4669,"Richard D. Weigle in Academic Robe, at Podium Speaking during Commencement, under the Liberty Tree, St. John's College, Annapolis, Maryland, May 21, 1979","1 photographic print : b&w","Henson, J.",,"Annapolis, MD",5/21/1979,"St. John's College owns the rights to this photograph.","Still Image",jpeg,,"Commencement (St. John's College, Annapolis, MD) 1979. ;  St. John's College (Annapolis, Md.). -- Presidents. ;  St. John's College (Santa Fe, N. M.). -- Presidents. ;  Weigle, Richard Daniel 1912-",,,,SJC-P-0729,,,,,,,,,,,,,,,,,,,Photograph,"18 x 12.5 cm.",,,,,,,,,,,,,,,,,,,,,,,,,"Commencement,Honorary Alumni,Presidents",https://s3.us-east-1.amazonaws.com/sjcdigitalarchives/original/580b861e75b6760918f8a5c32f2a1429.jpg,"Still Image","Photographic Archive—Annapolis",1,0
