﻿"Item Id","Item URI","Dublin Core:Title","Dublin Core:Description","Dublin Core:Creator","Dublin Core:Publisher","Dublin Core:Coverage","Dublin Core:Date","Dublin Core:Rights","Dublin Core:Type","Dublin Core:Format","Dublin Core:Source","Dublin Core:Subject","Dublin Core:Contributor","Dublin Core:Relation","Dublin Core:Language","Dublin Core:Identifier","Item Type Metadata:Occupation","Item Type Metadata:Participants","Item Type Metadata:Death Date","Item Type Metadata:Birthplace","Item Type Metadata:Birth Date","Item Type Metadata:Interviewer","Item Type Metadata:Biographical Text","Item Type Metadata:Bibliography","Item Type Metadata:Page numeration","Item Type Metadata:Resolution","Item Type Metadata:Identifier","Item Type Metadata:Inventory","Item Type Metadata:URL","Item Type Metadata:Text","Item Type Metadata:Interviewee","Item Type Metadata:Location","Item Type Metadata:Transcription","Item Type Metadata:Local URL","Item Type Metadata:Original Format","Item Type Metadata:Physical Dimensions","Item Type Metadata:Duration","Item Type Metadata:Compression","Item Type Metadata:Producer","Item Type Metadata:Director","Item Type Metadata:Bit Rate/Frequency","Item Type Metadata:Email Body","Item Type Metadata:Event Type","Item Type Metadata:Lesson Plan Text","Item Type Metadata:Materials","Item Type Metadata:Objectives","Item Type Metadata:Standards","Item Type Metadata:Number of Attachments","Item Type Metadata:BCC","Item Type Metadata:CC","Item Type Metadata:To","Item Type Metadata:From","Item Type Metadata:Subject Line","Item Type Metadata:Time Summary","Item Type Metadata:Episode","Item Type Metadata:Season","Item Type Metadata:Episode Type","Item Type Metadata:Explicit","Item Type Metadata:Block","PDF Text:Text",tags,file,itemType,collection,public,featured
6018,https://digitalarchives.sjc.edu/items/show/6018,"Chirstopher B. Nelson, in Academic Robe, Handing a Graduate His Diploma during Commencement underneath the Liberty Tree, St. John's College, Annapolis, Maryland","1 photographic print : color",Unknown,,"Annapolis, MD","1992-1997 [circa]","St. John's College owns the rights to this photograph.","Still Image",jpeg,,"Nelson, Christopher B., 1948-",,,,SJC-P-2284,,,,,,,,,,,,,,,,,,,Photograph,"7.5 x 10 cm.",,,,,,,,,,,,,,,,,,,,,,,,,"Commencement,Presidents",https://s3.us-east-1.amazonaws.com/sjcdigitalarchives/original/feb8deda41c9ba85f043bb95008f71e1.jpg,"Still Image","Photographic Archive—Annapolis",1,0
6017,https://digitalarchives.sjc.edu/items/show/6017,"Chirstopher B. Nelson, in Academic Robe, with two Students, Radoslav Datchev, Seated, and Eva T. H. Brann Speaking, at Commencement underneath the Liberty Tree, St. John's College, Annapolis, Maryland","1 photographic print : color",Unknown,,"Annapolis, MD","1992-1997 [circa]","St. John's College owns the rights to this photograph.","Still Image",jpeg,,"Datchev, Radoslav;  Nelson, Christopher B., 1948-;  Brann, Eva T. H.",,,,SJC-P-2283,,,,,,,,,,,,,,,,,,,Photograph,"7.5 x 10 cm.",,,,,,,,,,,,,,,,,,,,,,,,,"Commencement,Presidents,Tutors",https://s3.us-east-1.amazonaws.com/sjcdigitalarchives/original/70f86518c571375df55cb51854e670ed.jpg,"Still Image","Photographic Archive—Annapolis",1,0
6016,https://digitalarchives.sjc.edu/items/show/6016,"Radoslav Datchev, in Academic Robe, Speaking with Chirstopher B. Nelson and Eva T. H. Brann Seated behind him, during Commencement underneath the Liberty Tree, St. John's College, Annapolis, Maryland","1 photographic print : color",Unknown,,"Annapolis, MD","1992-1997 [circa]","St. John's College owns the rights to this photograph.","Still Image",jpeg,,"Datchev, Radoslav;  Nelson, Christopher B., 1948-;  Brann, Eva T. H.",,,,SJC-P-2282,,,,,,,,,,,,,,,,,,,Photograph,"7.5 x 10 cm.",,,,,,,,,,,,,,,,,,,,,,,,,"Commencement,Presidents,Tutors",https://s3.us-east-1.amazonaws.com/sjcdigitalarchives/original/5b3f2d3434806371560429cd115615a8.jpg,"Still Image","Photographic Archive—Annapolis",1,0
6015,https://digitalarchives.sjc.edu/items/show/6015,"Christopher B. Nelson, in Academic Robe, speaking to Graduates at Commencement, underneath the Liberty Tree, St. John's College, Annapolis, Maryland, [ca. 1992-1997]","1 photographic print : color",Unknown,,"Annapolis, MD","1992-1997 [circa]","St. John's College owns the rights to this photograph.","Still Image",jpeg,,"Nelson, Christopher B., 1948-",,,,SJC-P-2280,,,,,,,,,,,,,,,,,,,Photograph,"7.5 x 10 cm.",,,,,,,,,,,,,,,,,,,,,,,,,"Commencement,Presidents",https://s3.us-east-1.amazonaws.com/sjcdigitalarchives/original/677667cca81bbd8ba63da590799b8235.jpg,"Still Image","Photographic Archive—Annapolis",1,0
5995,https://digitalarchives.sjc.edu/items/show/5995,"Richard D. Weigle with an Artist's Rendering of the St. John's College, Santa Fe, New Mexico, Campus","1 photographic print : b&w",Unknown,,"Annapolis, MD","1960-1965 [circa]","St. John's College owns the rights to this photograph.","Still Image",jpeg,,"Weigle, Richard Daniel 1912-",,,,SJC-P-2259,,,,,,,,,,,,,,,,,,,Photograph," 25.5 x 20.5 cm.",,,,,,,,,,,,,,,,,,,,,,,,,Presidents,https://s3.us-east-1.amazonaws.com/sjcdigitalarchives/original/d0e64e6e21898af9319453c82db078c2.jpg,"Still Image","Photographic Archive—Annapolis",1,0
5977,https://digitalarchives.sjc.edu/items/show/5977,"William Kyle Smith, Stringfellow Barr, Stephen Benedict, Atwood N. Garis, Henry T. Wensel, Jr., Charles A. Nelson, and [William P. Elliott] Meeting in the Coffee Shop by a World Map, St. John's College, Annapolis, Maryland","1 photographic print : b&w",Unknown,,"Annapolis, MD","1945-1946 [circa]","St. John's College owns the rights to this photograph.","Still Image",jpeg,,"St. John's College (Annapolis, Md.). -- Presidents ;  St. John's College (Annapolis, Md.). -- Faculty. ;  St. John's College (Annapolis, Md.). -- Students. ;  Smith, William Kyle ;  Barr, Stringfellow, 1897- ; Benedict, Stephen ;  Garis, Atwood N. ;  Wensel, Henry T., Jr. ;  Nelson, Charles A. ;  Elliott, William P.",,,,SJC-P-2210,,,,,,,,,,,,,,,,,,,Photograph,"25.5 x 20.5 cm.",,,,,,,,,,,,,,,,,,,,,,,,,"Alumni,Presidents,Tutors",https://s3.us-east-1.amazonaws.com/sjcdigitalarchives/original/c7e5d1c90d518151a16595de527ca597.jpg,"Still Image","Photographic Archive—Annapolis",1,0
5960,https://digitalarchives.sjc.edu/items/show/5960,"Collage of Faculty and Members of the Board of Vistors and Governors, St. John's College, Annapolis, Maryland","1 collage of photographic prints : color",Unknown,,"Annapolis, MD","1980 [circa]","St. John's College owns the rights to this photograph.","Still Image",jpeg,,"Delattre, Edwin J.;  Smith, J. Winfree.",,,,SJC-P-2180,,,,,,,,,,,,,,,,,,,Photograph,"20.5 x 25.5 cm.",,,,,,,,,,,,,,,,,,,,,,,,,Presidents,https://s3.us-east-1.amazonaws.com/sjcdigitalarchives/original/a4eb87a8597a3b00bb76304ca20151d8.jpg,"Still Image","Photographic Archive—Annapolis",1,0
5958,https://digitalarchives.sjc.edu/items/show/5958,"Collage of St. John's College Faculty with McDowell Hall, Annapolis, Maryland, and Santa Fe, New Mexico, Campus","1 collage of photographic prints : color",Unknown,,"Annapolis, MD","1980 [circa]","St. John's College owns the rights to this photograph.","Still Image",jpeg,,"Smith, J. Winfree. ;  Delattre, Edwin J. ;  Nelson, Charles A.",,,,SJC-P-2178,,,,,,,,,,,,,,,,,,,Photograph,"20.5 x 25.5 cm.",,,,,,,,,,,,,,,,,,,,,,,,,"Presidents,Tutors",https://s3.us-east-1.amazonaws.com/sjcdigitalarchives/original/76629d13b17eb43565e882d0d071745a.jpg,"Still Image","Photographic Archive—Annapolis",1,0
5906,https://digitalarchives.sjc.edu/items/show/5906,"Richard D. Weigle, Mary Weigle with a Nun, and a Priest","1 photographic print : b&w",Unknown,,"Annapolis, MD",1980,"St. John's College owns the rights to this photograph.","Still Image",jpeg,,"Weigle, Richard Daniel 1912- ;  Weigle, Mary",,,,SJC-P-2117,,,,,,,,,,,,,,,,,,,Photograph,"25.5 x 20.5 cm.",,,,,,,,,,,,,,,,,,,,,,,,,"Honorary Alumni,Presidents",https://s3.us-east-1.amazonaws.com/sjcdigitalarchives/original/981fd65eb3ac77e6f70530edb253187b.jpg,"Still Image","Photographic Archive—Annapolis",1,0
5764,https://digitalarchives.sjc.edu/items/show/5764,"Richard D. Weigle and F. Townsend Morgan Place a Painting of McDowell Hall on a Fireplace Mantle, Annapolis, Maryland","1 photographic print : b&w",Unknown,,"Annapolis, MD",,"St. John's College owns the rights to this photograph.","Still Image",jpeg,,"Weigle, Richard Daniel, 1912-;  Morgan, F. Townsend",,,,SJC-P-1845,,,,,,,,,,,,,,,,,,,Photograph,"25.5 x 20.5 cm.",,,,,,,,,,,,,,,,,,,,,,,,,"Honorary Alumni,Presidents",https://s3.us-east-1.amazonaws.com/sjcdigitalarchives/original/ae168e3cad367f580f604c864e7d2094.jpg,"Still Image","Photographic Archive—Annapolis",1,0
5763,https://digitalarchives.sjc.edu/items/show/5763,"Barbara H. Leonard, Richard D. Weigle and Workers Inspecting the Old Wooden Flagpole near McDowell Hall, Annapolis, Maryland","1 photographic print : b&w",Unknown,,"Annapolis, MD",,"St. John's College owns the rights to this photograph.","Still Image",jpeg,,"Leonard, Barbara Hopkins ;  Weigle, Richard Daniel 1912-",,,,SJC-P-1844,,,,,,,,,,,,,,,,,,,Photograph,"25.5 x 20.5 cm.",,,,,,,,,,,,,,,,,,,,,,,,,"Honorary Alumni,Presidents",https://s3.us-east-1.amazonaws.com/sjcdigitalarchives/original/fdbb21ffb0189f3175eec3a62c1a4d73.jpg,"Still Image","Photographic Archive—Annapolis",1,0
5757,https://digitalarchives.sjc.edu/items/show/5757,"Kathryn Kinzer, Doris Sung, Travis Price, Christopher B. Nelson, Kathy Cherry, Maureen Breckenholz and Tom McCracken with Shovels at the Groundbreaking Ceremony for the Greenfield Library, Annapolis, Maryland","1 photographic print : b&w",Unknown,,"Annapolis, MD",1996,"St. John's College owns the rights to this photograph.","Still Image",jpeg,,"Kinzer, Kathryn;  Sung, Doris;  Price, Travis;  Nelson, Christopher B., 1948-;  Cherry, Kathy;  Breckenholz, Maureen;  McCracken, Tom",,,,SJC-P-1834,,,,,,,,,,,,,,,,,,,Photograph,"20.5 x 25.5 cm.",,,,,,,,,,,,,,,,,,,,,,,,,"Librarians,Presidents",https://s3.us-east-1.amazonaws.com/sjcdigitalarchives/original/b8df800a007817d44c33070479c49946.jpg,"Still Image","Photographic Archive—Annapolis",1,0
5756,https://digitalarchives.sjc.edu/items/show/5756,"Vicki Cone, Christopher B. Nelson, Charlotte Goldsborough Fletcher and Kathryn Kinzer with Shovels during the Groundbreaking Ceremony for the Greenfield Library, Annapolis, Maryland","1 photographic print : b&w",Unknown,,"Annapolis, MD",1996,"St. John's College owns the rights to this photograph.","Still Image",jpeg,,"Cone, Vicki;  Nelson, Christopher B., 1948-;  Fletcher, Charlotte Goldsborough;  Kinzer, Kathryn",,,,SJC-P-1833,,,,,,,,,,,,,,,,,,,Photograph,"20.5 x 25.5 cm.",,,,,,,,,,,,,,,,,,,,,,,,,"Librarians,Presidents",https://s3.us-east-1.amazonaws.com/sjcdigitalarchives/original/ff1f927829c15a62658e8f3937b8beeb.jpg,"Still Image","Photographic Archive—Annapolis",1,0
5755,https://digitalarchives.sjc.edu/items/show/5755,"Stringfellow Barr Seated at his Home in Hilltop, New Jersey","1 photocopy sheet : 12 proof prints from 50mm film : b&w",Unknown,,"Annapolis, MD",1969,"St. John's College owns the rights to this photograph.","Still Image",jpeg,,"Barr, Stringfellow, 1897-",,,,SJC-P-1832,,,,,,,,,,,,,,,,,,,Photograph,"21.5 x 27 cm.",,,,,,,,,,,,,,,,,,,,,,,,,"Honorary Alumni,Presidents",https://s3.us-east-1.amazonaws.com/sjcdigitalarchives/original/9c0448a6fc427fc3b68f549aff04e3b7.jpg,"Still Image","Photographic Archive—Annapolis",1,0
5754,https://digitalarchives.sjc.edu/items/show/5754,"Portraits of Stringfellow Barr","1 photocopy print : b&w",Unknown,,"Annapolis, MD",,"St. John's College owns the rights to this photograph.","Still Image",jpeg,,"Barr, Stringfellow, 1897-",,,,SJC-P-1831,,,,,,,,,,,,,,,,,,,Photograph,"21.5 x 27 cm.",,,,,,,,,,,,,,,,,,,,,,,,,"Honorary Alumni,Presidents",https://s3.us-east-1.amazonaws.com/sjcdigitalarchives/original/bf943229da8d75b99f3d6f1f334d7976.jpg,"Still Image","Photographic Archive—Annapolis",1,0
5753,https://digitalarchives.sjc.edu/items/show/5753,"Portrait of Stringfellow Barr","1 photocopy print : b&w",Unknown,,"Annapolis, MD","1920 [circa]","St. John's College owns the rights to this photograph.","Still Image",jpeg,,"Barr, Stringfellow, 1897-",,,,SJC-P-1830,,,,,,,,,,,,,,,,,,,Photograph,"21.5 x 27 cm.",,,,,,,,,,,,,,,,,,,,,,,,,"Honorary Alumni,Presidents",https://s3.us-east-1.amazonaws.com/sjcdigitalarchives/original/8343075d4d2a1b43f65c220cd5f77944.jpg,"Still Image","Photographic Archive—Annapolis",1,0
5752,https://digitalarchives.sjc.edu/items/show/5752,"Portraits of Stringfellow Barr","1 photocopy  print : b&w",Unknown,,"Annapolis, MD","1960 [circa]","St. John's College owns the rights to this photograph.","Still Image",jpeg,,"Barr, Stringfellow, 1897-",,,,SJC-P-1829,,,,,,,,,,,,,,,,,,,Photograph,"27 x 21.5 cm.",,,,,,,,,,,,,,,,,,,,,,,,,"Honorary Alumni,Presidents",https://s3.us-east-1.amazonaws.com/sjcdigitalarchives/original/04ff1ac78e6c630cb267cd31395d18f1.jpg,"Still Image","Photographic Archive—Annapolis",1,0
5751,https://digitalarchives.sjc.edu/items/show/5751,"Stringfellow Barr Seated as a Lecturer at the University of Virginia, Charlottesville, Virginia","1 photocopy print : b&w",Unknown,,"Annapolis, MD","1920 [circa]","St. John's College owns the rights to this photograph.","Still Image",jpeg,,"Barr, Stringfellow, 1897-",,,,SJC-P-1828,,,,,,,,,,,,,,,,,,,Photograph,"13.5 x 21.5 cm.",,,,,,,,,,,,,,,,,,,,,,,,,"Honorary Alumni,Presidents",https://s3.us-east-1.amazonaws.com/sjcdigitalarchives/original/587ebafaf9654c4f167d181ac061f828.jpg,"Still Image","Photographic Archive—Annapolis",1,0
5750,https://digitalarchives.sjc.edu/items/show/5750,"Stringfellow Barr Cutting Cake on his 80th Birthday at Woodrow Wilson's Former Home in Princeton, New Jersey","1 photographic print : b&w",Unknown,,"Annapolis, MD","1977 [circa]","St. John's College owns the rights to this photograph.","Still Image",jpeg,,"Barr, Stringfellow, 1897-",,,,SJC-P-1827,,,,,,,,,,,,,,,,,,,Photograph,"17.5 x 13 cm.",,,,,,,,,,,,,,,,,,,,,,,,,"Honorary Alumni,Presidents",https://s3.us-east-1.amazonaws.com/sjcdigitalarchives/original/119b200d122a106df62ed3a7cfe09f91.jpg,"Still Image","Photographic Archive—Annapolis",1,0
5749,https://digitalarchives.sjc.edu/items/show/5749,"Stringfellow Barr and Francis Mason at Woodrow Wilson's Former Home in Princeton, New Jersey","1 photographic print : b&w",Unknown,,"Annapolis, MD",,"St. John's College owns the rights to this photograph.","Still Image",jpeg,,"Barr, Stringfellow, 1897-;  Mason, Francis",,,,SJC-P-1826,,,,,,,,,,,,,,,,,,,Photograph,"17.5 x 13 cm.",,,,,,,,,,,,,,,,,,,,,,,,,"Honorary Alumni,Presidents",https://s3.us-east-1.amazonaws.com/sjcdigitalarchives/original/32618b6f288b68b7e606cd74d2d084bb.jpg,"Still Image","Photographic Archive—Annapolis",1,0
