﻿"Item Id","Item URI","Dublin Core:Title","Dublin Core:Description","Dublin Core:Creator","Dublin Core:Publisher","Dublin Core:Coverage","Dublin Core:Date","Dublin Core:Rights","Dublin Core:Type","Dublin Core:Format","Dublin Core:Source","Dublin Core:Subject","Dublin Core:Contributor","Dublin Core:Relation","Dublin Core:Language","Dublin Core:Identifier","Item Type Metadata:Occupation","Item Type Metadata:Participants","Item Type Metadata:Death Date","Item Type Metadata:Birthplace","Item Type Metadata:Birth Date","Item Type Metadata:Interviewer","Item Type Metadata:Biographical Text","Item Type Metadata:Bibliography","Item Type Metadata:Page numeration","Item Type Metadata:Resolution","Item Type Metadata:Identifier","Item Type Metadata:Inventory","Item Type Metadata:URL","Item Type Metadata:Text","Item Type Metadata:Interviewee","Item Type Metadata:Location","Item Type Metadata:Transcription","Item Type Metadata:Local URL","Item Type Metadata:Original Format","Item Type Metadata:Physical Dimensions","Item Type Metadata:Duration","Item Type Metadata:Compression","Item Type Metadata:Producer","Item Type Metadata:Director","Item Type Metadata:Bit Rate/Frequency","Item Type Metadata:Email Body","Item Type Metadata:Event Type","Item Type Metadata:Lesson Plan Text","Item Type Metadata:Materials","Item Type Metadata:Objectives","Item Type Metadata:Standards","Item Type Metadata:Number of Attachments","Item Type Metadata:BCC","Item Type Metadata:CC","Item Type Metadata:To","Item Type Metadata:From","Item Type Metadata:Subject Line","Item Type Metadata:Time Summary","Item Type Metadata:Episode","Item Type Metadata:Season","Item Type Metadata:Episode Type","Item Type Metadata:Explicit","Item Type Metadata:Block","PDF Text:Text",tags,file,itemType,collection,public,featured
6009,https://digitalarchives.sjc.edu/items/show/6009,"Film Crew Filming McDowell Hall, St. John's College, Annapolis, Maryland","1 photographic print : color",Unknown,,"Annapolis, MD","1990 [circa]","St. John's College owns the rights to this photograph.","Still Image",jpeg,,,,,,SJC-P-2273,,,,,,,,,,,,,,,,,,,Photograph,"7.5 x 10 cm.",,,,,,,,,,,,,,,,,,,,,,,,,"McDowell Hall",https://s3.us-east-1.amazonaws.com/sjcdigitalarchives/original/da3f9899668cf8eec833d2cccc6694e1.jpg,"Still Image","Photographic Archive—Annapolis",1,0
6002,https://digitalarchives.sjc.edu/items/show/6002,"Students Dancing at the May Cotillion in the Great Hall, St. John's College, Annapolis, Maryland, May 1977","1 photographic print : b&w",Unknown,,"Annapolis, MD",1977-05,"St. John's College owns the rights to this photograph.","Still Image",jpeg,,,,,,SJC-P-2264,,,,,,,,,,,,,,,,,,,Photograph,"17.5 x 13 cm.",,,,,,,,,,,,,,,,,,,,,,,,,"Great Hall,McDowell Hall",https://s3.us-east-1.amazonaws.com/sjcdigitalarchives/original/0d36ed0656030ad099e1122f52f4a3b0.jpg,"Still Image","Photographic Archive—Annapolis",1,0
5972,https://digitalarchives.sjc.edu/items/show/5972,"McDowell Hall during the Fire of 1909, St. John's College, Annapolis, Maryland","1 photographic print : b&w",Unknown,,"Annapolis, MD","1909 [circa]","St. John's College owns the rights to this photograph.","Still Image",jpeg,,"McDowell Hall (St. John's College, Annapolis, MD)",,,,SJC-P-2203,,,,,,,,,,,,,,,,,,,Photograph,"25.5 x 20.5 cm.",,,,,,,,,,,,,,,,,,,,,,,,,"McDowell Hall",https://s3.us-east-1.amazonaws.com/sjcdigitalarchives/original/62adf6c96852d27ea5022dcd825416c6.jpg,"Still Image","Photographic Archive—Annapolis",1,0
5965,https://digitalarchives.sjc.edu/items/show/5965,"Detail of a Drawing of McDowell Hall with Cupola, Annapolis, Maryland","1 photographic copy of a drawing : b&w",Unknown,,"Annapolis, MD",,"St. John's College owns the rights to this photograph.","Still Image",jpeg,,,,,,SJC-P-2192,,,,,,,,,,,,,,,,,,,Photograph,"20.5 x 25.5 cm.",,,,,,,,,,,,,,,,,,,,,,,,,"McDowell Hall",https://s3.us-east-1.amazonaws.com/sjcdigitalarchives/original/a2542637f602908fb24496cafa8fee54.jpg,"Still Image","Photographic Archive—Annapolis",1,0
5953,https://digitalarchives.sjc.edu/items/show/5953,"McDowell Hall after Fire, St. John's College Annapolis, Maryland, [ca. 1909]","1 photographic print : b&w",Unknown,,"Annapolis, MD","1909 [circa]","St. John's College owns the rights to this photograph.","Still Image",jpeg,,"McDowell Hall (St. John's College, Annapolis, MD)",,,,SJC-P-2169,,,,,,,,,,,,,,,,,,,Photograph,"25.5 x 20.5 cm.",,,,,,,,,,,,,,,,,,,,,,,,,"McDowell Hall",https://s3.us-east-1.amazonaws.com/sjcdigitalarchives/original/c1bed8f3fe5993e34d0c744414ebca6d.jpg,"Still Image","Photographic Archive—Annapolis",1,0
5952,https://digitalarchives.sjc.edu/items/show/5952,"Aerial View of McDowell Hall and the St. John's College Campus, Annapolis, Maryland","1 photographic print : b&w",Unknown,,"Annapolis, MD","1870 [circa]","St. John's College owns the rights to this photograph.","Still Image",jpeg,,"McDowell Hall (St. John's College, Annapolis, MD)",,,,SJC-P-2168,,,,,,,,,,,,,,,,,,,Photograph,"25.5 x 20.5 cm.",,,,,,,,,,,,,,,,,,,,,,,,,"McDowell Hall",https://s3.us-east-1.amazonaws.com/sjcdigitalarchives/original/1625998664f75b7372f69ab60c06a363.jpg,"Still Image","Photographic Archive—Annapolis",1,0
5950,https://digitalarchives.sjc.edu/items/show/5950,"McDowell Hall after Fire of 1909, St. John's College, Annapolis, Maryland","1 photographic print : b&w",Unknown,,"Annapolis, MD","1909 [circa]","St. John's College owns the rights to this photograph.","Still Image",jpeg,,"McDowell Hall (St. John's College, Annapolis, MD)",,,,SJC-P-2162,,,,,,,,,,,,,,,,,,,Photograph,"25.5 x 20.5 cm.",,,,,,,,,,,,,,,,,,,,,,,,,"McDowell Hall",https://s3.us-east-1.amazonaws.com/sjcdigitalarchives/original/eadb923ba43c554b2701397183ada84a.jpg,"Still Image","Photographic Archive—Annapolis",1,0
5949,https://digitalarchives.sjc.edu/items/show/5949,"McDowell Hall with Cupola, St. John's College, Annapolis, Maryland","1 photographic print : b&w",Unknown,,"Annapolis, MD",,"St. John's College owns the rights to this photograph.","Still Image",jpeg,,"McDowell Hall (St. John's College, Annapolis, MD)",,,,SJC-P-2161,,,,,,,,,,,,,,,,,,,Photograph,"25.5 x 20.5 cm.",,,,,,,,,,,,,,,,,,,,,,,,,"McDowell Hall",https://s3.us-east-1.amazonaws.com/sjcdigitalarchives/original/7733d7ab4f11d9a62b9d3d24093c72b4.jpg,"Still Image","Photographic Archive—Annapolis",1,0
5828,https://digitalarchives.sjc.edu/items/show/5828,"Group Portrait of the St. John's College Class of 1943 on the Porch of McDowell Hall, Annapolis, Maryland","1 photographic print : b&w",Unknown,,"Annapolis, MD","1943 [circa]","St. John's College owns the rights to this photograph.","Still Image",jpeg,,"Group Portraits",,,,SJC-P-1910,,,,,,,,,,,,,,,,,,,Photograph,"25.5 x 20.5 cm.",,,,,,,,,,,,,,,,,,,,,,,,,"Alumni,McDowell Hall",https://s3.us-east-1.amazonaws.com/sjcdigitalarchives/original/09c2d71efa460d4abca2da7227374f0a.jpg,"Still Image","Photographic Archive—Annapolis",1,0
5826,https://digitalarchives.sjc.edu/items/show/5826,"Group Portrait of the St. John's College Class of 1942 on the Porch of McDowell Hall, Annapolis, Maryland","1 photographic print : b&w",Unknown,,"Annapolis, MD","1942 [circa]","St. John's College owns the rights to this photograph.","Still Image",jpeg,,"Group Portraits",,,,SJC-P-1908,,,,,,,,,,,,,,,,,,,Photograph,"25.5 x 20.5 cm.",,,,,,,,,,,,,,,,,,,,,,,,,"Alumni,McDowell Hall",https://s3.us-east-1.amazonaws.com/sjcdigitalarchives/original/44830583193de42318aadeb6b644bb21.jpg,"Still Image","Photographic Archive—Annapolis",1,0
5824,https://digitalarchives.sjc.edu/items/show/5824,"Group Portrait of the St. John's College Class of 1941 on the Porch of McDowell Hall, Annapolis, Maryland","1 photographic print : b&w",Unknown,,"Annapolis, MD",1941,"St. John's College owns the rights to this photograph.","Still Image",jpeg,,"Group Portraits",,,,SJC-P-1906,,,,,,,,,,,,,,,,,,,Photograph,"25.5 x 20.5 cm.",,,,,,,,,,,,,,,,,,,,,,,,,"Alumni,McDowell Hall",https://s3.us-east-1.amazonaws.com/sjcdigitalarchives/original/31d81bfae9c0c9bca3d597bc9cccaa8e.jpg,"Still Image","Photographic Archive—Annapolis",1,0
5823,https://digitalarchives.sjc.edu/items/show/5823,"Group Portrait of the St. John's College Class of 1950 on the Porch of McDowell Hall, Annapolis, Maryland","1 photographic print : b&w",Unknown,,"Annapolis, MD",1948,"St. John's College owns the rights to this photograph.","Still Image",jpeg,,"Group Portraits",,,,SJC-P-1905,,,,,,,,,,,,,,,,,,,Photograph,"25.5 x 20.5 cm.",,,,,,,,,,,,,,,,,,,,,,,,,"Alumni,McDowell Hall",https://s3.us-east-1.amazonaws.com/sjcdigitalarchives/original/94644a99a8029a82f4365fc6ae4d4527.jpg,"Still Image","Photographic Archive—Annapolis",1,0
5759,https://digitalarchives.sjc.edu/items/show/5759,"A Print of a Sketch of McDowell Hall by F. Townsend Morgan","1 print : b&w",Unknown,,"Annapolis, MD",,"St. John's College owns the rights to this photograph.","Still Image",jpeg,,,,,,SJC-P-1836,,,,,,,,,,,,,,,,,,,Print,"16.5 x 27 cm.",,,,,,,,,,,,,,,,,,,,,,,,,"McDowell Hall",https://s3.us-east-1.amazonaws.com/sjcdigitalarchives/original/fbdf907a16a8d7a502bf8a3253b8fe37.jpg,"Still Image","Photographic Archive—Annapolis",1,0
5758,https://digitalarchives.sjc.edu/items/show/5758,"A Pen and Ink Drawing of McDowell Hall with Cupola","1 pen-and-ink drawing : b&w",Unknown,,"Annapolis, MD",,"St. John's College owns the rights to this photograph.","Still Image",jpeg,,,,,,SJC-P-1835,,,,,,,,,,,,,,,,,,,Drawing,"16.5 x 15 cm.",,,,,,,,,,,,,,,,,,,,,,,,,"McDowell Hall",https://s3.us-east-1.amazonaws.com/sjcdigitalarchives/original/c94ecdf88915b203d06e2c367005f941.jpg,"Still Image","Photographic Archive—Annapolis",1,0
5730,https://digitalarchives.sjc.edu/items/show/5730,"John D. Alexander, Sr., C. Edwin Cockey and Wife Talking outside of McDowell Hall, Annapolis, Maryland","1 photographic print : b&w","Heitner, Sheldon C.",,"Annapolis, MD","1965-1975 [circa]","St. John's College owns the rights to this photograph.","Still Image",jpeg,,"Alexander, John D. Sr.;  Cockey, C. Edwin",,,,SJC-P-1807,,,,,,,,,,,,,,,,,,,Photograph,"25.5 x 20.5 cm.",,,,,,,,,,,,,,,,,,,,,,,,,"Alumni,McDowell Hall",https://s3.us-east-1.amazonaws.com/sjcdigitalarchives/original/ddc0005e66e1382d0fa4002aaa1053d5.jpg,"Still Image","Photographic Archive—Annapolis",1,0
5728,https://digitalarchives.sjc.edu/items/show/5728,"J. Wesley Everett, William W. Holmes and Colleague Seated on the Steps of McDowell Hall, Annapolis, Maryland","1 photographic print : b&w",Unknown,,"Annapolis, MD",,"St. John's College owns the rights to this photograph.","Still Image",jpeg,,"Everett, J. Wesley;  Holmes, William W.",,,,SJC-P-1805,,,,,,,,,,,,,,,,,,,Photograph,"17.5 x 13 cm.",,,,,,,,,,,,,,,,,,,,,,,,,"Alumni,McDowell Hall",https://s3.us-east-1.amazonaws.com/sjcdigitalarchives/original/90cc506a99948f10dbc2d707a86bfc99.jpg,"Still Image","Photographic Archive—Annapolis",1,0
5638,https://digitalarchives.sjc.edu/items/show/5638,"View from the Back Door of McDowell Hall with Faculty in Academic Robes before the Inauguration Ceremony for Edwin J. Delattre, Annapolis, Maryland, Fall 1980","1 photographic print : b&w",Unknown,,"Annapolis, MD",1980-09,"St. John's College owns the rights to this photograph.","Still Image",jpeg,,,,,,SJC-P-1695,,,,,,,,,,,,,,,,,,,Photograph,"20.5 x 25.5 cm.",,,,,,,,,,,,,,,,,,,,,,,,,"McDowell Hall",https://s3.us-east-1.amazonaws.com/sjcdigitalarchives/original/a752941a9f8f1d16de8c3a46692e115d.jpg,"Still Image","Photographic Archive—Annapolis",1,0
5564,https://digitalarchives.sjc.edu/items/show/5564,"Archway under the Front Stairs of McDowell Hall, with Figure Silhouetted","1 photographic print : b&w",Unknown,,"Annapolis, MD",,"St. John's College owns the rights to this photograph.","Still Image",jpeg,,"McDowell Hall (St. John's College, Annapolis, MD)",,,,SJC-P-1599,,,,,,,,,,,,,,,,,,,Photograph,"17.5 x 13 cm.",,,,,,,,,,,,,,,,,,,,,,,,,"McDowell Hall",https://s3.us-east-1.amazonaws.com/sjcdigitalarchives/original/04f62d5762bfd6f7afb6f0a5c001b215.jpg,"Still Image","Photographic Archive—Annapolis",1,0
5263,https://digitalarchives.sjc.edu/items/show/5263,"The Cupola of  McDowell Hall in Snow, Annapolis, Maryland","1 photographic print : b&w",Unknown,,"Annapolis, MD","1980 [circa]","St. John's College owns the rights to this photograph.","Still Image",jpeg,,"Norton, Peter A.;  Fried, Michael N.",,,,SJC-P-1274,,,,,,,,,,,,,,,,,,,Photograph,"20.5 x 25.5 cm.",,,,,,,,,,,,,,,,,,,,,,,,,"McDowell Hall",https://s3.us-east-1.amazonaws.com/sjcdigitalarchives/original/da8a5a5c1490f38bc94089be921fe301.jpg,"Still Image","Photographic Archive—Annapolis",1,0
5229,https://digitalarchives.sjc.edu/items/show/5229,"Richard D. Weigle and Construction Crew with Utility Pole near McDowell Hall during the Burying of the Power Lines, Annapolis, Maryland","1 photographic print : b&w",Unknown,,"Annapolis, MD",1967,"St. John's College owns the rights to this photograph.","Still Image",jpeg,,"Weigle, Richard Daniel 1912-",,,,SJC-P-1216,,,,,,,,,,,,,,,,,,,Photograph,"12.5 x 9 cm.",,,,,,,,,,,,,,,,,,,,,,,,,"Honorary Alumni,McDowell Hall,Presidents",https://s3.us-east-1.amazonaws.com/sjcdigitalarchives/original/8101a06fba183d3b5f3622a6bdd8796e.jpg,"Still Image","Photographic Archive—Annapolis",1,0
<br />
<b>Deprecated</b>:  Directive 'allow_url_include' is deprecated in <b>Unknown</b> on line <b>0</b><br />
