﻿"Item Id","Item URI","Dublin Core:Title","Dublin Core:Description","Dublin Core:Creator","Dublin Core:Publisher","Dublin Core:Coverage","Dublin Core:Date","Dublin Core:Rights","Dublin Core:Type","Dublin Core:Format","Dublin Core:Source","Dublin Core:Subject","Dublin Core:Contributor","Dublin Core:Relation","Dublin Core:Language","Dublin Core:Identifier","Item Type Metadata:Occupation","Item Type Metadata:Participants","Item Type Metadata:Death Date","Item Type Metadata:Birthplace","Item Type Metadata:Birth Date","Item Type Metadata:Interviewer","Item Type Metadata:Biographical Text","Item Type Metadata:Bibliography","Item Type Metadata:Page numeration","Item Type Metadata:Resolution","Item Type Metadata:Identifier","Item Type Metadata:Inventory","Item Type Metadata:URL","Item Type Metadata:Text","Item Type Metadata:Interviewee","Item Type Metadata:Location","Item Type Metadata:Transcription","Item Type Metadata:Local URL","Item Type Metadata:Original Format","Item Type Metadata:Physical Dimensions","Item Type Metadata:Duration","Item Type Metadata:Compression","Item Type Metadata:Producer","Item Type Metadata:Director","Item Type Metadata:Bit Rate/Frequency","Item Type Metadata:Email Body","Item Type Metadata:Event Type","Item Type Metadata:Lesson Plan Text","Item Type Metadata:Materials","Item Type Metadata:Objectives","Item Type Metadata:Standards","Item Type Metadata:Number of Attachments","Item Type Metadata:BCC","Item Type Metadata:CC","Item Type Metadata:To","Item Type Metadata:From","Item Type Metadata:Subject Line","Item Type Metadata:Time Summary","Item Type Metadata:Episode","Item Type Metadata:Season","Item Type Metadata:Episode Type","Item Type Metadata:Explicit","Item Type Metadata:Block","PDF Text:Text",tags,file,itemType,collection,public,featured
525,https://digitalarchives.sjc.edu/items/show/525,"Convocation Address, Graduate Institute, Spring 2010","Typescript of the convocation address for the Graduate Institute given by Marilyn Higuera for the Spring 2010 semester in Annapolis, MD.","Higuera, Marilyn","St. John's College","Annapolis, MD",2010-01,"St. John's College has been given permission to make this item available online.",text,pdf,,,,,English,Annapolis_GI_Spring_2010_Convocation,,,,,,,,,"9 pages",,,,,,,,,,digital,,,,,,,,,,,,,,,,,,,,,,,,,,"Convocation,Deans,Graduate Institute,Tutors",https://s3.us-east-1.amazonaws.com/sjcdigitalarchives/original/54b633363ca946100c1a8f25d51c3f61.pdf,Text,"Convocation Addresses",1,0
526,https://digitalarchives.sjc.edu/items/show/526,"Convocation Address, Graduate Institute, Spring 2011","Typescript of the convocation address for the Graduate Institute given by Marilyn Higuera for the Spring 2011 semester in Annapolis, MD.","Higuera, Marilyn","St. John's College","Annapolis, MD",2011-01,"St. John's College has been given permission to make this item available online.",text,pdf,,,,,English,Annapolis_GI_Spring_2011_Convocation,,,,,,,,,"9 pages",,,,,,,,,,digital,,,,,,,,,,,,,,,,,,,,,,,,,,"Convocation,Deans,Graduate Institute,Tutors",https://s3.us-east-1.amazonaws.com/sjcdigitalarchives/original/9bdece0aef4ce06574d807a30190fb02.pdf,Text,"Convocation Addresses",1,0
527,https://digitalarchives.sjc.edu/items/show/527,"Convocation Address, Graduate Institute, Spring 2012","Typescript of the convocation address for the Graduate Institute given by Jeff Black for the Spring 2012 semester in Annapolis, MD.  Entitled ""What Is a Segment?""","Black, Jeff J. S., 1970-","St. John's College","Annapolis, MD",2012-01-09,"St. John's College has been given permission to make this item available online.",text,pdf,,,,,English,Annapolis_GI_Spring_2012_Convocation,,,,,,,,,"8 pages",,,,,,,,,,digital,,,,,,,,,,,,,,,,,,,,,,,,,,"Convocation,Deans,Graduate Institute,Tutors",https://s3.us-east-1.amazonaws.com/sjcdigitalarchives/original/3f3d9ae3e993fc35d4b34a6b6d22e128.pdf,Text,"Convocation Addresses",1,0
528,https://digitalarchives.sjc.edu/items/show/528,"Convocation Address, Graduate Institute, Spring 2013","Typescript of the convocation address for the Graduate Institute given by Jeff Black for the Spring 2013 semester in Annapolis, MD.  Entitled ""On Liberal Education as a Commodity"" in Annapolis, MD.","Black, Jeff J. S., 1970-","St. John's College","Annapolis, MD",2013-01-07,"St. John's College has been given permission to make this item available online.",text,pdf,,,,,English,Annapolis_GI_Spring_2013_Convocation,,,,,,,,,"8 pages",,,,,,,,,,digital,,,,,,,,,,,,,,,,,,,,,,,,,,"Convocation,Deans,Graduate Institute,Tutors",https://s3.us-east-1.amazonaws.com/sjcdigitalarchives/original/21728bc8e5804ac1e4ba9f33090e4138.pdf,Text,"Convocation Addresses",1,0
529,https://digitalarchives.sjc.edu/items/show/529,"Convocation Address, Graduate Institute, Spring 2014","Typescript of the convocation address for the Graduate Institute given by Jeff Black for the Spring 2014 semester in Annapolis, MD.  Entitled ""On the History Segment"" in Annapolis, MD.","Black, Jeff J. S., 1970-","St. John's College","Annapolis, MD",2014-01-06,"St. John's College has been given permission to make this item available online.",text,pdf,,,,,English,Annapolis_GI_Spring_2014_Convocation,,,,,,,,,"8 pages",,,,,,,,,,digital,,,,,,,,,,,,,,,,,,,,,,,,,,"Convocation,Deans,Graduate Institute,Tutors",https://s3.us-east-1.amazonaws.com/sjcdigitalarchives/original/d7a436da44840d74aefb8bce0a66dae6.pdf,Text,"Convocation Addresses",1,0
530,https://digitalarchives.sjc.edu/items/show/530,"Convocation Address, Graduate Institute, Spring 2015","Typescript of the convocation address for the Graduate Institute given by Jeff Black for the Spring 2015 semester in Annapolis, MD.  Entitled ""What Is a Tutor? Or, On the Future of Our Educational Institution"" in Annapolis, MD.","Black, Jeff J. S., 1970-","St. John's College","Annapolis, MD",2015-01-05,"St. John's College has been given permission to make this item available online.",text,pdf,,,,,English,Annapolis_GI_Spring_2015_Convocation,,,,,,,,,"8 pages",,,,,,,,,,digital,,,,,,,,,,,,,,,,,,,,,,,,,,"Convocation,Deans,Graduate Institute,Tutors",https://s3.us-east-1.amazonaws.com/sjcdigitalarchives/original/3ca114bffc2ee795a3834076ee9bc9c9.pdf,Text,"Convocation Addresses",1,0
531,https://digitalarchives.sjc.edu/items/show/531,"Convocation Address, Graduate Institute, Spring 2016","Typescript of the convocation address for the Graduate Institute given by Emily Brooker Langston for the Spring 2016 semester in Annapolis, MD.","Langston, Emily Brooker","St. John's College","Annapolis, MD",2016-01,"St. John's College has been given permission to make this item available online.",text,pdf,,,,,English,Annapolis_GI_Spring_2016_Convocation,,,,,,,,,"9 pages",,,,,,,,,,digital,,,,,,,,,,,,,,,,,,,,,,,,,,"Convocation,Deans,Graduate Institute,Tutors",https://s3.us-east-1.amazonaws.com/sjcdigitalarchives/original/fe4ecd6ba0599f9e27cfab6711a225a9.pdf,Text,"Convocation Addresses",1,0
536,https://digitalarchives.sjc.edu/items/show/536,"Santa Fe Commencement Address, Spring 2016","Typescript of the commencement address given on May 21, 2016 by Eva Brann at the end of the Spring 2016 semester in Santa Fe, NM.","Brann, Eva T. H.","St. John's College","Santa Fe, NM",2016-05-21,"St. John's College has been given permission to make this item available online.",text,pdf,,,,"<a title=""Audio recording"" href=""http://digitalarchives.sjc.edu/items/show/498"">Audio recording</a>",English,Santa_Fe_Commencement_2016_Eva_Brann_Speech,,,,,,,,,"6 pages",,,,,,,,,,digital,,,,,,,,,,,,,,,,,,,,,,,,,,"Commencement,Deans,Tutors",https://s3.us-east-1.amazonaws.com/sjcdigitalarchives/original/2fb47b31fc950ed0c6333a505daa7576.pdf,Text,"Santa Fe Commencement Programs and Addresses",1,0
936,https://digitalarchives.sjc.edu/items/show/936,"Jacob Klein Leading a Tutorial, St. John's College, Annapolis, Maryland, circa 1960-1970","Jacob Klein leading a tutorial, St. John's College, Annapolis, Maryland. Mr. Klein was a tutor at St. John's from 1938 until his death in 1978. ","St. John's College (Annapolis, Md.)",,"Annapolis, MD","circa 1960-1970 ","St. John's College owns the rights to this photograph.","still image",jpeg,,"Klein, Jacob, 1899-1978.",,,,SJC-P-0055,,,,,,,,,,"600 ppi",,,,,,,,,photograph,"9.5 x 13.5 cm.",,,,,,,,,,,,,,,,,,,,,,,,,"Deans,Tutors",https://s3.us-east-1.amazonaws.com/sjcdigitalarchives/original/446d67d18be48b1673f45cbd9f682d8c.jpg,"Still Image","Photographic Archive—Annapolis",1,1
937,https://digitalarchives.sjc.edu/items/show/937,"Jacob Klein Talks about the St. John's College Program during Educators' Visiting Day, St. John's College, Annapolis, Maryland","1 photographic print : b&w",Unknown,,"Annapolis, MD","1945-1955 [circa]","St. John's College owns the rights to this photograph.","still image",jpeg,,"Klein, Jacob, 1899-1978.",,,,SJC-P-0056,,,,,,,,,,"600 dpi",,,,,,,,,photograph,"12.5 x 18 cm.",,,,,,,,,,,,,,,,,,,,,,,,,"Deans,Tutors",https://s3.us-east-1.amazonaws.com/sjcdigitalarchives/original/435dfaa33760ffe341327d1b5833e30e.jpg,"Still Image","Photographic Archive—Annapolis",1,1
938,https://digitalarchives.sjc.edu/items/show/938,"Richard D. Weigle and Jacob Klein, in Academic Robes, Walking to Convocation, St. John's College, Annapolis, Maryland","1 photographic print : b&w",Unknown,,"Annapolis, MD",1949,"St. John's College owns the rights to this photograph.","still image",jpeg,,"Weigle, Richard Daniel, 1912- ;  Klein, Jacob, 1899-1978.",,,,SJC-P-0057,,,,,,,,,,"600 dpi",,,,,,,,,photograph,"12.5 x 18 cm.",,,,,,,,,,,,,,,,,,,,,,,,,"Deans,Presidents,Tutors",https://s3.us-east-1.amazonaws.com/sjcdigitalarchives/original/1ef7698d1d562ca2d2fe9bc1a75c8d47.jpg,"Still Image","Photographic Archive—Annapolis",1,1
939,https://digitalarchives.sjc.edu/items/show/939,"Jacob Klein and Robert A. Goldwin Seated at Table","1 photographic print : b&w",Unknown,,"Annapolis, MD","1960-1970 [circa]","St. John's College owns the rights to this photograph.","still image",jpeg,,"Klein, Jacob, 1899-1978. ;  Goldwin, Robert A., 1922-",,,,SJC-P-0058,,,,,,,,,,"600 dpi",,,,,,,,,photograph,"9.5 x 13.5 cm.",,,,,,,,,,,,,,,,,,,,,,,,,"Deans,Tutors",https://s3.us-east-1.amazonaws.com/sjcdigitalarchives/original/2907e6cee36242a9fc677c6e30df1cfa.jpg,"Still Image","Photographic Archive—Annapolis",1,1
940,https://digitalarchives.sjc.edu/items/show/940,"Jacob Klein and Stringfellow Barr Seated at Table, St. John's College, Annapolis, Maryland","1 photocopy of a page from the St. John's College Yearbook : b&w",Unknown,,"Annapolis, MD","1947 [circa]","St. John's College owns the rights to this photograph.","still image",jpeg,,"Barr, Stringfellow, 1897-1982 ;  Klein, Jacob, 1899-1978.",,,,SJC-P-0059,,,,,,,,,,"600 dpi",,,,,,,,,paper,"11.5 x 9 cm.",,,,,,,,,,,,,,,,,,,,,,,,,"Deans,Presidents,Tutors",https://s3.us-east-1.amazonaws.com/sjcdigitalarchives/original/21e19dc989aa37989dc96a69e65c2273.jpg,"Still Image","Photographic Archive—Annapolis",1,1
941,https://digitalarchives.sjc.edu/items/show/941,"Jacob Klein Snowman by McDowell Hall, St. John's College, Annapolis, Maryland","1 photographic print : b&w",Unknown,,"Annapolis, MD","1949-1958 [circa]","St. John's College owns the rights to this photograph.","still image",jpeg,,"Klein, Jacob, 1899-1978.",,,,SJC-P-0060,,,,,,,,,,"600 dpi",,,,,,,,,photograph,"8.5 x 11 cm.",,,,,,,,,,,,,,,,,,,,,,,,,"Deans,Tutors",https://s3.us-east-1.amazonaws.com/sjcdigitalarchives/original/1af7cb62e62e02134c145eacb5439fac.jpg,"Still Image","Photographic Archive—Annapolis",1,1
944,https://digitalarchives.sjc.edu/items/show/944,"Ford K. Brown and John S. Kieffer Seated at Formal Lecture ""Shakespeare and Chartres"" in the King William Room, St. John's College, Annapolis, Maryland","1 photographic print : b&w","Fox, Cecil H.",,"Annapolis, MD",1972-08-16,"St. John's College owns the rights to this photograph.","still image",jpeg,,"Brown, Ford Keeler. ;  Kieffer, John Spangler.",,,,SJC-P-0027,,,,,,,,,,"600 dpi",,,,,,,,,photograph,"20.5 x 25.5 cm.",,,,,,,,,,,,,,,,,,,,,,,,,"Deans,Tutors",https://s3.us-east-1.amazonaws.com/sjcdigitalarchives/original/83f65002ec0eeda6f322fe18437cbddd.jpg,"Still Image","Photographic Archive—Annapolis",1,1
945,https://digitalarchives.sjc.edu/items/show/945,"Ford K. Brown and John S. Kieffer Seated at Formal Lecture ""Shakespeare and Chartres"" in the King William Room, St. John's College, Annapolis, Maryland","1 photographic print : b&w","Fox, Cecil H.",,"Annapolis, MD",1972-08-16,"St. John's College owns the rights to this photograph.","still image",jpeg,,"Brown, Ford Keeler. ;  Kieffer, John Spangler.",,,,SJC-P-0028,,,,,,,,,,"600 dpi",,,,,,,,,photograph,"20.5 x 25.5 cm.",,,,,,,,,,,,,,,,,,,,,,,,,"Deans,Tutors",https://s3.us-east-1.amazonaws.com/sjcdigitalarchives/original/9559aa064069d6745795a127e61a5d63.jpg,"Still Image","Photographic Archive—Annapolis",1,1
957,https://digitalarchives.sjc.edu/items/show/957,"Portrait of Robert A. Goldwin during the ""Seminar of the Air"" Radio Program","1 photographic print : b&w",Unknown,,"Annapolis, MD","1969-1973 [circa]","St. John's College owns the rights to this photograph.","still image",jpeg,,"Goldwin, Robert A., 1922-",,,,SJC-P-0045,,,,,,,,,,"600 dpi",,,,,,,,,photograph,"20.5 x 25 cm.",,,,,,,,,,,,,,,,,,,,,,,,,"Deans,Tutors",https://s3.us-east-1.amazonaws.com/sjcdigitalarchives/original/83b4d991a32a89d2f21bd609d3febf9e.jpg,"Still Image","Photographic Archive—Annapolis",1,0
968,https://digitalarchives.sjc.edu/items/show/968,"Two good men in Aristotle's Ethics, or does a liberal education improve one's character?","Audio recording of a lecture given on September 9, 2016 by Joseph Macfarland as part of the Dean's Lecture and Concert Series.","Macfarland, Joseph C.","St. John's College","Santa Fe, NM",2016-09-09,"Meem Library has been given permission to make this item available online.",sound,mp3,,"Aristotle. Nicomachean Ethics.",,,English,20014315,,,,,,,,,,,,,,,,,,,mp3,,00:48:42,,,,,,,,,,,,,,,,,,,,,,,,"Deans,Friday night lecture",https://s3.us-east-1.amazonaws.com/sjcdigitalarchives/original/1da08197e7a73c2aee5fd57946f407e2.mp3,Sound,"St. John's College Lecture Recordings—Santa Fe",1,0
1017,https://digitalarchives.sjc.edu/items/show/1017,"Jacob Klein Seated at Dinner Table, St. John's College, Annapolis, Maryland","1 photographic print : b&w",Unknown,,"Annapolis, MD","1949-1958 [circa]","St. John's College owns the rights to this photograph.","still image",jpeg,,"St. John's College (Annapolis, Md.). -- Deans. ;  St. John's College (Annapolis, Md.). -- Faculty.; Klein, Jacob, 1899-1978.",,,,SJC-P-0062,,,,,,,,,,,,,,,,,,,photograph,"24 x 16.5 cm.",,,,,,,,,,,,,,,,,,,,,,,,,"Deans,Honorary Alumni,Tutors",https://s3.us-east-1.amazonaws.com/sjcdigitalarchives/original/4cd6ea95d8c893f13157b32171609bca.jpg,"Still Image","Photographic Archive—Annapolis",1,1
1018,https://digitalarchives.sjc.edu/items/show/1018,"Jacob Klein at Ford K. Brown's Formal Lecture ""Shakespeare and Chartres"" in the King William Room, St. John's College, Annapolis, Maryland","1 photographic print : b&w","Fox, Cecil H.",,"Annapolis, MD",1972-08-16,"St. John's College owns the rights to this photograph.","still image",jpeg,,"St. John's College (Annapolis, Md.). -- Friday night lecture series ;  August 16, 1972 ;  St. John's College (Annapolis, Md.). -- Deans. ;  St. John's College (Annapolis, Md.). -- Faculty. ;  Lectures and Lecturing; Klein, Jacob, 1899-1978.",,,,SJC-P-0064,,,,,,,,,,,,,,,,,,,photograph,"25.5 x 20.5 cm",,,,,,,,,,,,,,,,,,,,,,,,,"Deans,Honorary Alumni,Tutors",https://s3.us-east-1.amazonaws.com/sjcdigitalarchives/original/309c5ec5076185174f5b75d1245e0544.jpg,"Still Image","Photographic Archive—Annapolis",1,0
