﻿"Item Id","Item URI","Dublin Core:Title","Dublin Core:Description","Dublin Core:Creator","Dublin Core:Publisher","Dublin Core:Coverage","Dublin Core:Date","Dublin Core:Rights","Dublin Core:Type","Dublin Core:Format","Dublin Core:Source","Dublin Core:Subject","Dublin Core:Contributor","Dublin Core:Relation","Dublin Core:Language","Dublin Core:Identifier","Item Type Metadata:Occupation","Item Type Metadata:Participants","Item Type Metadata:Death Date","Item Type Metadata:Birthplace","Item Type Metadata:Birth Date","Item Type Metadata:Interviewer","Item Type Metadata:Biographical Text","Item Type Metadata:Bibliography","Item Type Metadata:Page numeration","Item Type Metadata:Resolution","Item Type Metadata:Identifier","Item Type Metadata:Inventory","Item Type Metadata:URL","Item Type Metadata:Text","Item Type Metadata:Interviewee","Item Type Metadata:Location","Item Type Metadata:Transcription","Item Type Metadata:Local URL","Item Type Metadata:Original Format","Item Type Metadata:Physical Dimensions","Item Type Metadata:Duration","Item Type Metadata:Compression","Item Type Metadata:Producer","Item Type Metadata:Director","Item Type Metadata:Bit Rate/Frequency","Item Type Metadata:Email Body","Item Type Metadata:Event Type","Item Type Metadata:Lesson Plan Text","Item Type Metadata:Materials","Item Type Metadata:Objectives","Item Type Metadata:Standards","Item Type Metadata:Number of Attachments","Item Type Metadata:BCC","Item Type Metadata:CC","Item Type Metadata:To","Item Type Metadata:From","Item Type Metadata:Subject Line","Item Type Metadata:Time Summary","Item Type Metadata:Episode","Item Type Metadata:Season","Item Type Metadata:Episode Type","Item Type Metadata:Explicit","Item Type Metadata:Block","PDF Text:Text",tags,file,itemType,collection,public,featured
1058,https://digitalarchives.sjc.edu/items/show/1058,"Richard D. Weigle and Mary Weigle Standing outside of their House, Santa Fe, New Mexico","1 photographic print : color",Unknown,,"Santa Fe, NM",1964,"St. John's College owns the rights to this photograph.","still image",jpeg,,"St. John's College (Annapolis, Md.). -- Presidents. ;  St. John's College (Santa Fe, N. M.). -- Presidents.; Weigle, Richard Daniel, 1912- ;  Weigle, Mary",,,,SJC-P-0128,,,,,,,,,,,,,,,,,,,photograph,"9 x 9 cm.",,,,,,,,,,,,,,,,,,,,,,,,,"Honorary Alumni,Presidents",https://s3.us-east-1.amazonaws.com/sjcdigitalarchives/original/5946f1d4895609fda1296d72daa9f289.jpg,"Still Image","Photographic Archive—Annapolis",1,1
1059,https://digitalarchives.sjc.edu/items/show/1059,"Richard D. Weigle and Alexander K. McLanahan Seated at Table, St. John's College, Santa Fe, New Mexico","1 photographic print : color",Unknown,,"Santa Fe, NM",1977-02,"St. John's College owns the rights to this photograph.","still image",jpeg,,"St. John's College (Annapolis, Md.). -- Presidents. ;  St. John's College (Santa Fe, N. M.). -- Presidents.; Weigle, Richard Daniel, 1912- ;  McLanahan, Alexander K.",,,,SJC-P-0129,,,,,,,,,,,,,,,,,,,photograph,"12.5 x 8.5 cm.",,,,,,,,,,,,,,,,,,,,,,,,,"Honorary Alumni,Presidents",https://s3.us-east-1.amazonaws.com/sjcdigitalarchives/original/38314fabf1cac482a450def5b8f19787.jpg,"Still Image","Photographic Archive—Annapolis",1,1
3443,https://digitalarchives.sjc.edu/items/show/3443,"Christopher B. Nelson with Victor Frenkil and Richard D. Weigle at Christopher B. Nelson’s Inauguration Reception in the Francis Scott Key Lobby, Mellon Hall","1 photographic print : b&w","Harvey & Harvey Photographers",,"Annapolis, MD",1991-10-18,,"still image",jpeg,,"Nelson, Christopher B., 1948-; Frenkil, Victor, 1908-; Weigle, Richard Daniel, 1912-",,,,COM-NEL-P-0003,,,,,,,,,,,,,,,,,,,photograph,"25.5 cm x 20 cm",,,,,,,,,,,,,,,,,,,,,,,,,"Francis Scott Key Lobby,Inauguration,Mellon Hall,Presidents",https://s3.us-east-1.amazonaws.com/sjcdigitalarchives/original/0bcc19a9bd6b73b756b8169a5bea190a.jpg,"Still Image","Photographic Archive—Annapolis",1,0
3745,https://digitalarchives.sjc.edu/items/show/3745,"Bulletin of St. John's College in Annapolis, December 1950","Volume II, No. 4 of the Bulletin of St. John's College in Annapolis, Inaugural Proceedings.  Published in  December 1950.","St. John's College","St. John's College","Annapolis, MD",1950-12,"St. John's College owns the rights to this publication.",text,pdf,,"Weigle, Richard Daniel, 1912- ",,,English,"Bulletin December 1950-Vol II #4a-Inaugural Procedings",,,,,,,,,"24 pages",,,,,,,,,,paper,,,,,,,,,,,,,,,,,,,,,,,,,,"Inauguration,Presidents",https://s3.us-east-1.amazonaws.com/sjcdigitalarchives/original/0c833bb48c07fc126271db888a5fd033.pdf,Text,"The Bulletin",1,0
3753,https://digitalarchives.sjc.edu/items/show/3753,"Bulletin of St. John's College in Annapolis, July 1959","Volume XI, No. 3 of the Bulletin of St. John's College in Annapolis, Report of the President.  Published in July 1959.","St. John's College","St. John's College","Annapolis, MD",1959-07,"St. John's College owns the rights to this publication.",text,pdf,,"Weigle, Richard Daniel, 1912- ",,,English,"Bulletin July 1959-Vol XI No 3-Report of the President",,,,,,,,,"20 pages",,,,,,,,,,paper,,,,,,,,,,,,,,,,,,,,,,,,,,"President's Report,Presidents",https://s3.us-east-1.amazonaws.com/sjcdigitalarchives/original/c64db8f211881d577d58b0061de2f1b7.pdf,Text,"The Bulletin",1,0
3754,https://digitalarchives.sjc.edu/items/show/3754,"Bulletin of St. John's College in Annapolis, June 1950","Volume II, No. 2 of the Bulletin of St. John's College in Annapolis, Report of the President.  Published in June 1950.","St. John's College","St. John's College","Annapolis, MD",1950-06,"St. John's College owns the rights to this publication.",text,pdf,,"Weigle, Richard Daniel, 1912- ",,,English,Bulletin_vol2_no2_1950_June,,,,,,,,,"15 pages",,,,,,,,,,paper,,,,,,,,,,,,,,,,,,,,,,,,,,"President's Report,Presidents",https://s3.us-east-1.amazonaws.com/sjcdigitalarchives/original/eea6faf539d2414d2a34265033c35f03.pdf,Text,"The Bulletin",1,0
3762,https://digitalarchives.sjc.edu/items/show/3762,"Bulletin of St. John's College in Annapolis, October 1954","Volume VI, No. 4 of the Bulletin of St. John's College in Annapolis, Report of the President.  Published in October 1954.","St. John's College","St. John's College","Annapolis, MD",1954-10,"St. John's College owns the rights to this publication.",text,pdf,,"Weigle, Richard Daniel, 1912-",,,English,"Bulletin October 1954-Vol. VI No. 4-Report of the President",,,,,,,,,"20 pages",,,,,,,,,,paper,,,,,,,,,,,,,,,,,,,,,,,,,,"President's Report,Presidents",https://s3.us-east-1.amazonaws.com/sjcdigitalarchives/original/f30eeb9dc80b933a7be4b8ca00d9300d.pdf,Text,"The Bulletin",1,0
3763,https://digitalarchives.sjc.edu/items/show/3763,"Bulletin of St. John's College in Annapolis, October 1955","Volume VII, No. 4 of the Bulletin of St. John's College in Annapolis, Report of the President.  Published in October 1955.","St. John's College","St. John's College","Annapolis, MD",1955-10,"St. John's College owns the rights to this publication.",text,pdf,,"Weigle, Richard Daniel, 1912-",,,English,"Bulletin October 1955 Vol. VII No. 4-Report of the President",,,,,,,,,"24 pages",,,,,,,,,,paper,,,,,,,,,,,,,,,,,,,,,,,,,,"President's Report,Presidents",https://s3.us-east-1.amazonaws.com/sjcdigitalarchives/original/8fe8ac81c4eb9dee3581ccc14c93098b.pdf,Text,"The Bulletin",1,0
3764,https://digitalarchives.sjc.edu/items/show/3764,"Bulletin of St. John's College in Annapolis, October 1956","Volume VIII, No. 4 of the Bulletin of St. John's College in Annapolis, Report of the President.  Published in October 1956.","St. John's College","St. John's College","Annapolis, MD",1956-10,"St. John's College owns the rights to this publication.",text,pdf,,"Weigle, Richard Daniel, 1912-",,,English,"Bulletin October 1956-Vol VIII No 4-Report of the President",,,,,,,,,"20 pages",,,,,,,,,,paper,,,,,,,,,,,,,,,,,,,,,,,,,,"President's Report,Presidents",https://s3.us-east-1.amazonaws.com/sjcdigitalarchives/original/d84a8e36858978f325d23ff75fa38a02.pdf,Text,"The Bulletin",1,0
3765,https://digitalarchives.sjc.edu/items/show/3765,"Bulletin of St. John's College in Annapolis, October 1957.","Volume IX, No. 4 of the Bulletin of St. John's College in Annapolis, Report of the President.  Published in October 1957.","St. John's College","St. John's College","Annapolis, MD",1957-10,"St. John's College owns the rights to this publication.",text,pdf,,"Weigle, Richard Daniel, 1912-",,,English,"Bulletin October 1957-Vol IX No 4-Report of the President",,,,,,,,,"16 pages",,,,,,,,,,paper,,,,,,,,,,,,,,,,,,,,,,,,,,"President's Report,Presidents",https://s3.us-east-1.amazonaws.com/sjcdigitalarchives/original/380763d314e78616379f21056b15bc0c.pdf,Text,"The Bulletin",1,0
3769,https://digitalarchives.sjc.edu/items/show/3769,"Bulletin of St. John's College in Annapolis, September 1951","Volume III, No. 3 of the Bulletin of St. John's College in Annapolis, Report of the President.  Published in September 1951.","St. John's College","St. John's College","Annapolis, MD",1951-09,"St. John's College owns the rights to this publication.",text,pdf,,"Weigle, Richard Daniel, 1912- ",,,English,"Bulletin September 1951-Vol III No 3-Report of the President",,,,,,,,,"20 pages",,,,,,,,,,paper,,,,,,,,,,,,,,,,,,,,,,,,,,Presidents,https://s3.us-east-1.amazonaws.com/sjcdigitalarchives/original/e557d3034009da9bb8446bfd733d124c.pdf,Text,"The Bulletin",1,0
3770,https://digitalarchives.sjc.edu/items/show/3770,"Bulletin of St. John's College in Annapolis, September 1952","Volume IV, No. 3 of the Bulletin of St. John's College in Annapolis, Report of the President.  Published in September 1952.","St. John's College","St. John's College","Annapolis, MD",1952-09,"St. John's College owns the rights to this publication.",text,pdf,,"Weigle, Richard Daniel, 1912- ",,,English,"Bulletin September 1952-Vol. IV No. 3-Report of the President",,,,,,,,,"16 pages",,,,,,,,,,paper,,,,,,,,,,,,,,,,,,,,,,,,,,Presidents,https://s3.us-east-1.amazonaws.com/sjcdigitalarchives/original/c29c31ddb4ec92532bde65c6c5518f53.pdf,Text,"The Bulletin",1,0
3771,https://digitalarchives.sjc.edu/items/show/3771,"Bulletin of St. John's College in Annapolis, September 1953","Volume V, No. 3 of the Bulletin of St. John's College in Annapolis, Report of the President.  Published in September 1953.","St. John's College","St. John's College","Annapolis, MD",1953-09,"St. John's College owns the rights to this publication.",text,pdf,,"Weigle, Richard Daniel, 1912- ",,,English,"Bulletin September 1953-Vol V No. 3-Report of the President",,,,,,,,,"20 pages",,,,,,,,,,paper,,,,,,,,,,,,,,,,,,,,,,,,,,"President's Report,Presidents",https://s3.us-east-1.amazonaws.com/sjcdigitalarchives/original/5b7578cdd25f79b7d5a4b69d97b39d6e.pdf,Text,"The Bulletin",1,0
5764,https://digitalarchives.sjc.edu/items/show/5764,"Richard D. Weigle and F. Townsend Morgan Place a Painting of McDowell Hall on a Fireplace Mantle, Annapolis, Maryland","1 photographic print : b&w",Unknown,,"Annapolis, MD",,"St. John's College owns the rights to this photograph.","Still Image",jpeg,,"Weigle, Richard Daniel, 1912-;  Morgan, F. Townsend",,,,SJC-P-1845,,,,,,,,,,,,,,,,,,,Photograph,"25.5 x 20.5 cm.",,,,,,,,,,,,,,,,,,,,,,,,,"Honorary Alumni,Presidents",https://s3.us-east-1.amazonaws.com/sjcdigitalarchives/original/ae168e3cad367f580f604c864e7d2094.jpg,"Still Image","Photographic Archive—Annapolis",1,0
