﻿"Item Id","Item URI","Dublin Core:Title","Dublin Core:Description","Dublin Core:Creator","Dublin Core:Publisher","Dublin Core:Coverage","Dublin Core:Date","Dublin Core:Rights","Dublin Core:Type","Dublin Core:Format","Dublin Core:Source","Dublin Core:Subject","Dublin Core:Contributor","Dublin Core:Relation","Dublin Core:Language","Dublin Core:Identifier","Item Type Metadata:Occupation","Item Type Metadata:Participants","Item Type Metadata:Death Date","Item Type Metadata:Birthplace","Item Type Metadata:Birth Date","Item Type Metadata:Interviewer","Item Type Metadata:Biographical Text","Item Type Metadata:Bibliography","Item Type Metadata:Page numeration","Item Type Metadata:Resolution","Item Type Metadata:Identifier","Item Type Metadata:Inventory","Item Type Metadata:URL","Item Type Metadata:Text","Item Type Metadata:Interviewee","Item Type Metadata:Location","Item Type Metadata:Transcription","Item Type Metadata:Local URL","Item Type Metadata:Original Format","Item Type Metadata:Physical Dimensions","Item Type Metadata:Duration","Item Type Metadata:Compression","Item Type Metadata:Producer","Item Type Metadata:Director","Item Type Metadata:Bit Rate/Frequency","Item Type Metadata:Email Body","Item Type Metadata:Event Type","Item Type Metadata:Lesson Plan Text","Item Type Metadata:Materials","Item Type Metadata:Objectives","Item Type Metadata:Standards","Item Type Metadata:Number of Attachments","Item Type Metadata:BCC","Item Type Metadata:CC","Item Type Metadata:To","Item Type Metadata:From","Item Type Metadata:Subject Line","Item Type Metadata:Time Summary","Item Type Metadata:Episode","Item Type Metadata:Season","Item Type Metadata:Episode Type","Item Type Metadata:Explicit","Item Type Metadata:Block","PDF Text:Text",tags,file,itemType,collection,public,featured
3764,https://digitalarchives.sjc.edu/items/show/3764,"Bulletin of St. John's College in Annapolis, October 1956","Volume VIII, No. 4 of the Bulletin of St. John's College in Annapolis, Report of the President.  Published in October 1956.","St. John's College","St. John's College","Annapolis, MD",1956-10,"St. John's College owns the rights to this publication.",text,pdf,,"Weigle, Richard Daniel, 1912-",,,English,"Bulletin October 1956-Vol VIII No 4-Report of the President",,,,,,,,,"20 pages",,,,,,,,,,paper,,,,,,,,,,,,,,,,,,,,,,,,,,"President's Report,Presidents",https://s3.us-east-1.amazonaws.com/sjcdigitalarchives/original/d84a8e36858978f325d23ff75fa38a02.pdf,Text,"The Bulletin",1,0
3763,https://digitalarchives.sjc.edu/items/show/3763,"Bulletin of St. John's College in Annapolis, October 1955","Volume VII, No. 4 of the Bulletin of St. John's College in Annapolis, Report of the President.  Published in October 1955.","St. John's College","St. John's College","Annapolis, MD",1955-10,"St. John's College owns the rights to this publication.",text,pdf,,"Weigle, Richard Daniel, 1912-",,,English,"Bulletin October 1955 Vol. VII No. 4-Report of the President",,,,,,,,,"24 pages",,,,,,,,,,paper,,,,,,,,,,,,,,,,,,,,,,,,,,"President's Report,Presidents",https://s3.us-east-1.amazonaws.com/sjcdigitalarchives/original/8fe8ac81c4eb9dee3581ccc14c93098b.pdf,Text,"The Bulletin",1,0
3762,https://digitalarchives.sjc.edu/items/show/3762,"Bulletin of St. John's College in Annapolis, October 1954","Volume VI, No. 4 of the Bulletin of St. John's College in Annapolis, Report of the President.  Published in October 1954.","St. John's College","St. John's College","Annapolis, MD",1954-10,"St. John's College owns the rights to this publication.",text,pdf,,"Weigle, Richard Daniel, 1912-",,,English,"Bulletin October 1954-Vol. VI No. 4-Report of the President",,,,,,,,,"20 pages",,,,,,,,,,paper,,,,,,,,,,,,,,,,,,,,,,,,,,"President's Report,Presidents",https://s3.us-east-1.amazonaws.com/sjcdigitalarchives/original/f30eeb9dc80b933a7be4b8ca00d9300d.pdf,Text,"The Bulletin",1,0
3754,https://digitalarchives.sjc.edu/items/show/3754,"Bulletin of St. John's College in Annapolis, June 1950","Volume II, No. 2 of the Bulletin of St. John's College in Annapolis, Report of the President.  Published in June 1950.","St. John's College","St. John's College","Annapolis, MD",1950-06,"St. John's College owns the rights to this publication.",text,pdf,,"Weigle, Richard Daniel, 1912- ",,,English,Bulletin_vol2_no2_1950_June,,,,,,,,,"15 pages",,,,,,,,,,paper,,,,,,,,,,,,,,,,,,,,,,,,,,"President's Report,Presidents",https://s3.us-east-1.amazonaws.com/sjcdigitalarchives/original/eea6faf539d2414d2a34265033c35f03.pdf,Text,"The Bulletin",1,0
3753,https://digitalarchives.sjc.edu/items/show/3753,"Bulletin of St. John's College in Annapolis, July 1959","Volume XI, No. 3 of the Bulletin of St. John's College in Annapolis, Report of the President.  Published in July 1959.","St. John's College","St. John's College","Annapolis, MD",1959-07,"St. John's College owns the rights to this publication.",text,pdf,,"Weigle, Richard Daniel, 1912- ",,,English,"Bulletin July 1959-Vol XI No 3-Report of the President",,,,,,,,,"20 pages",,,,,,,,,,paper,,,,,,,,,,,,,,,,,,,,,,,,,,"President's Report,Presidents",https://s3.us-east-1.amazonaws.com/sjcdigitalarchives/original/c64db8f211881d577d58b0061de2f1b7.pdf,Text,"The Bulletin",1,0
3745,https://digitalarchives.sjc.edu/items/show/3745,"Bulletin of St. John's College in Annapolis, December 1950","Volume II, No. 4 of the Bulletin of St. John's College in Annapolis, Inaugural Proceedings.  Published in  December 1950.","St. John's College","St. John's College","Annapolis, MD",1950-12,"St. John's College owns the rights to this publication.",text,pdf,,"Weigle, Richard Daniel, 1912- ",,,English,"Bulletin December 1950-Vol II #4a-Inaugural Procedings",,,,,,,,,"24 pages",,,,,,,,,,paper,,,,,,,,,,,,,,,,,,,,,,,,,,"Inauguration,Presidents",https://s3.us-east-1.amazonaws.com/sjcdigitalarchives/original/0c833bb48c07fc126271db888a5fd033.pdf,Text,"The Bulletin",1,0
1040,https://digitalarchives.sjc.edu/items/show/1040,"Richard D. Weigle in Conversation with Adolph W. Schmidt and Colleagues","1 photographic print : b&w","Schick, Jules",,"Santa Fe, NM",1976-12-08,"St. John's College owns the rights to this photograph.","still image",jpeg,,"St. John's College (Annapolis, Md.). -- Presidents. ;  St. John's College (Santa Fe, N. M.) -- Presidents. ;  St. John's College (Annapolis, Md.) -- Alumni and alumnae.; Weigle, Richard Daniel, 1912- ;  Schmidt, Adolph W.",,,,SJC-P-0105,,,,,,,,,,,,,,,,,,,photograph,"22.5 x 17.5 cm.",,,,,,,,,,,,,,,,,,,,,,,,,"Honorary Alumni,Presidents",https://s3.us-east-1.amazonaws.com/sjcdigitalarchives/original/95c46a5251cd842e3508b9989f72d242.jpg,"Still Image","Photographic Archive—Annapolis",1,1
1039,https://digitalarchives.sjc.edu/items/show/1039,"Richard D. Weigle Standing with Adolph W. Schmidt, Richard M. Budge, Edward J. Dwyer and Robert Yarnall, Jr.","1 photographic print : b&w","Schick, Jules",,"Santa Fe, NM",1976-12-08,"St. John's College owns the rights to this photograph.","still image",jpeg,,"St. John's College (Annapolis, Md.). -- Presidents. ;  St. John's College (Santa Fe, N. M.). -- Presidents. ;  St. John's College (Annapolis, Md.) -- Alumni and alumnae.; Weigle, Richard Daniel, 1912- ;  Schmidt, Adolph W. ;  Budge, Richard M. ;  Dwyer, Edward J. ;  Yarnall, Robert, Jr.",,,,SJC-P-0104,,,,,,,,,,,,,,,,,,,photograph,"25.5 x 20.5 cm",,,,,,,,,,,,,,,,,,,,,,,,,"Honorary Alumni,Presidents",https://s3.us-east-1.amazonaws.com/sjcdigitalarchives/original/2f2f3f2dd988126153463b3ae1bf0709.jpg,"Still Image","Photographic Archive—Annapolis",1,1
1042,https://digitalarchives.sjc.edu/items/show/1042,"Richard D. Weigle, outside, Speaking with Students on Campus, St. John's College, Santa Fe, New Mexico","1 photographic print : b&w","Nugent, Robert",,"Santa Fe, NM","1970-1979 [circa]","St. John's College owns the rights to this photograph.","still image",jpeg,,"St. John's College (Annapolis, Md.). -- Presidents. ;  St. John's College (Santa Fe, N.M.). -- Presidents.; Weigle, Richard Daniel, 1912-",,,,SJC-P-0107,,,,,,,,,,,,,,,,,,,photograph,"14 x 19 cm.",,,,,,,,,,,,,,,,,,,,,,,,,"Honorary Alumni,Presidents",https://s3.us-east-1.amazonaws.com/sjcdigitalarchives/original/e00480fc9d28abc81c16f8e13b66500e.jpg,"Still Image","Photographic Archive—Annapolis",1,1
1041,https://digitalarchives.sjc.edu/items/show/1041,"Richard D. Weigle and Mary Weigle at a Legislator's Party in Santa Fe, New Mexico","1 photographic print : b&w","Milo Photographer",,"Santa Fe, NM",1965-02,"St. John's College owns the rights to this photograph.","still image",jpeg,,"St. John's College (Annapolis, Md.). -- Presidents. ;  St. John's College (Santa Fe, N. M.) -- Presidents.; Weigle, Richard Daniel, 1912- ;  Weigle, Mary",,,,SJC-P-0106,,,,,,,,,,,,,,,,,,,photograph,"25.5 x 20.5 cm.",,,,,,,,,,,,,,,,,,,,,,,,,"Honorary Alumni,Presidents",https://s3.us-east-1.amazonaws.com/sjcdigitalarchives/original/6a70f17b5e0f115931cfdca858019109.jpg,"Still Image","Photographic Archive—Annapolis",1,1
1043,https://digitalarchives.sjc.edu/items/show/1043,"Richard Weigle, Mary Weigle, David Ginsburg and Mrs. W. Driscoll at the Dedication of Weigle Hall, St. John's College, Santa Fe, New Mexico","1 photographic print : b&w","Lilienthal, Betty",,"Santa Fe, NM",1974-05-19,"St. John's College owns the rights to this photograph.","still image",jpeg,,"Weigle Hall (St. John's College, Santa Fe, N. M.) ;  St. John's College (Annapolis, Md.). -- Presidents. ;  St. John's College (Santa Fe, N. M.). -- Presidents.; Weigle, Richard Daniel, 1912- ;  Ginsburg, David ;  Weigle, Mary",,,,SJC-P-0108,,,,,,,,,,,,,,,,,,,photograph,"24.5 x 18.5 cm.",,,,,,,,,,,,,,,,,,,,,,,,,"Honorary Alumni,Presidents",https://s3.us-east-1.amazonaws.com/sjcdigitalarchives/original/f943938dcbf860e4372a450818745d37.jpg,"Still Image","Photographic Archive—Annapolis",1,1
1044,https://digitalarchives.sjc.edu/items/show/1044,"Richard D. Weigle and Mary Weigle with TWA Flight Crew and Ceremonial Shovel for the Groundbreaking of the St. John's College, Santa Fe, New Mexico Campus","1 photographic print : b&w","Hughes Co. Commercial",,"Santa Fe, NM",1963-04,"St. John's College owns the rights to this photograph.","still image",jpeg,,"St. John's College (Annapolis, Md.). -- Presidents. ;  St. John's College (Santa Fe, N. M.). -- Presidents.; Weigle, Richard Daniel, 1912- ;  Weigle, Mary",,,,SJC-P-0109,,,,,,,,,,,,,,,,,,,photograph,"25.5 x 20.5 cm.",,,,,,,,,,,,,,,,,,,,,,,,,"Honorary Alumni,Presidents",https://s3.us-east-1.amazonaws.com/sjcdigitalarchives/original/4f1c02281bb981fb3721a83ef43badcf.jpg,"Still Image","Photographic Archive—Annapolis",1,1
3443,https://digitalarchives.sjc.edu/items/show/3443,"Christopher B. Nelson with Victor Frenkil and Richard D. Weigle at Christopher B. Nelson’s Inauguration Reception in the Francis Scott Key Lobby, Mellon Hall","1 photographic print : b&w","Harvey & Harvey Photographers",,"Annapolis, MD",1991-10-18,,"still image",jpeg,,"Nelson, Christopher B., 1948-; Frenkil, Victor, 1908-; Weigle, Richard Daniel, 1912-",,,,COM-NEL-P-0003,,,,,,,,,,,,,,,,,,,photograph,"25.5 cm x 20 cm",,,,,,,,,,,,,,,,,,,,,,,,,"Francis Scott Key Lobby,Inauguration,Mellon Hall,Presidents",https://s3.us-east-1.amazonaws.com/sjcdigitalarchives/original/0bcc19a9bd6b73b756b8169a5bea190a.jpg,"Still Image","Photographic Archive—Annapolis",1,0
1038,https://digitalarchives.sjc.edu/items/show/1038,"Painting of Richard D. Weigle with St. John's College, Santa Fe, New Mexico Campus in Background","1 photographic print : b&w","Gilpin, Laura",,"Santa Fe, NM","1964 [circa]","St. John's College owns the rights to this photograph.","still image",jpeg,,"St. John's College (Annapolis, Md.). -- Presidents. ;  St. John's College (Santa Fe, N. M.). -- Presidents. ;  Portraits ;  Paintings; Weigle, Richard Daniel, 1912-",,,,SJC-P-0103,,,,,,,,,,,,,,,,,,,photograph,"25.5 x 20.5 cm",,,,,,,,,,,,,,,,,,,,,,,,,"Honorary Alumni,Presidents",https://s3.us-east-1.amazonaws.com/sjcdigitalarchives/original/b9fc65cf516e5c65372e4f158106dd97.jpg,"Still Image","Photographic Archive—Annapolis",1,1
