﻿"Item Id","Item URI","Dublin Core:Title","Dublin Core:Description","Dublin Core:Creator","Dublin Core:Publisher","Dublin Core:Coverage","Dublin Core:Date","Dublin Core:Rights","Dublin Core:Type","Dublin Core:Format","Dublin Core:Source","Dublin Core:Subject","Dublin Core:Contributor","Dublin Core:Relation","Dublin Core:Language","Dublin Core:Identifier","Item Type Metadata:Occupation","Item Type Metadata:Participants","Item Type Metadata:Death Date","Item Type Metadata:Birthplace","Item Type Metadata:Birth Date","Item Type Metadata:Interviewer","Item Type Metadata:Biographical Text","Item Type Metadata:Bibliography","Item Type Metadata:Page numeration","Item Type Metadata:Resolution","Item Type Metadata:Identifier","Item Type Metadata:Inventory","Item Type Metadata:URL","Item Type Metadata:Text","Item Type Metadata:Interviewee","Item Type Metadata:Location","Item Type Metadata:Transcription","Item Type Metadata:Local URL","Item Type Metadata:Original Format","Item Type Metadata:Physical Dimensions","Item Type Metadata:Duration","Item Type Metadata:Compression","Item Type Metadata:Producer","Item Type Metadata:Director","Item Type Metadata:Bit Rate/Frequency","Item Type Metadata:Email Body","Item Type Metadata:Event Type","Item Type Metadata:Lesson Plan Text","Item Type Metadata:Materials","Item Type Metadata:Objectives","Item Type Metadata:Standards","Item Type Metadata:Number of Attachments","Item Type Metadata:BCC","Item Type Metadata:CC","Item Type Metadata:To","Item Type Metadata:From","Item Type Metadata:Subject Line","Item Type Metadata:Time Summary","Item Type Metadata:Episode","Item Type Metadata:Season","Item Type Metadata:Episode Type","Item Type Metadata:Explicit","Item Type Metadata:Block","PDF Text:Text",tags,file,itemType,collection,public,featured
356,https://digitalarchives.sjc.edu/items/show/356,"Commencement under the Liberty Tree, St. John's College, Annapolis, Maryland","1 photographic print : b&w ",Unknown,,"Annapolis, MD","1953 [circa]","St. John's College owns the rights to this photograph.","still image",jpeg,,"Commencement (St. John's College, Annapolis, MD)",,,,SJC-P-0614,,,,,,,,,,"600 dpi",,,,,,,,,photograph,"mount 13 x 7.5 cm. ;  11.5 x 7.5 cm.",,,,,,,,,,,,,,,,,,,,,,,,,"Commencement,Liberty tree",https://s3.us-east-1.amazonaws.com/sjcdigitalarchives/original/e4bd51463dbc33273c7267e3d5deaf02.jpg,"Still Image","Photographic Archive—Annapolis",1,1
4783,https://digitalarchives.sjc.edu/items/show/4783,"Richard D. Weigle Presents a Student with a Degree during Commencement in the Francis Scott Key Auditorium, St. John's College, Annapolis, Maryland","1 photographic print : b&w",Unknown,,"Annapolis, MD","1955-1965 [circa]","St. John's College owns the rights to this photograph.","Still Image",jpeg,,"Commencement (St. John's College, Annapolis, MD) ;  St. John's College (Annapolis, Md.). -- Presidents. ;   St. John's College (Santa Fe, N.M.). -- Presidents. ;  Weigle, Richard Daniel 1912-",,,,SJC-P-0800,,,,,,,,,,,,,,,,,,,Photograph,"17.5 x 12.5 cm.",,,,,,,,,,,,,,,,,,,,,,,,,"Commencement,Francis Scott Key Auditorium,Honorary Alumni,Presidents",https://s3.us-east-1.amazonaws.com/sjcdigitalarchives/original/ef5fb0097dba9876e6a40e266ca48dae.jpg,"Still Image","Photographic Archive—Annapolis",1,0
4637,https://digitalarchives.sjc.edu/items/show/4637,"Miriam Strange Receiving an Honorary Masters of Arts Degree from Richard D. Weigle during Commencement St. John's College, Annapolis, Maryland, 1960","1 photographic print : b&w",Unknown,,"Annapolis, MD",1960,"St. John's College owns the rights to this photograph.","Still Image",jpeg,,"Commencement (St. John's College, Annapolis, MD) ;  St. John's College (Annapolis, Md.). -- Registrars. ;   St. John's College (Annapolis, Md.). -- Presidents. ;  St. John's College (Santa Fe, N. M.). -- Presidents. ;  Strange, Miriam;  Weigle, Richard Daniel 1912-",,,,SJC-P-0712,,,,,,,,,,,,,,,,,,,Photograph,"12.5 x 18 cm.",,,,,,,,,,,,,,,,,,,,,,,,,"Honorary Alumni,Presidents,Registrar",https://s3.us-east-1.amazonaws.com/sjcdigitalarchives/original/3529db38e3555942b105ba79e8826516.jpg,"Still Image","Photographic Archive—Annapolis",1,0
1694,https://digitalarchives.sjc.edu/items/show/1694,"Richard D. Weigle and Miriam Strange, in Academic Robes, Standing at Podium at Commencement, St. John's College, Annapolis, Maryland, 1972","1 photographic print : b&w",Unknown,,"Annapolis, MD",1972,"St. John's College owns the rights to this photograph.","still image",jpeg,,"Commencement (St. John's College, Annapolis, MD) ;  St. John's College (Annapolis, Md.). -- Presidents. ;  St. John's College (Santa Fe, N. M.). -- Presidents. ;  St. John's College (Annapolis, Md.). -- Registrars.; Weigle, Richard Daniel 1912- ;  Strange, Miriam",,,,SJC-P-0136,,,,,,,,,,,,,,,,,,,photograph,"16.5 x 12 cm.",,,,,,,,,,,,,,,,,,,,,,,,,"Honorary Alumni,Presidents,Registrar",https://s3.us-east-1.amazonaws.com/sjcdigitalarchives/original/36c607815fcdb53221de122b6694e6c1.jpg,"Still Image","Photographic Archive—Annapolis",1,0
361,https://digitalarchives.sjc.edu/items/show/361,"Eva T. H. Brann in Academic Robe Speaking at Commencement, Annapolis, Maryland","1 photographic print : b&w ",Unknown,,"Annapolis, MD",1974-05-14,"St. John's College owns the rights to this photograph.","still image",jpeg,,"Commencement (St. John's College, Annapolis, MD) ;  Brann, Eva T. H.",,,,SJC-P-1134,,,,,,,,,,"600 dpi",,,,,,,,,photograph," 25.5 x 20.5 cm.",,,,,,,,,,,,,,,,,,,,,,,,,"Commencement,Deans,Tutors",https://s3.us-east-1.amazonaws.com/sjcdigitalarchives/original/b91f8cc04bfc84e12121dc49d3eb8a0d.jpg,"Still Image","Photographic Archive—Annapolis",1,1
358,https://digitalarchives.sjc.edu/items/show/358,"Curtis A. Wilson, in Academic Robe, Speaking at Podium during Commencement, St. John's College, Annapolis, Maryland","1 photographic print : b&w ",Unknown,,"Annapolis, MD",1977-05,"St. John's College owns the rights to this photograph.","still image",jpeg,,"Commencement (St. John's College, Annapolis, MD) ;  St. John's College (Annapolis, Md.). -- Deans. ;  St. John's College (Annapolis, Md.). -- Faculty. ;  Baccalaureate addresses ;  Wilson, Curtis.",,,,SJC-P-0720,,,,,,,,,,"600 dpi",,,,,,,,,photograph," 18 x 12.5 cm.",,,,,,,,,,,,,,,,,,,,,,,,,"Commencement,Deans,Tutors",https://s3.us-east-1.amazonaws.com/sjcdigitalarchives/original/e30624aa7118b5a9f0c5a3268bceb6f9.jpg,"Still Image","Photographic Archive—Annapolis",1,1
4662,https://digitalarchives.sjc.edu/items/show/4662,"The St. John's College Graduating Class of 1977 in Academic Robes Seated at Commencement, St. John's College, Annapolis, Maryland, May 1977","1 photographic print : b&w",Unknown,,"Annapolis, MD",1977-05,"St. John's College owns the rights to this photograph.","Still Image",jpeg,,"Commencement (St. John's College, Annapolis, MD)",,,,SJC-P-0721,,,,,,,,,,,,,,,,,,,Photograph,"18 x 12.5 cm.",,,,,,,,,,,,,,,,,,,,,,,,,Commencement,https://s3.us-east-1.amazonaws.com/sjcdigitalarchives/original/4a9b825164215e011f95f1b08c466457.jpg,"Still Image","Photographic Archive—Annapolis",1,0
4663,https://digitalarchives.sjc.edu/items/show/4663,"Diplomas Sitting on a Table Ready to be Presented at Commencement, St. John's College, Annapolis, Maryland, May 1977","1 photographic print : b&w",Unknown,,"Annapolis, MD",1977-05,"St. John's College owns the rights to this photograph.","Still Image",jpeg,,"Commencement (St. John's College, Annapolis, MD)",,,,SJC-P-0722,,,,,,,,,,,,,,,,,,,Photograph,"18 x 12.5 cm.",,,,,,,,,,,,,,,,,,,,,,,,,Commencement,https://s3.us-east-1.amazonaws.com/sjcdigitalarchives/original/c9d66633cc391bddbc8675201965d722.jpg,"Still Image","Photographic Archive—Annapolis",1,0
721,https://digitalarchives.sjc.edu/items/show/721,"Graduate Institute Commencement Program,  1980","Program for the second commencement of the Graduate Institute in Annapolis, Maryland.","St. John's College","St. John's College","Annapolis, MD",1980-08-14,"St. John's College owns the rights to this publication.",text,pdf,,"Commencement (St. John's College, Annapolis, MD)",,,English,GICommencementExercises1980,,,,,,,,,"2 pages",,,,,,,,,,paper,,,,,,,,,,,,,,,,,,,,,,,,,,"Commencement,Graduate Institute",https://s3.us-east-1.amazonaws.com/sjcdigitalarchives/original/e72887bb0ed9def6cafbe452d29a131d.pdf,Text,"Commencement Programs and Addresses",1,0
722,https://digitalarchives.sjc.edu/items/show/722,"Graduate Institute Commencement Program,  1986","Program for the eighth commencement of the Annapolis campus of the Graduate Institute.","St. John's College","St. John's College","Annapolis, MD",1986-08-14,"St. John's College owns the rights to this publication.",text,pdf,,"Commencement (St. John's College, Annapolis, MD)",,,English,GICommencementExercises1986,,,,,,,,,"2 pages",,,,,,,,,,paper,,,,,,,,,,,,,,,,,,,,,,,,,,"Commencement,Graduate Institute",https://s3.us-east-1.amazonaws.com/sjcdigitalarchives/original/5efd43a90c88ff75406a6f4e5a5d6431.pdf,Text,"Commencement Programs and Addresses",1,0
723,https://digitalarchives.sjc.edu/items/show/723,"Graduate Institute Commencement Program,  1987","Program for the ninth commencement of the Annapolis campus of the Graduate Institute.","St. John's College","St. John's College","Annapolis, MD",1987-08-13,"St. John's College owns the rights to this publication.",text,pdf,,"Commencement (St. John's College, Annapolis, MD)",,,English,GICommencementExercises1987,,,,,,,,,"2 pages",,,,,,,,,,paper,,,,,,,,,,,,,,,,,,,,,,,,,,"Commencement,Graduate Institute",https://s3.us-east-1.amazonaws.com/sjcdigitalarchives/original/b60ab17ebfda2a8cb5d4fcd2a6962336.pdf,Text,"Commencement Programs and Addresses",1,0
724,https://digitalarchives.sjc.edu/items/show/724,"Graduate Institute Commencement Program,  1988","Program for the tenth commencement of the Annapolis campus of the Graduate Institute.","St. John's College","St. John's College","Annapolis, MD",1988-08-11,"St. John's College owns the rights to this publication.",text,pdf,,"Commencement (St. John's College, Annapolis, MD)",,,English,GICommencementExercises1988,,,,,,,,,"2 pages",,,,,,,,,,paper,,,,,,,,,,,,,,,,,,,,,,,,,,"Commencement,Graduate Institute",https://s3.us-east-1.amazonaws.com/sjcdigitalarchives/original/5b6e0915acd16edfd1c00a93328471d7.pdf,Text,"Commencement Programs and Addresses",1,0
708,https://digitalarchives.sjc.edu/items/show/708,"Commencement Program,  1989","Program for the one hundred ninety-seventh commencement in the two hundred ninety-third year of the college.","St. John's College","St. John's College","Annapolis, MD",1989-05-21,"St. John's College owns the rights to this publication.",text,pdf,,"Commencement (St. John's College, Annapolis, MD)",,,English,CommencementExercises1989,,,,,,,,,"16 pages",,,,,,,,,,paper,,,,,,,,,,,,,,,,,,,,,,,,,,Commencement,https://s3.us-east-1.amazonaws.com/sjcdigitalarchives/original/47ada61ea068efef424c1a40a4b03df6.pdf,Text,"Commencement Programs and Addresses",1,0
725,https://digitalarchives.sjc.edu/items/show/725,"Graduate Institute Commencement Program,  1989","Program for the eleventh commencement of the Annapolis campus of the Graduate Institute.","St. John's College","St. John's College","Annapolis, MD",1989-08-11,"St. John's College owns the rights to this publication.",text,pdf,,"Commencement (St. John's College, Annapolis, MD)",,,English,GICommencementExercises1989,,,,,,,,,"2 pages",,,,,,,,,,paper,,,,,,,,,,,,,,,,,,,,,,,,,,"Commencement,Graduate Institute",https://s3.us-east-1.amazonaws.com/sjcdigitalarchives/original/3864a1ae0f7def193347c2d3276d1598.pdf,Text,"Commencement Programs and Addresses",1,0
709,https://digitalarchives.sjc.edu/items/show/709,"Commencement Program,  1990","Program for the one hundred ninety-eighth commencement in the two hundred ninety-fourth year of the college.","St. John's College","St. John's College","Annapolis, MD",1990-05-20,"St. John's College owns the rights to this publication.",text,pdf,,"Commencement (St. John's College, Annapolis, MD)",,,English,CommencementExercises1990,,,,,,,,,"14 pages",,,,,,,,,,paper,,,,,,,,,,,,,,,,,,,,,,,,,,Commencement,https://s3.us-east-1.amazonaws.com/sjcdigitalarchives/original/957a59b5720f9872de13a2c6bbbba2da.pdf,Text,"Commencement Programs and Addresses",1,0
726,https://digitalarchives.sjc.edu/items/show/726,"Graduate Institute Commencement Program,  1990","Program for the twelfth summer commencement of the Annapolis campus of the Graduate Institute.","St. John's College","St. John's College","Annapolis, MD",1990-08-10,"St. John's College owns the rights to this publication.",text,pdf,,"Commencement (St. John's College, Annapolis, MD)",,,English,GICommencementExercises1990,,,,,,,,,"3 pages",,,,,,,,,,paper,,,,,,,,,,,,,,,,,,,,,,,,,,"Commencement,Graduate Institute",https://s3.us-east-1.amazonaws.com/sjcdigitalarchives/original/5bd691b8f49f4a55caa52acd79b2ea96.pdf,Text,"Commencement Programs and Addresses",1,0
710,https://digitalarchives.sjc.edu/items/show/710,"Commencement Program,  1991","Program for the one hundred ninety-ninth commencement in the two hundred ninety-fifth year of the college.","St. John's College","St. John's College","Annapolis, MD",1991-05-19,"St. John's College owns the rights to this publication.",text,pdf,,"Commencement (St. John's College, Annapolis, MD)",,,English,CommencementExercises1991,,,,,,,,,"15 pages",,,,,,,,,,paper,,,,,,,,,,,,,,,,,,,,,,,,,,Commencement,https://s3.us-east-1.amazonaws.com/sjcdigitalarchives/original/22e84eee047e70618dbfea68ad3bc4de.pdf,Text,"Commencement Programs and Addresses",1,0
727,https://digitalarchives.sjc.edu/items/show/727,"Graduate Institute Commencement Program,  1991","Program for the thirteenth summer commencement of the Annapolis campus of the Graduate Institute.","St. John's College","St. John's College","Annapolis, MD",1991-08-09,"St. John's College owns the rights to this publication.",text,pdf,,"Commencement (St. John's College, Annapolis, MD)",,,English,GICommencementExercises1991,,,,,,,,,"2 pages",,,,,,,,,,paper,,,,,,,,,,,,,,,,,,,,,,,,,,"Commencement,Graduate Institute",https://s3.us-east-1.amazonaws.com/sjcdigitalarchives/original/633c13848bed012dff330f106797ca63.pdf,Text,"Commencement Programs and Addresses",1,0
711,https://digitalarchives.sjc.edu/items/show/711,"Commencement Program,  1992","Program for the two hundredth commencement in the two hundred ninety-sixth year of the college.","St. John's College","St. John's College","Annapolis, MD",1992-05-17,"St. John's College owns the rights to this publication.",text,pdf,,"Commencement (St. John's College, Annapolis, MD)",,,English,CommencementExercises1992,,,,,,,,,"15 pages",,,,,,,,,,paper,,,,,,,,,,,,,,,,,,,,,,,,,,Commencement,https://s3.us-east-1.amazonaws.com/sjcdigitalarchives/original/9374a0425bad6f9dd269323528e94b5f.pdf,Text,"Commencement Programs and Addresses",1,0
728,https://digitalarchives.sjc.edu/items/show/728,"Graduate Institute Commencement Program,  1992","Program for the fourteenth summer commencement of the Annapolis campus of the Graduate Institute.","St. John's College","St. John's College","Annapolis, MD",1992-08-07,"St. John's College owns the rights to this publication.",text,pdf,,"Commencement (St. John's College, Annapolis, MD)",,,English,GICommencementExercises1992,,,,,,,,,"2 pages",,,,,,,,,,paper,,,,,,,,,,,,,,,,,,,,,,,,,,"Commencement,Graduate Institute",https://s3.us-east-1.amazonaws.com/sjcdigitalarchives/original/4ebed76b568cdbb3143ce73d57484d7d.pdf,Text,"Commencement Programs and Addresses",1,0
