﻿"Item Id","Item URI","Dublin Core:Title","Dublin Core:Description","Dublin Core:Creator","Dublin Core:Publisher","Dublin Core:Coverage","Dublin Core:Date","Dublin Core:Rights","Dublin Core:Type","Dublin Core:Format","Dublin Core:Source","Dublin Core:Subject","Dublin Core:Contributor","Dublin Core:Relation","Dublin Core:Language","Dublin Core:Identifier","Item Type Metadata:Occupation","Item Type Metadata:Participants","Item Type Metadata:Death Date","Item Type Metadata:Birthplace","Item Type Metadata:Birth Date","Item Type Metadata:Interviewer","Item Type Metadata:Biographical Text","Item Type Metadata:Bibliography","Item Type Metadata:Page numeration","Item Type Metadata:Resolution","Item Type Metadata:Identifier","Item Type Metadata:Inventory","Item Type Metadata:URL","Item Type Metadata:Text","Item Type Metadata:Interviewee","Item Type Metadata:Location","Item Type Metadata:Transcription","Item Type Metadata:Local URL","Item Type Metadata:Original Format","Item Type Metadata:Physical Dimensions","Item Type Metadata:Duration","Item Type Metadata:Compression","Item Type Metadata:Producer","Item Type Metadata:Director","Item Type Metadata:Bit Rate/Frequency","Item Type Metadata:Email Body","Item Type Metadata:Event Type","Item Type Metadata:Lesson Plan Text","Item Type Metadata:Materials","Item Type Metadata:Objectives","Item Type Metadata:Standards","Item Type Metadata:Number of Attachments","Item Type Metadata:BCC","Item Type Metadata:CC","Item Type Metadata:To","Item Type Metadata:From","Item Type Metadata:Subject Line","Item Type Metadata:Time Summary","Item Type Metadata:Episode","Item Type Metadata:Season","Item Type Metadata:Episode Type","Item Type Metadata:Explicit","Item Type Metadata:Block","PDF Text:Text",tags,file,itemType,collection,public,featured
4696,https://digitalarchives.sjc.edu/items/show/4696,"Portrait of John S. Kieffer","1 photographic print : b&w","Bachrach, Fabian",,"Annapolis, MD","1950-1960 [circa]","St. John's College owns the rights to this photograph.","Still Image",jpeg,,"St. John's College (Annapolis, Md.). -- Presidents. ;  St. John's College (Annapolis, Md.). -- Deans. ;  St. John's College (Annapolis, Md.). -- Faculty. ;  Portraits ;  Kieffer, John Spangler.",,,,SJC-P-0773,,,,,,,,,,,,,,,,,,,Photograph,"12.5 x 18 cm.",,,,,,,,,,,,,,,,,,,,,,,,,"Deans,Honorary Alumni,Presidents,Tutors",https://s3.us-east-1.amazonaws.com/sjcdigitalarchives/original/d0553db44143e467c3d02f01775259cc.jpg,"Still Image","Photographic Archive—Annapolis",1,0
944,https://digitalarchives.sjc.edu/items/show/944,"Ford K. Brown and John S. Kieffer Seated at Formal Lecture ""Shakespeare and Chartres"" in the King William Room, St. John's College, Annapolis, Maryland","1 photographic print : b&w","Fox, Cecil H.",,"Annapolis, MD",1972-08-16,"St. John's College owns the rights to this photograph.","still image",jpeg,,"Brown, Ford Keeler. ;  Kieffer, John Spangler.",,,,SJC-P-0027,,,,,,,,,,"600 dpi",,,,,,,,,photograph,"20.5 x 25.5 cm.",,,,,,,,,,,,,,,,,,,,,,,,,"Deans,Tutors",https://s3.us-east-1.amazonaws.com/sjcdigitalarchives/original/83f65002ec0eeda6f322fe18437cbddd.jpg,"Still Image","Photographic Archive—Annapolis",1,1
945,https://digitalarchives.sjc.edu/items/show/945,"Ford K. Brown and John S. Kieffer Seated at Formal Lecture ""Shakespeare and Chartres"" in the King William Room, St. John's College, Annapolis, Maryland","1 photographic print : b&w","Fox, Cecil H.",,"Annapolis, MD",1972-08-16,"St. John's College owns the rights to this photograph.","still image",jpeg,,"Brown, Ford Keeler. ;  Kieffer, John Spangler.",,,,SJC-P-0028,,,,,,,,,,"600 dpi",,,,,,,,,photograph,"20.5 x 25.5 cm.",,,,,,,,,,,,,,,,,,,,,,,,,"Deans,Tutors",https://s3.us-east-1.amazonaws.com/sjcdigitalarchives/original/9559aa064069d6745795a127e61a5d63.jpg,"Still Image","Photographic Archive—Annapolis",1,1
1020,https://digitalarchives.sjc.edu/items/show/1020,"Stringfellow Barr, Seated, with John S. Kieffer Standing behind him after  Stingfellow Barr's Lecture ""The Beginning of the St. John's Program"" in the King William Room, St. John's College, Annapolis, Maryland","1 photographic print : b&w","Fox, Cecil H.",,"Annapolis, MD",1972-07,"St. John's College owns the rights to this photograph.","still image",jpeg,,"St. John's College (Annapolis, Md.). -- Friday night lecture series ;  July 1972 ;  St. John's College (Annapolis, Md.). -- Presidents. ;  St. John's College (Annapolis, Md.). -- Faculty. ;  Lectures and Lecturing; Barr, Stringfellow, 1897- ;  Kieffer, John Spangler.",,,,SJC-P-0067,,,,,,,,,,,,,,,,,,,photograph,"24.5 x 19.5 cm.",,,,,,,,,,,,,,,,,,,,,,,,,"Deans,Honorary Alumni,Presidents,Tutors",https://s3.us-east-1.amazonaws.com/sjcdigitalarchives/original/733d925ca3b76951ff3245e6a1f00cee.jpg,"Still Image","Photographic Archive—Annapolis",1,1
2649,https://digitalarchives.sjc.edu/items/show/2649,"Inauguration of John Spangler Kieffer - Governor William Preston Lane, John S. Kieffer and Richard F. Cleveland at Inauguration","1 photographic print : b&w","Official U.S. Navy Photograph",,"Annapolis, MD",1947-10-25,,"still image",jpeg,,"Lane, William Preston;  Cleveland, Richard F.;  Kieffer, John Spangler.",,"<a title=""Inauguration Program"" href=""http://digitalarchives.sjc.edu/items/show/1324"">Inauguration Program</a>",,SJC-P-1074,,,,,,,,,,,,,,,,,,,photograph,"25.5 x 20.5 cm.",,,,,,,,,,,,,,,,,,,,,,,,,"Deans,Honorary Alumni,Inauguration,Presidents",https://s3.us-east-1.amazonaws.com/sjcdigitalarchives/original/f54a8bfd76630d209f090e784603af87.jpg,"Still Image","Photographic Archive—Annapolis",1,1
4500,https://digitalarchives.sjc.edu/items/show/4500,"John S. Kieffer, William Kyle Smith, Richard Scofield and Students at a Senior Oral in McDowell Hall, St. John's College, Annapolis, Maryland","1 photographic print : b&w",Unknown,,"Annapolis, MD","1937-1950 [circa]","St. John's College owns the rights to this photograph.","Still Image",jpeg,,"Senior Orals (St. John's College, Annapolis, MD) ;  St. John's College (Annapolis, Md.). -- Presidents. ;  St. John's College (Annapolis, Md.). -- Deans. ;  St. John's College (Annapolis, Md.). -- Faculty. ;  Kieffer, John Spangler. ;  Smith, William Kyle. ;  Scofield, Richard 1898-1970.",,,,SJC-P-0505,,,,,,,,,,,,,,,,,,,Photograph,"12.5 x 10 cm.",,,,,,,,,,,,,,,,,,,,,,,,,"Alumni,Deans,Presidents,Tutors",https://s3.us-east-1.amazonaws.com/sjcdigitalarchives/original/7b4e20bca723018b0834d98e1ed84c7b.jpg,"Still Image","Photographic Archive—Annapolis",1,0
4607,https://digitalarchives.sjc.edu/items/show/4607,"John S. Kieffer Seated outside on Balcony with Mountains in the Distance","1 photographic print : color",Unknown,,"Annapolis, MD",1985-05,"St. John's College owns the rights to this photograph.","still image",jpeg,,"St. John's College (Annapolis, Md.). -- Presidents. ;  St. John's College (Annapolis, Md.). -- Deans. ;  St. John's College (Annapolis, Md.). -- Faculty. ;  Kieffer, John Spangler.",,,,SJC-P-0624,,,,,,,,,,,,,,,,,,,Photograph,"9 x 12.5 cm.",,,,,,,,,,,,,,,,,,,,,,,,,"Deans,Honorary Alumni,Presidents,Tutors",https://s3.us-east-1.amazonaws.com/sjcdigitalarchives/original/ce508e3013dd37221ea8aab69f1a0715.jpg,"Still Image","Photographic Archive—Annapolis",1,0
4608,https://digitalarchives.sjc.edu/items/show/4608,"John S. Kieffer Seated Talking to a Young Boy","1 photographic print : color",Unknown,,"Annapolis, MD",1985-05,"St. John's College owns the rights to this photograph.","still image",jpeg,,"St. John's College (Annapolis, Md.). -- Presidents. ;  St. John's College (Annapolis, Md.). -- Deans. ;  St. John's College (Annapolis, Md.). -- Faculty. ;  Kieffer, John Spangler.",,,,SJC-P-0625,,,,,,,,,,,,,,,,,,,Photograph,"12.5 x 9 cm.",,,,,,,,,,,,,,,,,,,,,,,,,"Deans,Honorary Alumni,Presidents,Tutors",https://s3.us-east-1.amazonaws.com/sjcdigitalarchives/original/08948c9a9f8647ba466d93dcb59d5c33.jpg,"Still Image","Photographic Archive—Annapolis",1,0
4694,https://digitalarchives.sjc.edu/items/show/4694,"Portrait of John S. Kieffer","1 photographic print : b&w",Unknown,,"Annapolis, MD","1950-1960 [circa]","St. John's College owns the rights to this photograph.","Still Image",jpeg,,"St. John's College (Annapolis, Md.). -- Presidents. ;  St. John's College (Annapolis, Md.). -- Deans. ;  St. John's College (Annapolis, Md.). -- Faculty. ;  Portraits ;  Kieffer, John Spangler.",,,,SJC-P-0771,,,,,,,,,,,,,,,,,,,Photograph,"12.5 x 18 cm.",,,,,,,,,,,,,,,,,,,,,,,,,"Deans,Honorary Alumni,Presidents,Tutors",https://s3.us-east-1.amazonaws.com/sjcdigitalarchives/original/63b5ddb4b1fdeea920cec0b7ee5952bb.jpg,"Still Image","Photographic Archive—Annapolis",1,0
4695,https://digitalarchives.sjc.edu/items/show/4695,"John S. Kieffer, outside on Campus, Shaking Hands with a Man while another Man Looks on, St. John's College, Annapolis, Maryland","1 photographic print : b&w",Unknown,,"Annapolis, MD","1950-1960 [circa]","St. John's College owns the rights to this photograph.","Still Image",jpeg,,"St. John's College (Annapolis, Md.). -- Presidents. ;  St. John's College (Annapolis, Md.). -- Deans. ;  St. John's College (Annapolis, Md.). -- Faculty. ;  Kieffer, John Spangler.",,,,SJC-P-0772,,,,,,,,,,,,,,,,,,,Photograph,"18 x 12.5 cm.",,,,,,,,,,,,,,,,,,,,,,,,,"Deans,Honorary Alumni,Presidents,Tutors",https://s3.us-east-1.amazonaws.com/sjcdigitalarchives/original/8c95f44c00277aa04ca89431eb3f9768.jpg,"Still Image","Photographic Archive—Annapolis",1,0
4697,https://digitalarchives.sjc.edu/items/show/4697,"Portrait of John S. Kieffer Holding a Pair of Eyeglasses","1 photographic print : b&w",Unknown,,"Annapolis, MD","1950-1960 [circa]","St. John's College owns the rights to this photograph.","Still Image",jpeg,,"St. John's College (Annapolis, Md.). -- Presidents. ;  St. John's College (Annapolis, Md.). -- Deans. ;  St. John's College (Annapolis, Md.). -- Faculty. ;  Portraits ;  Kieffer, John Spangler.",,,,SJC-P-0774,,,,,,,,,,,,,,,,,,,Photograph,"12.5 x 18 cm.",,,,,,,,,,,,,,,,,,,,,,,,,"Deans,Honorary Alumni,Presidents,Tutors",https://s3.us-east-1.amazonaws.com/sjcdigitalarchives/original/c44ebf4e81b01edca7b7123cac65e523.jpg,"Still Image","Photographic Archive—Annapolis",1,0
4698,https://digitalarchives.sjc.edu/items/show/4698,"Portrait of John S. Kieffer","1 photographic print : b&w",Unknown,,"Annapolis, MD","1940-1950 [circa]","St. John's College owns the rights to this photograph.","Still Image",jpeg,,"St. John's College (Annapolis, Md.). -- Presidents. ;  St. John's College (Annapolis, Md.). -- Deans. ;  St. John's College (Annapolis, Md.). -- Faculty. ;  Portraits ;  Kieffer, John Spangler.",,,,SJC-P-0775,,,,,,,,,,,,,,,,,,,Photograph,"12.5 x 18 cm.",,,,,,,,,,,,,,,,,,,,,,,,,"Deans,Honorary Alumni,Presidents,Tutors",https://s3.us-east-1.amazonaws.com/sjcdigitalarchives/original/12a1e979de1a7615b99eb89237e682f2.jpg,"Still Image","Photographic Archive—Annapolis",1,0
4699,https://digitalarchives.sjc.edu/items/show/4699,"Portrait of John S. Kieffer Seated and Working at Desk","1 photographic print : b&w",Unknown,,"Annapolis, MD","1940-1950 [circa]","St. John's College owns the rights to this photograph.","Still Image",jpeg,,"St. John's College (Annapolis, Md.). -- Presidents. ;  St. John's College (Annapolis, Md.). -- Deans. ;  St. John's College (Annapolis, Md.). -- Faculty. ;  Portraits ;  Kieffer, John Spangler.",,,,SJC-P-0776,,,,,,,,,,,,,,,,,,,Photograph,"12.5 x 18 cm.",,,,,,,,,,,,,,,,,,,,,,,,,"Deans,Honorary Alumni,Presidents,Tutors",https://s3.us-east-1.amazonaws.com/sjcdigitalarchives/original/571603333bcec68ecff32958cc09e18e.jpg,"Still Image","Photographic Archive—Annapolis",1,0
4700,https://digitalarchives.sjc.edu/items/show/4700,"John S. Kieffer at a Celebration in the Francis Scott Key Lobby in Mellon Hall, St. John's College, Annapolis, Maryland","1 photographic print : b&w",Unknown,,"Annapolis, MD","1960-1970 [circa]","St. John's College owns the rights to this photograph.","Still Image",jpeg,,"St. John's College (Annapolis, Md.). -- Presidents. ;  St. John's College (Annapolis, Md.). -- Deans. ;  St. John's College (Annapolis, Md.). -- Faculty. ;  Portraits ;  Kieffer, John Spangler.",,,,SJC-P-0777,,,,,,,,,,,,,,,,,,,Photograph,"12.5 x 18 cm.",,,,,,,,,,,,,,,,,,,,,,,,,"Deans,Honorary Alumni,Mellon Hall,Presidents,Tutors",https://s3.us-east-1.amazonaws.com/sjcdigitalarchives/original/38ae2bdbc9b3cd52d46bbf6dab307cc5.jpg,"Still Image","Photographic Archive—Annapolis",1,0
4701,https://digitalarchives.sjc.edu/items/show/4701,"John S. Kieffer Holding Pamphlets","1 photographic print : b&w",Unknown,,"Annapolis, MD","1960-1970 [circa]","St. John's College owns the rights to this photograph.","Still Image",jpeg,,"St. John's College (Annapolis, Md.). -- Presidents. ;  St. John's College (Annapolis, Md.). -- Deans. ;  St. John's College (Annapolis, Md.). -- Faculty. ;  Portraits ;  Kieffer, John Spangler.",,,,SJC-P-0778,,,,,,,,,,,,,,,,,,,Photograph,"12.5 x 18 cm.",,,,,,,,,,,,,,,,,,,,,,,,,"Deans,Honorary Alumni,Presidents,Tutors",https://s3.us-east-1.amazonaws.com/sjcdigitalarchives/original/f4222ba3b213c9202dca38523bed1b14.jpg,"Still Image","Photographic Archive—Annapolis",1,0
4702,https://digitalarchives.sjc.edu/items/show/4702,"Portrait of John S. Kieffer Seated at His Desk","1 photographic print : color",Unknown,,"Annapolis, MD",1985-05,"St. John's College owns the rights to this photograph.","Still Image",jpeg,,"St. John's College (Annapolis, Md.). -- Presidents. ;  St. John's College (Annapolis, Md.). -- Deans. ;  St. John's College (Annapolis, Md.). -- Faculty. ;  Portraits ;  Kieffer, John Spangler.",,,,SJC-P-0779,,,,,,,,,,,,,,,,,,,Photograph,"12.5 x 18 cm.",,,,,,,,,,,,,,,,,,,,,,,,,"Deans,Honorary Alumni,Presidents,Tutors",https://s3.us-east-1.amazonaws.com/sjcdigitalarchives/original/11b14a33fd7d32cba868963a2ac8fe2f.jpg,"Still Image","Photographic Archive—Annapolis",1,0
4703,https://digitalarchives.sjc.edu/items/show/4703,"Portrait of John S. Kieffer","1 photographic print : color",Unknown,,"Annapolis, MD",1985-05,"St. John's College owns the rights to this photograph.","Still Image",jpeg,,"St. John's College (Annapolis, Md.). -- Presidents. ;  St. John's College (Annapolis, Md.). -- Deans. ;  St. John's College (Annapolis, Md.). -- Faculty. ;  Portraits ;  Kieffer, John Spangler.",,,,SJC-P-0780,,,,,,,,,,,,,,,,,,,Photograph,"12.5 x 18 cm.",,,,,,,,,,,,,,,,,,,,,,,,,"Deans,Honorary Alumni,Presidents,Tutors",https://s3.us-east-1.amazonaws.com/sjcdigitalarchives/original/fda5cb5c987c7cd764802eb1fdfdcbe3.jpg,"Still Image","Photographic Archive—Annapolis",1,0
